log for app.organicmaps:22061802

Traceback (most recent call last):
  File "/home/fbuild/fdroidserver/fdroidserver/build.py", line 1128, in main
    options.onserver, options.refresh):
  File "/home/fbuild/fdroidserver/fdroidserver/build.py", line 887, in trybuild
    build_server(app, build, vcs, build_dir, output_dir, log_dir, force)
  File "/home/fbuild/fdroidserver/fdroidserver/build.py", line 270, in build_server
    str(output, 'utf-8'))
fdroidserver.exception.BuildException: Build.py failed on server for app.organicmaps:2022.06.18-2-FDroid
==== detail begin ====
== Installed Android Tools ==

2022-06-22 02:13:24,678 DEBUG: Reading 'config.yml'
2022-06-22 02:13:24,846 INFO: Using /opt/android-sdk/build-tools/29.0.3/apksigner 
2022-06-22 02:13:24,891 INFO: Creating log directory
2022-06-22 02:13:24,892 INFO: Creating temporary directory
2022-06-22 02:13:24,892 INFO: Creating output directory
2022-06-22 02:13:24,943 DEBUG: Getting git vcs interface for https://github.com/organicmaps/organicmaps
2022-06-22 02:13:24,944 DEBUG: > git --version
git version 2.11.0
2022-06-22 02:13:25,172 INFO: Using git version 2.11.0
2022-06-22 02:13:25,173 DEBUG: Checking 2022.06.18-2-FDroid
2022-06-22 02:13:25,173 INFO: Building version 2022.06.18-2-FDroid (22061802) of app.organicmaps
2022-06-22 02:13:25,174 INFO: Running 'sudo' commands in /home/vagrant
2022-06-22 02:13:25,174 DEBUG: > sudo DEBIAN_FRONTEND=noninteractive bash -x -c apt-get update || apt-get update && apt-get install -y g++ openjdk-11-jdk-headless && update-alternatives --auto java
+ apt-get update
Hit:1 http://security.debian.org/debian-security stretch/updates InRelease
Ign:2 http://deb.debian.org/debian stretch InRelease
Hit:3 http://deb.debian.org/debian stretch-updates InRelease
Get:4 http://deb.debian.org/debian stretch-backports-sloppy InRelease [46.7 kB]
Get:5 http://deb.debian.org/debian stretch-backports InRelease [91.8 kB]
Get:6 http://deb.debian.org/debian testing InRelease [130 kB]
Hit:7 http://deb.debian.org/debian stretch Release
Get:8 http://deb.debian.org/debian testing/main i386 Packages.diff/Index [63.6 kB]
Get:10 http://deb.debian.org/debian testing/main amd64 Packages.diff/Index [63.6 kB]
Get:11 http://deb.debian.org/debian testing/main Translation-en.diff/Index [63.6 kB]
Get:12 http://deb.debian.org/debian testing/main i386 Packages T-2022-06-21-1409.50-F-2022-06-21-1409.50.pdiff [231 B]
Get:13 http://deb.debian.org/debian testing/main amd64 Packages T-2022-06-21-1409.50-F-2022-06-21-1409.50.pdiff [231 B]
Get:12 http://deb.debian.org/debian testing/main i386 Packages T-2022-06-21-1409.50-F-2022-06-21-1409.50.pdiff [231 B]
Get:13 http://deb.debian.org/debian testing/main amd64 Packages T-2022-06-21-1409.50-F-2022-06-21-1409.50.pdiff [231 B]
Get:14 http://deb.debian.org/debian testing/main Translation-en T-2022-06-21-1409.50-F-2022-06-21-1409.50.pdiff [46 B]
Get:14 http://deb.debian.org/debian testing/main Translation-en T-2022-06-21-1409.50-F-2022-06-21-1409.50.pdiff [46 B]
Fetched 459 kB in 5s (84.2 kB/s)
Reading package lists...
+ apt-get install -y g++ openjdk-11-jdk-headless
Reading package lists...
Building dependency tree...
Reading state information...
The following additional packages will be installed:
  g++-6 libasound2 libasound2-data libstdc++-6-dev openjdk-11-jre-headless
Suggested packages:
  g++-multilib g++-6-multilib gcc-6-doc libstdc++6-6-dbg libasound2-plugins
  alsa-utils libstdc++-6-doc openjdk-11-demo openjdk-11-source libnss-mdns
  fonts-dejavu-extra fonts-ipafont-gothic fonts-ipafont-mincho
  fonts-wqy-microhei | fonts-wqy-zenhei fonts-indic
The following NEW packages will be installed:
  g++ g++-6 libasound2 libasound2-data libstdc++-6-dev openjdk-11-jdk-headless
  openjdk-11-jre-headless
0 upgraded, 7 newly installed, 0 to remove and 2 not upgraded.
Need to get 238 MB of archives.
After this operation, 413 MB of additional disk space will be used.
Get:1 http://deb.debian.org/debian stretch/main amd64 libstdc++-6-dev amd64 6.3.0-18+deb9u1 [1,420 kB]
Get:2 http://deb.debian.org/debian stretch/main amd64 g++-6 amd64 6.3.0-18+deb9u1 [7,094 kB]
Get:3 http://deb.debian.org/debian stretch/main amd64 g++ amd64 4:6.3.0-4 [1,546 B]
Get:4 http://deb.debian.org/debian stretch/main amd64 libasound2-data all 1.1.3-5 [173 kB]
Get:5 http://deb.debian.org/debian stretch/main amd64 libasound2 amd64 1.1.3-5 [497 kB]
Get:6 http://deb.debian.org/debian stretch-backports/main amd64 openjdk-11-jre-headless amd64 11.0.6+10-1~bpo9+1 [37.4 MB]
Get:7 http://deb.debian.org/debian stretch-backports/main amd64 openjdk-11-jdk-headless amd64 11.0.6+10-1~bpo9+1 [192 MB]
Fetched 238 MB in 2s (85.9 MB/s)
Selecting previously unselected package libstdc++-6-dev:amd64.
(Reading database ... 65038 files and directories currently installed.)
Preparing to unpack .../0-libstdc++-6-dev_6.3.0-18+deb9u1_amd64.deb ...
Unpacking libstdc++-6-dev:amd64 (6.3.0-18+deb9u1) ...
Selecting previously unselected package g++-6.
Preparing to unpack .../1-g++-6_6.3.0-18+deb9u1_amd64.deb ...
Unpacking g++-6 (6.3.0-18+deb9u1) ...
Selecting previously unselected package g++.
Preparing to unpack .../2-g++_4%3a6.3.0-4_amd64.deb ...
Unpacking g++ (4:6.3.0-4) ...
Selecting previously unselected package libasound2-data.
Preparing to unpack .../3-libasound2-data_1.1.3-5_all.deb ...
Unpacking libasound2-data (1.1.3-5) ...
Selecting previously unselected package libasound2:amd64.
Preparing to unpack .../4-libasound2_1.1.3-5_amd64.deb ...
Unpacking libasound2:amd64 (1.1.3-5) ...
Selecting previously unselected package openjdk-11-jre-headless:amd64.
Preparing to unpack .../5-openjdk-11-jre-headless_11.0.6+10-1~bpo9+1_amd64.deb ...
Unpacking openjdk-11-jre-headless:amd64 (11.0.6+10-1~bpo9+1) ...
Selecting previously unselected package openjdk-11-jdk-headless:amd64.
Preparing to unpack .../6-openjdk-11-jdk-headless_11.0.6+10-1~bpo9+1_amd64.deb ...
Unpacking openjdk-11-jdk-headless:amd64 (11.0.6+10-1~bpo9+1) ...
Setting up libstdc++-6-dev:amd64 (6.3.0-18+deb9u1) ...
Setting up libasound2-data (1.1.3-5) ...
Setting up libasound2:amd64 (1.1.3-5) ...
Setting up g++-6 (6.3.0-18+deb9u1) ...
Processing triggers for libc-bin (2.24-11+deb9u4) ...
Setting up g++ (4:6.3.0-4) ...
update-alternatives: using /usr/bin/g++ to provide /usr/bin/c++ (c++) in auto mode
Setting up openjdk-11-jre-headless:amd64 (11.0.6+10-1~bpo9+1) ...
Setting up openjdk-11-jdk-headless:amd64 (11.0.6+10-1~bpo9+1) ...
update-alternatives: using /usr/lib/jvm/java-11-openjdk-amd64/bin/jdeprscan to provide /usr/bin/jdeprscan (jdeprscan) in auto mode
update-alternatives: using /usr/lib/jvm/java-11-openjdk-amd64/bin/jimage to provide /usr/bin/jimage (jimage) in auto mode
update-alternatives: using /usr/lib/jvm/java-11-openjdk-amd64/bin/jlink to provide /usr/bin/jlink (jlink) in auto mode
update-alternatives: using /usr/lib/jvm/java-11-openjdk-amd64/bin/jmod to provide /usr/bin/jmod (jmod) in auto mode
update-alternatives: using /usr/lib/jvm/java-11-openjdk-amd64/bin/jshell to provide /usr/bin/jshell (jshell) in auto mode
update-alternatives: using /usr/lib/jvm/java-11-openjdk-amd64/bin/jaotc to provide /usr/bin/jaotc (jaotc) in auto mode
update-alternatives: using /usr/lib/jvm/java-11-openjdk-amd64/bin/jhsdb to provide /usr/bin/jhsdb (jhsdb) in auto mode
+ update-alternatives --auto java
update-alternatives: using /usr/lib/jvm/java-11-openjdk-amd64/bin/java to provide /usr/bin/java (java) in auto mode
2022-06-22 02:14:03,894 DEBUG: > sudo passwd --lock root
passwd: password expiry information changed.
2022-06-22 02:14:06,534 DEBUG: > sudo SUDO_FORCE_REMOVE=yes dpkg --purge sudo
(Reading database ... 66511 files and directories currently installed.)
Removing sudo (1.8.19p1-2.1+deb9u3) ...
Purging configuration files for sudo (1.8.19p1-2.1+deb9u3) ...
Processing triggers for systemd (232-25+deb9u13) ...
2022-06-22 02:14:50,001 INFO: Getting source for revision b852ac84f929d3d31f8617d84879d342aefd0b71
2022-06-22 02:14:50,002 DEBUG: Directory: build/app.organicmaps
2022-06-22 02:14:50,002 DEBUG: > git rev-parse --show-toplevel
2022-06-22 02:14:50,211 DEBUG: Directory: build/app.organicmaps
2022-06-22 02:14:50,212 DEBUG: > git submodule foreach --recursive git reset --hard
2022-06-22 02:15:01,916 DEBUG: Directory: build/app.organicmaps
2022-06-22 02:15:01,917 DEBUG: > git reset --hard
2022-06-22 02:15:05,009 DEBUG: Directory: build/app.organicmaps
2022-06-22 02:15:05,009 DEBUG: > git submodule foreach --recursive git clean -dffx
2022-06-22 02:15:08,873 DEBUG: Directory: build/app.organicmaps
2022-06-22 02:15:08,873 DEBUG: > git clean -dffx
2022-06-22 02:15:08,997 DEBUG: Directory: build/app.organicmaps
2022-06-22 02:15:08,997 DEBUG: > git -c core.askpass=/bin/true -c core.sshCommand=/bin/false -c url.https://.insteadOf=ssh:// -c url.https://u:p@bitbucket.org/.insteadOf=git@bitbucket.org: -c url.https://u:p@bitbucket.org.insteadOf=git://bitbucket.org -c url.https://u:p@bitbucket.org.insteadOf=https://bitbucket.org -c url.https://u:p@github.com/.insteadOf=git@github.com: -c url.https://u:p@github.com.insteadOf=git://github.com -c url.https://u:p@github.com.insteadOf=https://github.com -c url.https://u:p@gitlab.com/.insteadOf=git@gitlab.com: -c url.https://u:p@gitlab.com.insteadOf=git://gitlab.com -c url.https://u:p@gitlab.com.insteadOf=https://gitlab.com fetch origin
2022-06-22 02:15:11,421 DEBUG: Directory: build/app.organicmaps
2022-06-22 02:15:11,421 DEBUG: > git -c core.askpass=/bin/true -c core.sshCommand=/bin/false -c url.https://.insteadOf=ssh:// -c url.https://u:p@bitbucket.org/.insteadOf=git@bitbucket.org: -c url.https://u:p@bitbucket.org.insteadOf=git://bitbucket.org -c url.https://u:p@bitbucket.org.insteadOf=https://bitbucket.org -c url.https://u:p@github.com/.insteadOf=git@github.com: -c url.https://u:p@github.com.insteadOf=git://github.com -c url.https://u:p@github.com.insteadOf=https://github.com -c url.https://u:p@gitlab.com/.insteadOf=git@gitlab.com: -c url.https://u:p@gitlab.com.insteadOf=git://gitlab.com -c url.https://u:p@gitlab.com.insteadOf=https://gitlab.com remote prune origin
2022-06-22 02:15:11,728 DEBUG: Directory: build/app.organicmaps
2022-06-22 02:15:11,729 DEBUG: > git -c core.askpass=/bin/true -c core.sshCommand=/bin/false -c url.https://.insteadOf=ssh:// -c url.https://u:p@bitbucket.org/.insteadOf=git@bitbucket.org: -c url.https://u:p@bitbucket.org.insteadOf=git://bitbucket.org -c url.https://u:p@bitbucket.org.insteadOf=https://bitbucket.org -c url.https://u:p@github.com/.insteadOf=git@github.com: -c url.https://u:p@github.com.insteadOf=git://github.com -c url.https://u:p@github.com.insteadOf=https://github.com -c url.https://u:p@gitlab.com/.insteadOf=git@gitlab.com: -c url.https://u:p@gitlab.com.insteadOf=git://gitlab.com -c url.https://u:p@gitlab.com.insteadOf=https://gitlab.com fetch --prune --tags --force origin
2022-06-22 02:15:12,036 DEBUG: Directory: build/app.organicmaps
2022-06-22 02:15:12,036 DEBUG: > git remote set-head origin --auto
2022-06-22 02:15:12,444 DEBUG: Directory: build/app.organicmaps
2022-06-22 02:15:12,444 DEBUG: > git checkout -f b852ac84f929d3d31f8617d84879d342aefd0b71
2022-06-22 02:15:13,888 DEBUG: Directory: build/app.organicmaps
2022-06-22 02:15:13,888 DEBUG: > git clean -dffx
2022-06-22 02:15:13,998 INFO: Initialising submodules
2022-06-22 02:15:13,999 DEBUG: Directory: build/app.organicmaps
2022-06-22 02:15:13,999 DEBUG: > git rev-parse --show-toplevel
2022-06-22 02:15:14,220 DEBUG: Directory: build/app.organicmaps
2022-06-22 02:15:14,221 DEBUG: > git submodule sync
2022-06-22 02:15:14,829 DEBUG: Directory: build/app.organicmaps
2022-06-22 02:15:14,829 DEBUG: > git -c core.askpass=/bin/true -c core.sshCommand=/bin/false -c url.https://.insteadOf=ssh:// -c url.https://u:p@bitbucket.org/.insteadOf=git@bitbucket.org: -c url.https://u:p@bitbucket.org.insteadOf=git://bitbucket.org -c url.https://u:p@bitbucket.org.insteadOf=https://bitbucket.org -c url.https://u:p@github.com/.insteadOf=git@github.com: -c url.https://u:p@github.com.insteadOf=git://github.com -c url.https://u:p@github.com.insteadOf=https://github.com -c url.https://u:p@gitlab.com/.insteadOf=git@gitlab.com: -c url.https://u:p@gitlab.com.insteadOf=git://gitlab.com -c url.https://u:p@gitlab.com.insteadOf=https://gitlab.com submodule update --init --force --recursive
Submodule path '3party/Vulkan-Headers': checked out '83e1a9ed8ce289cebb1c02c8167d663dc1befb24'
Submodule path '3party/boost': checked out 'ecdd60e74c0d43b9710d05f56967b1a01d7c9518'
Submodule path '3party/boost/libs/accumulators': checked out '4df0de9b47ef1415a7ccf0310250d6e15e132537'
Submodule path '3party/boost/libs/algorithm': checked out '3b3bd8d3db43915c74d574ff36b4d945b6fc7917'
Submodule path '3party/boost/libs/align': checked out 'bef21416a3bbd46f3f5de4f9254bf4c46ec752fe'
Submodule path '3party/boost/libs/any': checked out '06eaa82dbfb6bc3e3842f9c1e1c8151f4858f56a'
Submodule path '3party/boost/libs/array': checked out '63f83dc350b654172ad04cc719daea0f3643f83c'
Submodule path '3party/boost/libs/asio': checked out '84b8aec1aaf70ba2d8029de491fac44fdeb4d668'
Submodule path '3party/boost/libs/assert': checked out '78f28be697b0bd11fe11dc5e75b6d0ec66323aff'
Submodule path '3party/boost/libs/assign': checked out '058d07720ceff6bd6c4321cb967a27869a5af3a0'
Submodule path '3party/boost/libs/atomic': checked out 'b1cd90dceca820bcffab779dda2b8cf30dc6c18e'
Submodule path '3party/boost/libs/beast': checked out '17141a331ad4943e76933e4db51ef48a170aaf84'
Submodule path '3party/boost/libs/bimap': checked out '85f0f02537d71794a415ef4b992629b2edebfbff'
Submodule path '3party/boost/libs/bind': checked out 'edc56d844225106a13334fefb2bfcbbfdb8e8d84'
Submodule path '3party/boost/libs/callable_traits': checked out '2a56a3a2496cdb66496f844db55085dd992d5e49'
Submodule path '3party/boost/libs/chrono': checked out '5885f9ef0e02b2be1730380c99b2cde3d03cdcd1'
Submodule path '3party/boost/libs/circular_buffer': checked out 'd4fbf446b903fb6651b56bbd5931a9b902ef962c'
Submodule path '3party/boost/libs/compatibility': checked out '47ce71af6b018764c9ba74c0bfcb4f3151b81aa7'
Submodule path '3party/boost/libs/compute': checked out '36350b7de849300bd3d72a05d8bf890ca405a014'
Submodule path '3party/boost/libs/concept_check': checked out '5656ffe0ac76ad58fbaff45baff20c39924a1278'
Submodule path '3party/boost/libs/config': checked out 'c11afa5ffa7c8612cf8ae32ed65be3b2863153a9'
Submodule path '3party/boost/libs/container': checked out 'f5b2c7ba743f17ac5dd75f552cd9271397a13f2a'
Submodule path '3party/boost/libs/container_hash': checked out 'd2986d9a64c2bb74513dad8874136064d262423b'
Submodule path '3party/boost/libs/context': checked out 'fb8cda1274b0e73e5ad1a9adaa4127bc2a2141b4'
Submodule path '3party/boost/libs/contract': checked out 'eca93d24b5d3bb909ed64c12b5feb5296c5cc070'
Submodule path '3party/boost/libs/conversion': checked out '4ae8b4d49547126264f0b80c528fcfd26cdf5e7d'
Submodule path '3party/boost/libs/convert': checked out '39536706e40d025713f96773fbb8fbd41ac06bb8'
Submodule path '3party/boost/libs/core': checked out 'c0e2211c2b12a618c414b5114a25351f81a9edf8'
Submodule path '3party/boost/libs/coroutine': checked out '1e1347c0b1910b9310ec1719edad8b0bf2fd03c8'
Submodule path '3party/boost/libs/coroutine2': checked out 'd7e1c1c4abcf8c1e90097279e485edea0b253a80'
Submodule path '3party/boost/libs/crc': checked out '96daae9fcdf965298077ed12a9304ea24713bb40'
Submodule path '3party/boost/libs/date_time': checked out 'f972dc96567777642652a18e802a9e94cf225b75'
Submodule path '3party/boost/libs/describe': checked out '574c1736a3eaa629cf33db763f4eb3fc867f823a'
Submodule path '3party/boost/libs/detail': checked out '8c603a1894ec1d8abc7a0a538297923b0ac98b33'
Submodule path '3party/boost/libs/dll': checked out '9f9471cc3351273d73c2cd7328d37010f5708115'
Submodule path '3party/boost/libs/dynamic_bitset': checked out 'abd641709012afffdac5a9d4887913a06e840508'
Submodule path '3party/boost/libs/endian': checked out '141af01ead8e0c4a9b0d03b0c808426c1e560b76'
Submodule path '3party/boost/libs/exception': checked out '54f2228f78dae86335558e67cbec496693907bfc'
Submodule path '3party/boost/libs/fiber': checked out 'db44baba883b8da4dd5c03f6d6248f50be61840a'
Submodule path '3party/boost/libs/filesystem': checked out '11b28f0ec0b4f6506a2c54f9d72703d0d0dc33ac'
Submodule path '3party/boost/libs/flyweight': checked out 'af4fd3e8eb532099cec51bb6f199029b65e7998d'
Submodule path '3party/boost/libs/foreach': checked out 'cc2f75ae30492b9de69b3b692f5c59afcb7dea5e'
Submodule path '3party/boost/libs/format': checked out '9735aeda098148104b6c0b5189115479aff92b80'
Submodule path '3party/boost/libs/function': checked out '5e1a4f49aa2ebca7a02d353d6f98d7c45d3fc95c'
Submodule path '3party/boost/libs/function_types': checked out '895335874d67987ada0d8bf6ca1725e70642ed49'
Submodule path '3party/boost/libs/functional': checked out '075c2e089a50d6a2f566d0415c62aa9a6e09f765'
Submodule path '3party/boost/libs/fusion': checked out '500e4c120ff2f2414ec225a2a42eb1a665c79956'
Submodule path '3party/boost/libs/geometry': checked out '3bc0d6a83b8c48252c22d728bbf87d2f5fc386ef'
Submodule path '3party/boost/libs/gil': checked out '616cf28e87618663fe57112f77e2b3f5b6bb23b8'
Submodule path '3party/boost/libs/graph': checked out 'c583bfa197ba324806dfb10db99c76daa8ff2fd0'
Submodule path '3party/boost/libs/graph_parallel': checked out '476623e72b93faaf11888ad7c70a1bd301618858'
Submodule path '3party/boost/libs/hana': checked out '998033e9dba8c82e3c9496c274a3ad1acf4a2f36'
Submodule path '3party/boost/libs/headers': checked out '017c3cd1338b5437f28506cd14119b7dcfb1a86d'
Submodule path '3party/boost/libs/heap': checked out 'dc2f19f8815cbe0654df61bfc5f31ad8b06fc883'
Submodule path '3party/boost/libs/histogram': checked out 'd736aab212091864d3624a6d6c3a1f127145fdb7'
Submodule path '3party/boost/libs/hof': checked out '0a28586156eb6cc7db1fbe74ae2a220daf40df14'
Submodule path '3party/boost/libs/icl': checked out 'e6c06ddee1e2320f11c4ec5cd2661c4abe9bca53'
Submodule path '3party/boost/libs/integer': checked out '49195acf608190f6a1cf43bce3b472e6fadce0a2'
Submodule path '3party/boost/libs/interprocess': checked out 'c4a046793e07ac171ffba395402f8c9a6011cfc2'
Submodule path '3party/boost/libs/intrusive': checked out '06d74a1709b078f779673c5f13f8b2bfda663253'
Submodule path '3party/boost/libs/io': checked out '932dd480263d06d00bf4b40a323dc3f4ace266e2'
Submodule path '3party/boost/libs/iostreams': checked out '9edd46fe730e2086675a91629287224bd92590ab'
Submodule path '3party/boost/libs/iterator': checked out 'd175ba245026adf22d7cea7d992079162f5110ea'
Submodule path '3party/boost/libs/json': checked out '83c364afaf31b58cfe8b97ab159c406c508f47c9'
Submodule path '3party/boost/libs/lambda': checked out 'ac26514243521513d33be23aaa92a85b858ddf51'
Submodule path '3party/boost/libs/lambda2': checked out 'fd1a3e45437d643430e9a737bbe387d5d7d3bdb0'
Submodule path '3party/boost/libs/leaf': checked out 'ecf1f13c9aaeee04a5fe3c093d318e29e709346b'
Submodule path '3party/boost/libs/lexical_cast': checked out 'a9f296115967335aaa9f4a4cadfd900f131a60d1'
Submodule path '3party/boost/libs/local_function': checked out '099e96bef0e5f2d513940c5987958121ca6f6e02'
Submodule path '3party/boost/libs/locale': checked out '5789ae2532abbc3d9f5908b7c71ab079455d75a5'
Submodule path '3party/boost/libs/lockfree': checked out 'fdd4d0632dd0904f6e9c656c45397fe8ef985bc9'
Submodule path '3party/boost/libs/log': checked out 'dda118619ad4abc0ffb5c603e7e086a291da2c72'
Submodule path '3party/boost/libs/logic': checked out '7d15cffe159219e0b0ec58135a2f8fb3de7028e1'
Submodule path '3party/boost/libs/math': checked out '2b9927871fd86312f753e4bcbdb82236022c5856'
Submodule path '3party/boost/libs/metaparse': checked out '0ef448c1a7ce22b5de514f9cd504c323c28f4379'
Submodule path '3party/boost/libs/move': checked out '208df9f3c338674697614c125b4d98d9cc446173'
Submodule path '3party/boost/libs/mp11': checked out '590df5e0bcdf0c17911c28098b9e4a7839a63019'
Submodule path '3party/boost/libs/mpi': checked out '1d6ee972f472cb1468af3273f5d24ff7d94e180b'
Submodule path '3party/boost/libs/mpl': checked out '8f10d06b9637a67b23a3a11791de5bd6bcd2e112'
Submodule path '3party/boost/libs/msm': checked out '03f58ead6d0ec23d52e5c7b382e2c98df1d943d5'
Submodule path '3party/boost/libs/multi_array': checked out '0c5348bef71b890c4bd06eff1ee5ebda69e7b27a'
Submodule path '3party/boost/libs/multi_index': checked out '9699a7fc8720d6927b741247e9abf5cc26e3dd9f'
Submodule path '3party/boost/libs/multiprecision': checked out 'db0bb4d2d2611605b7ce97220fb9973fd7e072c9'
Submodule path '3party/boost/libs/nowide': checked out 'b4c10155171b782fc858ae1aadcfdbe34e4940d4'
Submodule path '3party/boost/libs/numeric/conversion': checked out 'db44689f4f4f74d6572a868e13f523c82fca5a55'
Submodule path '3party/boost/libs/numeric/interval': checked out '252c6fd6360bfb6ae51eea2ca97f324b995519e0'
Submodule path '3party/boost/libs/numeric/odeint': checked out 'db8f91a51da630957d6bfa1ff87be760b0be97a6'
Submodule path '3party/boost/libs/numeric/ublas': checked out 'f0e55caf310d5e01c7e9f2190b2422e113ddeedb'
Submodule path '3party/boost/libs/optional': checked out '4ead6d14ff889c9d80fc7e2b336daba2c0dcefbe'
Submodule path '3party/boost/libs/outcome': checked out 'e3556c319d8c2751d6abc2a85fbaab286e1f965e'
Submodule path '3party/boost/libs/parameter': checked out '9780d8338f26276dc46c5441dad88b1481445b4d'
Submodule path '3party/boost/libs/parameter_python': checked out '1f7f9ce9930119f0dda7dcd5e1ec3b5ed7c6b091'
Submodule path '3party/boost/libs/pfr': checked out '8a8b5bc8d3ff673c4b278d145f6bf6973844d8e9'
Submodule path '3party/boost/libs/phoenix': checked out '15500aec2187ab59e51d05addab0fdba7e788dbb'
Submodule path '3party/boost/libs/poly_collection': checked out '0b8bfc4cff012d0f23049fc5a0009ac4abadceb4'
Submodule path '3party/boost/libs/polygon': checked out '8ba35b57c1436c4b36f7544aadd78c2b24acc7db'
Submodule path '3party/boost/libs/pool': checked out 'f2b8fec976e24367b9fb6a9748c9c0071302ba55'
Submodule path '3party/boost/libs/predef': checked out '392e4e767469e3469c9390f0d9cca16724dc3fc8'
Submodule path '3party/boost/libs/preprocessor': checked out 'd4e82d7d3f2e2adbe280966ac51ce8f9372f5a44'
Submodule path '3party/boost/libs/process': checked out 'dc8ba65c77da135eef84c7f57025984e591cc34a'
Submodule path '3party/boost/libs/program_options': checked out '7bcbb4ea23c958800694436b411669f80c543e18'
Submodule path '3party/boost/libs/property_map': checked out '427fc05576cf1802176d268b29b212d870d22e17'
Submodule path '3party/boost/libs/property_map_parallel': checked out 'a2f90e9660e4e7e012c0b54a1338d8e69fb71906'
Submodule path '3party/boost/libs/property_tree': checked out 'd30ff9404bd6af5cc8922a177865e566f4846b19'
Submodule path '3party/boost/libs/proto': checked out '7f924934689b940f3a72212ab0f714ec6fd6e34b'
Submodule path '3party/boost/libs/ptr_container': checked out '943730c349f5af0814cc16c44d63850de5bfc697'
Submodule path '3party/boost/libs/python': checked out '8dd151177374dbf0aa5cb86bd350cf1ad13e2160'
Submodule path '3party/boost/libs/qvm': checked out '5791440b346232c391ab8d16f559ca5b2d7ae9b3'
Submodule path '3party/boost/libs/random': checked out 'a2740d4b30178cb187fabca163e5be7803a577b9'
Submodule path '3party/boost/libs/range': checked out '88c6199aedf8bbb5a6a8966e534f9de99943cde2'
Submodule path '3party/boost/libs/ratio': checked out '00073b7d5896603b2036a334253dc9784285355c'
Submodule path '3party/boost/libs/rational': checked out '564623136417068916495e2b24737054d607347c'
Submodule path '3party/boost/libs/regex': checked out '177ee2cc0fc84964cde8f81942beb24918fb24dd'
Submodule path '3party/boost/libs/safe_numerics': checked out '777e0be5ec763d0333a717c5e421a4f7c5e5bdc9'
Submodule path '3party/boost/libs/scope_exit': checked out '60baaae454b2da887a31cf939e22015b6263c9e4'
Submodule path '3party/boost/libs/serialization': checked out '0ca603daf99888bf059c01ae1bab1b27dbc35ebe'
Submodule path '3party/boost/libs/signals2': checked out 'ea5897103888b1e290210860d769fd29157f8eb5'
Submodule path '3party/boost/libs/smart_ptr': checked out 'f2cc84a23c64b8a73c9b72b34799d0854d7e0787'
Submodule path '3party/boost/libs/sort': checked out '72a3ae870c59980dadd757f5f63e6be16ab61c1b'
Submodule path '3party/boost/libs/spirit': checked out '5498bc0fd149a50fa3a52bd319eef3d9dcc3af9c'
Submodule path '3party/boost/libs/stacktrace': checked out '75b7986f9799184ecd679d86273532cb54e6a0dc'
Submodule path '3party/boost/libs/statechart': checked out '586445b824c5cf0e7e6ce4ff2df620fda5d0f0d7'
Submodule path '3party/boost/libs/static_assert': checked out 'ba72d3340f3dc6e773868107f35902292f84b07e'
Submodule path '3party/boost/libs/static_string': checked out '5d6fefdd2acd70c34d8ba4590ab888d8481532af'
Submodule path '3party/boost/libs/stl_interfaces': checked out 'f84cb723e1e467b83835bfbf31be7baa6e625230'
Submodule path '3party/boost/libs/system': checked out '533dfe1688580e7fe5736aaa33678a50e7400fe5'
Submodule path '3party/boost/libs/test': checked out 'd2895ebfdfdf16074c58c9801d53e190c4654fcb'
Submodule path '3party/boost/libs/thread': checked out '1de55fceda1829fa3b29fcfd4efe8f94de0a01d1'
Submodule path '3party/boost/libs/throw_exception': checked out '68d092f4d7aafcc7dfbcc5f408d78bcb9e5289ec'
Submodule path '3party/boost/libs/timer': checked out '9ee4c9cd9dec4f4ab5c38ffb9cb9978427916ee0'
Submodule path '3party/boost/libs/tokenizer': checked out '0445694a4f04caa1faa99794053684d12c621a39'
Submodule path '3party/boost/libs/tti': checked out '03734c54a51b6372ac3296d2fe5103b7360bcd3f'
Submodule path '3party/boost/libs/tuple': checked out '500e4fa0a2845b96c0dd919e7485e0f216438a01'
Submodule path '3party/boost/libs/type_erasure': checked out 'fc39ca9936bd7ac37afa8fadf3be3b62ee378f39'
Submodule path '3party/boost/libs/type_index': checked out 'cca370a91834d331e3143ac4d023fb0f178e512b'
Submodule path '3party/boost/libs/type_traits': checked out 'd2a4a6bf0a3900e11faaf6904b95183115bac54d'
Submodule path '3party/boost/libs/typeof': checked out '46c7a05f826fc020ee88210ea2a5cd9278b930ab'
Submodule path '3party/boost/libs/units': checked out '45787015dd8c11653eb988260acf05c4af9d42e5'
Submodule path '3party/boost/libs/unordered': checked out '33f81fd49039bccd1aa3dfd5a29ef6073b93009c'
Submodule path '3party/boost/libs/utility': checked out 'fe417f623790318068b8de8eec0d0cb963e9cb44'
Submodule path '3party/boost/libs/uuid': checked out 'bd835638a5179cc1fb55b9f95377bedce4e47e1d'
Submodule path '3party/boost/libs/variant': checked out 'd2fdf2384b146b0c764077f5539f5f6ed7c40f20'
Submodule path '3party/boost/libs/variant2': checked out 'd34658f4c8480c3a71fb435121f68e25ca166eab'
Submodule path '3party/boost/libs/vmd': checked out '34cad2c1a574d445812c7c2432d3a5a5c843b412'
Submodule path '3party/boost/libs/wave': checked out 'fabe7e3ab0475f9f5ab208b5e7768497405e55be'
Submodule path '3party/boost/libs/winapi': checked out '3fa8b0ace1774536905b559fc4d681b8c0971b02'
Submodule path '3party/boost/libs/xpressive': checked out '4679fbd23f962bfa78d44acf5fa48f6f790642c0'
Submodule path '3party/boost/libs/yap': checked out 'ae49bf2744586e6bd6c0cedff4500a58a4386860'
Submodule path '3party/boost/more': checked out '631827729ba7dbed212697ab0f6d61a0748d00a5'
Submodule path '3party/boost/tools/auto_index': checked out 'e98a81769364f56b272e510c876df874af514b29'
Submodule path '3party/boost/tools/bcp': checked out 'a86fdce7885babae3ff625de36aa2dfacf983f8c'
Submodule path '3party/boost/tools/boost_install': checked out '85e1406a570cb8aa13c8b1f885f7cc2a9982c783'
Submodule path '3party/boost/tools/boostbook': checked out 'a6701f5d278daba797697a1e5000ee41f25bcaff'
Submodule path '3party/boost/tools/boostdep': checked out '7f601b865a80db5854523d114ad7539c1e14fe18'
Submodule path '3party/boost/tools/build': checked out 'd4352f0b1de0d28977f3d488c9be0c29fd1e6f9d'
Submodule path '3party/boost/tools/check_build': checked out '9c3fc263fc3203e566c4b632c1b124e57dafbed5'
Submodule path '3party/boost/tools/cmake': checked out 'bd981bfaff20ae4275ecbeba711c90e7fc9d0316'
Submodule path '3party/boost/tools/docca': checked out '2118ea9fdbbc024503ebc8cdec87e7e52782a567'
Submodule path '3party/boost/tools/inspect': checked out 'db423bf897bcc6aa34231e5266442b75ee2a5666'
Submodule path '3party/boost/tools/litre': checked out '564d4d8d30b7e03ac5e25d78e14d2c19fa321c83'
Submodule path '3party/boost/tools/quickbook': checked out '5f2e8c24cb813b4b0b94d3316e664b971c5b71dd'
Submodule path '3party/expat': checked out '1bb22cd03ab1ad48efb2bdee08cb805b5b593ea5'
Submodule path '3party/fast_double_parser': checked out '111ad8041765d1623195bd6eb8b6bc7d97c44507'
Submodule path '3party/fast_double_parser/benchmarks/dependencies/abseil-cpp': checked out 'd936052d32a5b7ca08b0199a6724724aea432309'
Submodule path '3party/fast_double_parser/benchmarks/dependencies/double-conversion': checked out 'f4cb2384efa55dee0e6652f8674b05763441ab09'
Submodule path '3party/freetype/freetype': checked out '4eb6cb8818057a022f97176b53738ee3098c8eb6'
Submodule path '3party/freetype/freetype/subprojects/dlg': checked out 'd142e646e263c89f93663e027c2f0d03739ab42d'
Submodule path '3party/glm': checked out 'c834d06c2739f63e28e5665d4569dca9415e3891'
Submodule path '3party/googletest': checked out 'e2f3978937c0244508135f126e2617a7734a68be'
Submodule path '3party/icu/icu': checked out '904cf62457de2440e8526deb75c95a3f7296f517'
Submodule path '3party/just_gtfs': checked out '7516753825500f90ac2de6f18c256d5abec1ff33'
Submodule path '3party/protobuf/protobuf': checked out 'a6189acd18b00611c1dc7042299ad75486f08a1a'
Submodule path '3party/protobuf/protobuf/third_party/benchmark': checked out '360e66c1c4777c99402cf8cd535aa510fee16573'
Submodule path '3party/pugixml/pugixml': checked out 'effc46f0ed35a70a53db7f56e37141ae3cb3a92a'
Submodule path 'tools/kothic': checked out 'd6a507cfc09638d489588f2cbd32569f34004318'
Submodule path 'tools/macdeployqtfix': checked out 'c2fa2720f627236d031819c7d6ba33ee6cedbf13'
Submodule path 'tools/osmctools': checked out '45bb767d7939aaca39901d494c080fc4e7916ba7'
Submodule path 'tools/twine': checked out 'ccf5f38d6f38b0b961b79a1166f2ae462985c890'
2022-06-22 02:15:30,004 INFO: Creating local.properties file at build/app.organicmaps/local.properties
2022-06-22 02:15:30,005 INFO: Creating local.properties file at build/app.organicmaps/android/local.properties
2022-06-22 02:15:30,005 DEBUG: Removing debuggable flags from build/app.organicmaps/android
2022-06-22 02:15:30,020 INFO: Removing specified files
2022-06-22 02:15:30,020 INFO: Removing tools/shaders_compiler
2022-06-22 02:15:30,032 INFO: Removing iphone
2022-06-22 02:15:30,149 INFO: Removing xcode
2022-06-22 02:15:30,155 INFO: Removing qt
2022-06-22 02:15:30,385 INFO: Cleaned build.gradle of keysigning configs at build/app.organicmaps/android/build.gradle
2022-06-22 02:15:30,640 INFO: Running 'prebuild' commands in build/app.organicmaps/android
2022-06-22 02:15:30,640 DEBUG: Directory: build/app.organicmaps/android
2022-06-22 02:15:30,641 DEBUG: > bash -x -c -- JAVA_HOME=/usr/lib/jvm/java-8-openjdk-amd64 /opt/android-sdk/tools/bin/sdkmanager 'cmake;3.18.1' > /dev/null && sed -i -e '/com.google.firebase/d; /com.google.gms/d; /com.google.android.gms/d' build.gradle && touch secure.properties && echo '<?xml version="1.0" encoding="utf-8"?><network-security-config/>' > res/xml/network_security_config.xml && cp ../private_default.h ../private.h
+ JAVA_HOME=/usr/lib/jvm/java-8-openjdk-amd64
+ /opt/android-sdk/tools/bin/sdkmanager 'cmake;3.18.1'
Warning: File /home/vagrant/.android/repositories.cfg could not be loaded.
+ sed -i -e '/com.google.firebase/d; /com.google.gms/d; /com.google.android.gms/d' build.gradle
+ touch secure.properties
+ echo '<?xml version="1.0" encoding="utf-8"?><network-security-config/>'
+ cp ../private_default.h ../private.h
2022-06-22 02:15:55,229 INFO: Cleaning Gradle project...
2022-06-22 02:15:55,230 DEBUG: Directory: build/app.organicmaps/android
2022-06-22 02:15:55,230 DEBUG: > /home/vagrant/fdroidserver/gradlew-fdroid clean
Found 7.4.2 via distributionUrl
Downloading missing gradle version 7.4.2
cachedir /home/vagrant/.cache/fdroidserver
/home/vagrant/.cache/fdroidserver/gradle-7.4.2-bin.zip: OK
Running /opt/gradle/versions/7.4.2/bin/gradle clean

Welcome to Gradle 7.4.2!

Here are the highlights of this release:
 - Aggregated test and JaCoCo reports
 - Marking additional test source directories as tests in IntelliJ
 - Support for Adoptium JDKs in Java toolchains

For more details see https://docs.gradle.org/7.4.2/release-notes.html

To honour the JVM settings for this build a single-use Daemon process will be forked. See https://docs.gradle.org/7.4.2/userguide/gradle_daemon.html#sec:disabling_the_daemon.
Daemon will be stopped at the end of the build 

> Configure project :
Building with Google Mobile Services
Building without Google Firebase Services
Version: 22061802
VersionCode: 2022.06.18-2
Building for [armeabi-v7a, arm64-v8a, x86_64] archs.
Create separate apks: false
[CXX1104] NDK from ndk.dir at /opt/android-sdk/ndk/23.1.7779620 had version [23.1.7779620] which disagrees with android.ndkVersion [24.0.8215888]
[CXX1104] NDK from ndk.dir at /opt/android-sdk/ndk/23.1.7779620 had version [23.1.7779620] which disagrees with android.ndkVersion [24.0.8215888]
[CXX1104] NDK from ndk.dir at /opt/android-sdk/ndk/23.1.7779620 had version [23.1.7779620] which disagrees with android.ndkVersion [24.0.8215888]
[CXX1104] NDK from ndk.dir at /opt/android-sdk/ndk/23.1.7779620 had version [23.1.7779620] which disagrees with android.ndkVersion [24.0.8215888]
[CXX1104] NDK from ndk.dir at /opt/android-sdk/ndk/23.1.7779620 had version [23.1.7779620] which disagrees with android.ndkVersion [24.0.8215888]
[CXX1104] NDK from ndk.dir at /opt/android-sdk/ndk/23.1.7779620 had version [23.1.7779620] which disagrees with android.ndkVersion [24.0.8215888]
[CXX1104] NDK from ndk.dir at /opt/android-sdk/ndk/23.1.7779620 had version [23.1.7779620] which disagrees with android.ndkVersion [24.0.8215888]
[CXX1104] NDK from ndk.dir at /opt/android-sdk/ndk/23.1.7779620 had version [23.1.7779620] which disagrees with android.ndkVersion [24.0.8215888]
[CXX1104] NDK from ndk.dir at /opt/android-sdk/ndk/23.1.7779620 had version [23.1.7779620] which disagrees with android.ndkVersion [24.0.8215888]
[CXX1104] NDK from ndk.dir at /opt/android-sdk/ndk/23.1.7779620 had version [23.1.7779620] which disagrees with android.ndkVersion [24.0.8215888]
[CXX1104] NDK from ndk.dir at /opt/android-sdk/ndk/23.1.7779620 had version [23.1.7779620] which disagrees with android.ndkVersion [24.0.8215888]
[CXX1104] NDK from ndk.dir at /opt/android-sdk/ndk/23.1.7779620 had version [23.1.7779620] which disagrees with android.ndkVersion [24.0.8215888]
Warning: Gradle Play Publisher playConfigs object 'googleRelease' does not match a variant, flavor, dimension, or build type.

FAILURE: Build failed with an exception.

* What went wrong:
A problem occurred configuring root project 'android'.
> [CXX1104] NDK from ndk.dir at /opt/android-sdk/ndk/23.1.7779620 had version [23.1.7779620] which disagrees with android.ndkVersion [24.0.8215888]

* Try:
> Run with --stacktrace option to get the stack trace.
> Run with --info or --debug option to get more log output.
> Run with --scan to get full insights.

* Get more help at https://help.gradle.org

BUILD FAILED in 28s
2022-06-22 02:16:26,832 ERROR: Could not build app app.organicmaps: Error cleaning app.organicmaps:2022.06.18-2-FDroid
==== detail begin ====
Found 7.4.2 via distributionUrl
Downloading missing gradle version 7.4.2
cachedir /home/vagrant/.cache/fdroidserver
/home/vagrant/.cache/fdroidserver/gradle-7.4.2-bin.zip: OK
Running /opt/gradle/versions/7.4.2/bin/gradle clean

Welcome to Gradle 7.4.2!

Here are the highlights of this release:
 - Aggregated test and JaCoCo reports
 - Marking additional test source directories as tests in IntelliJ
 - Support for Adoptium JDKs in Java toolchains

For more details see https://docs.gradle.org/7.4.2/release-notes.html

To honour the JVM settings for this build a single-use Daemon process will be forked. See https://docs.gradle.org/7.4.2/userguide/gradle_daemon.html#sec:disabling_the_daemon.
Daemon will be stopped at the end of the build 

> Configure project :
Building with Google Mobile Services
Building without Google Firebase Services
Version: 22061802
VersionCode: 2022.06.18-2
Building for [armeabi-v7a, arm64-v8a, x86_64] archs.
Create separate apks: false
[CXX1104] NDK from ndk.dir at /opt/android-sdk/ndk/23.1.7779620 had version [23.1.7779620] which disagrees with android.ndkVersion [24.0.8215888]
[CXX1104] NDK from ndk.dir at /opt/android-sdk/ndk/23.1.7779620 had version [23.1.7779620] which disagrees with android.ndkVersion [24.0.8215888]
[CXX1104] NDK from ndk.dir at /opt/android-sdk/ndk/23.1.7779620 had version [23.1.7779620] which disagrees with android.ndkVersion [24.0.8215888]
[CXX1104] NDK from ndk.dir at /opt/android-sdk/ndk/23.1.7779620 had version [23.1.7779620] which disagrees with android.ndkVersion [24.0.8215888]
[CXX1104] NDK from ndk.dir at /opt/android-sdk/ndk/23.1.7779620 had version [23.1.7779620] which disagrees with android.ndkVersion [24.0.8215888]
[CXX1104] NDK from ndk.dir at /opt/android-sdk/ndk/23.1.7779620 had version [23.1.7779620] which disagrees with android.ndkVersion [24.0.8215888]
[CXX1104] NDK from ndk.dir at /opt/android-sdk/ndk/23.1.7779620 had version [23.1.7779620] which disagrees with android.ndkVersion [24.0.8215888]
[CXX1104] NDK from ndk.dir at /opt/android-sdk/ndk/23.1.7779620 had version [23.1.7779620] which disagrees with android.ndkVersion [24.0.8215888]
[CXX1104] NDK from ndk.dir at /opt/android-sdk/ndk/23.1.7779620 had version [23.1.7779620] which disagrees with android.ndkVersion [24.0.8215888]
[CXX1104] NDK from ndk.dir at /opt/android-sdk/ndk/23.1.7779620 had version [23.1.7779620] which disagrees with android.ndkVersion [24.0.8215888]
[CXX1104] NDK from ndk.dir at /opt/android-sdk/ndk/23.1.7779620 had version [23.1.7779620] which disagrees with android.ndkVersion [24.0.8215888]
[CXX1104] NDK from ndk.dir at /opt/android-sdk/ndk/23.1.7779620 had version [23.1.7779620] which disagrees with android.ndkVersion [24.0.8215888]
Warning: Gradle Play Publisher playConfigs object 'googleRelease' does not match a variant, flavor, dimension, or build type.

FAILURE: Build failed with an exception.

* What went wrong:
A problem occurred configuring root project 'android'.
> [CXX1104] NDK from ndk.dir at /opt/android-sdk/ndk/23.1.7779620 had version [23.1.7779620] which disagrees with android.ndkVersion [24.0.8215888]

* Try:
> Run with --stacktrace option to get the stack trace.
> Run with --info or --debug option to get more log output.
> Run with --scan to get full insights.

* Get more help at https://help.gradle.org

BUILD FAILED in 28s
==== detail end ====
2022-06-22 02:16:26,832 DEBUG: Error encoutered, stopping by user request.
==== detail end ====