log for app.zeusln.zeus:40

Traceback (most recent call last):
  File "/home/fbuild/fdroidserver/fdroidserver/build.py", line 1128, in main
    options.onserver, options.refresh):
  File "/home/fbuild/fdroidserver/fdroidserver/build.py", line 887, in trybuild
    build_server(app, build, vcs, build_dir, output_dir, log_dir, force)
  File "/home/fbuild/fdroidserver/fdroidserver/build.py", line 270, in build_server
    str(output, 'utf-8'))
fdroidserver.exception.BuildException: Build.py failed on server for app.zeusln.zeus:0.6.4
==== detail begin ====
== Installed Android Tools ==

2022-05-08 13:12:03,340 DEBUG: Reading 'config.yml'
2022-05-08 13:12:03,351 INFO: Using /opt/android-sdk/build-tools/29.0.3/apksigner 
2022-05-08 13:12:03,354 INFO: Creating log directory
2022-05-08 13:12:03,354 INFO: Creating temporary directory
2022-05-08 13:12:03,354 INFO: Creating output directory
2022-05-08 13:12:03,362 DEBUG: Getting git vcs interface for https://github.com/ZeusLN/zeus.git
2022-05-08 13:12:03,362 DEBUG: > git --version
git version 2.11.0
2022-05-08 13:12:03,579 INFO: Using git version 2.11.0
2022-05-08 13:12:03,579 DEBUG: Checking 0.6.4
2022-05-08 13:12:03,580 INFO: Building version 0.6.4 (40) of app.zeusln.zeus
2022-05-08 13:12:03,581 INFO: Running 'sudo' commands in /home/vagrant
2022-05-08 13:12:03,582 DEBUG: > sudo DEBIAN_FRONTEND=noninteractive bash -x -c sysctl fs.inotify.max_user_watches=524288 && apt-get update || apt-get update && apt-get install -y g++ && apt-get install -y -t stretch-backports npm
+ sysctl fs.inotify.max_user_watches=524288
fs.inotify.max_user_watches = 524288
+ apt-get update
Ign:1 http://deb.debian.org/debian stretch InRelease
Get:2 http://security.debian.org/debian-security stretch/updates InRelease [53.0 kB]
Hit:3 http://deb.debian.org/debian stretch-updates InRelease
Get:4 http://deb.debian.org/debian stretch-backports-sloppy InRelease [46.7 kB]
Get:5 http://deb.debian.org/debian stretch-backports InRelease [91.8 kB]
Get:6 http://deb.debian.org/debian testing InRelease [130 kB]
Hit:7 http://deb.debian.org/debian stretch Release
Get:8 http://deb.debian.org/debian testing/main amd64 Packages.diff/Index [63.6 kB]
Get:10 http://deb.debian.org/debian testing/main i386 Packages.diff/Index [63.6 kB]
Get:11 http://deb.debian.org/debian testing/main Translation-en.diff/Index [63.6 kB]
Get:12 http://deb.debian.org/debian testing/main amd64 Packages T-2022-05-08-0206.12-F-2022-05-07-1407.05.pdiff [56.2 kB]
Get:12 http://deb.debian.org/debian testing/main amd64 Packages T-2022-05-08-0206.12-F-2022-05-07-1407.05.pdiff [56.2 kB]
Get:13 http://deb.debian.org/debian testing/main i386 Packages T-2022-05-08-0206.12-F-2022-05-07-1407.05.pdiff [55.5 kB]
Get:13 http://deb.debian.org/debian testing/main i386 Packages T-2022-05-08-0206.12-F-2022-05-07-1407.05.pdiff [55.5 kB]
Get:14 http://deb.debian.org/debian testing/main Translation-en T-2022-05-08-0206.12-F-2022-05-07-1407.05.pdiff [5,949 B]
Get:14 http://deb.debian.org/debian testing/main Translation-en T-2022-05-08-0206.12-F-2022-05-07-1407.05.pdiff [5,949 B]
Fetched 630 kB in 4s (137 kB/s)
Reading package lists...
+ apt-get install -y g++
Reading package lists...
Building dependency tree...
Reading state information...
The following additional packages will be installed:
  g++-6 libstdc++-6-dev
Suggested packages:
  g++-multilib g++-6-multilib gcc-6-doc libstdc++6-6-dbg libstdc++-6-doc
The following NEW packages will be installed:
  g++ g++-6 libstdc++-6-dev
0 upgraded, 3 newly installed, 0 to remove and 2 not upgraded.
Need to get 8,516 kB of archives.
After this operation, 39.8 MB of additional disk space will be used.
Get:1 http://deb.debian.org/debian stretch/main amd64 libstdc++-6-dev amd64 6.3.0-18+deb9u1 [1,420 kB]
Get:2 http://deb.debian.org/debian stretch/main amd64 g++-6 amd64 6.3.0-18+deb9u1 [7,094 kB]
Get:3 http://deb.debian.org/debian stretch/main amd64 g++ amd64 4:6.3.0-4 [1,546 B]
Fetched 8,516 kB in 0s (61.3 MB/s)
Selecting previously unselected package libstdc++-6-dev:amd64.
(Reading database ... 64892 files and directories currently installed.)
Preparing to unpack .../libstdc++-6-dev_6.3.0-18+deb9u1_amd64.deb ...
Unpacking libstdc++-6-dev:amd64 (6.3.0-18+deb9u1) ...
Selecting previously unselected package g++-6.
Preparing to unpack .../g++-6_6.3.0-18+deb9u1_amd64.deb ...
Unpacking g++-6 (6.3.0-18+deb9u1) ...
Selecting previously unselected package g++.
Preparing to unpack .../g++_4%3a6.3.0-4_amd64.deb ...
Unpacking g++ (4:6.3.0-4) ...
Setting up libstdc++-6-dev:amd64 (6.3.0-18+deb9u1) ...
Setting up g++-6 (6.3.0-18+deb9u1) ...
Setting up g++ (4:6.3.0-4) ...
update-alternatives: using /usr/bin/g++ to provide /usr/bin/c++ (c++) in auto mode
+ apt-get install -y -t stretch-backports npm
Reading package lists...
Building dependency tree...
Reading state information...
The following additional packages will be installed:
  gyp libc-ares2 libhttp-parser2.8 libjs-inherits libjs-is-typedarray
  libjs-node-uuid libuv1 libuv1-dev node-abbrev node-ajv node-ansi
  node-ansi-align node-ansi-regex node-ansi-styles node-ansistyles node-aproba
  node-archy node-are-we-there-yet node-asn1 node-assert-plus node-asynckit
  node-aws-sign2 node-aws4 node-balanced-match node-bcrypt-pbkdf node-bluebird
  node-boxen node-brace-expansion node-builtin-modules node-builtins
  node-cacache node-call-limit node-camelcase node-caseless node-chalk
  node-chownr node-cli-boxes node-cliui node-clone node-co node-color-convert
  node-color-name node-combined-stream node-concat-map node-concat-stream
  node-config-chain node-console-control-strings node-copy-concurrently
  node-core-util-is node-cross-spawn node-cross-spawn-async node-cyclist
  node-dashdash node-decamelize node-decompress-response node-deep-extend
  node-defaults node-delayed-stream node-delegates node-detect-indent
  node-detect-newline node-duplexer3 node-duplexify node-ecc-jsbn node-editor
  node-encoding node-end-of-stream node-errno node-escape-string-regexp
  node-execa node-extend node-extsprintf node-find-up node-flush-write-stream
  node-forever-agent node-form-data node-from2 node-fs-vacuum
  node-fs-write-stream-atomic node-fs.realpath node-fstream node-gauge
  node-get-caller-file node-get-stream node-getpass node-glob node-got
  node-graceful-fs node-gyp node-har-schema node-har-validator node-has-flag
  node-has-symbol-support-x node-has-to-string-tag-x node-has-unicode
  node-hosted-git-info node-http-signature node-iconv-lite node-iferr
  node-import-lazy node-imurmurhash node-inflight node-inherits node-ini
  node-invert-kv node-is-builtin-module node-is-npm node-is-object
  node-is-plain-obj node-is-retry-allowed node-is-stream node-is-typedarray
  node-isexe node-isstream node-isurl node-jsbn node-json-parse-better-errors
  node-json-schema node-json-stable-stringify node-json-stringify-safe
  node-jsonify node-jsonparse node-jsonstream node-jsprim node-latest-version
  node-lazy-property node-lcid node-libnpx node-locate-path node-lockfile
  node-lowercase-keys node-lru-cache node-mem node-mime-types node-mimic-fn
  node-mimic-response node-minimatch node-minimist node-mississippi
  node-mkdirp node-move-concurrently node-mute-stream node-node-uuid node-nopt
  node-normalize-package-data node-npm-package-arg node-npm-run-path
  node-npmlog node-oauth-sign node-object-assign node-once node-opener
  node-os-locale node-osenv node-p-cancelable node-p-finally node-p-limit
  node-p-locate node-p-timeout node-package-json node-parallel-transform
  node-path-exists node-path-is-absolute node-path-is-inside
  node-performance-now node-prepend-http node-promise-inflight node-promzard
  node-proto-list node-prr node-pseudomap node-pump node-pumpify node-punycode
  node-qs node-qw node-rc node-read node-read-package-json
  node-registry-auth-token node-registry-url node-request
  node-require-directory node-require-main-filename node-resolve-from
  node-retry node-rimraf node-run-queue node-safe-buffer node-semver
  node-semver-diff node-set-blocking node-sha node-signal-exit node-slash
  node-slide node-sorted-object node-spdx-correct node-spdx-expression-parse
  node-spdx-license-ids node-sshpk node-ssri node-stream-each
  node-stream-iterate node-stream-shift node-string-width node-strip-ansi
  node-strip-eof node-strip-json-comments node-supports-color node-tar
  node-term-size node-text-table node-through node-through2 node-timed-out
  node-tough-cookie node-tunnel-agent node-tweetnacl node-typedarray
  node-uid-number node-unique-filename node-unpipe node-url-parse-lax
  node-url-to-options node-validate-npm-package-license
  node-validate-npm-package-name node-verror node-wcwidth.js node-which
  node-which-module node-wide-align node-widest-line node-wrap-ansi
  node-wrappy node-write-file-atomic node-xdg-basedir node-xtend node-y18n
  node-yallist node-yargs node-yargs-parser nodejs nodejs-dev
Suggested packages:
  debhelper
Recommended packages:
  javascript-common build-essential nodejs-doc
The following NEW packages will be installed:
  gyp libc-ares2 libhttp-parser2.8 libjs-inherits libjs-is-typedarray
  libjs-node-uuid libuv1-dev node-abbrev node-ajv node-ansi node-ansi-align
  node-ansi-regex node-ansi-styles node-ansistyles node-aproba node-archy
  node-are-we-there-yet node-asn1 node-assert-plus node-asynckit
  node-aws-sign2 node-aws4 node-balanced-match node-bcrypt-pbkdf node-bluebird
  node-boxen node-brace-expansion node-builtin-modules node-builtins
  node-cacache node-call-limit node-camelcase node-caseless node-chalk
  node-chownr node-cli-boxes node-cliui node-clone node-co node-color-convert
  node-color-name node-combined-stream node-concat-map node-concat-stream
  node-config-chain node-console-control-strings node-copy-concurrently
  node-core-util-is node-cross-spawn node-cross-spawn-async node-cyclist
  node-dashdash node-decamelize node-decompress-response node-deep-extend
  node-defaults node-delayed-stream node-delegates node-detect-indent
  node-detect-newline node-duplexer3 node-duplexify node-ecc-jsbn node-editor
  node-encoding node-end-of-stream node-errno node-escape-string-regexp
  node-execa node-extend node-extsprintf node-find-up node-flush-write-stream
  node-forever-agent node-form-data node-from2 node-fs-vacuum
  node-fs-write-stream-atomic node-fs.realpath node-fstream node-gauge
  node-get-caller-file node-get-stream node-getpass node-glob node-got
  node-graceful-fs node-gyp node-har-schema node-har-validator node-has-flag
  node-has-symbol-support-x node-has-to-string-tag-x node-has-unicode
  node-hosted-git-info node-http-signature node-iconv-lite node-iferr
  node-import-lazy node-imurmurhash node-inflight node-inherits node-ini
  node-invert-kv node-is-builtin-module node-is-npm node-is-object
  node-is-plain-obj node-is-retry-allowed node-is-stream node-is-typedarray
  node-isexe node-isstream node-isurl node-jsbn node-json-parse-better-errors
  node-json-schema node-json-stable-stringify node-json-stringify-safe
  node-jsonify node-jsonparse node-jsonstream node-jsprim node-latest-version
  node-lazy-property node-lcid node-libnpx node-locate-path node-lockfile
  node-lowercase-keys node-lru-cache node-mem node-mime-types node-mimic-fn
  node-mimic-response node-minimatch node-minimist node-mississippi
  node-mkdirp node-move-concurrently node-mute-stream node-node-uuid node-nopt
  node-normalize-package-data node-npm-package-arg node-npm-run-path
  node-npmlog node-oauth-sign node-object-assign node-once node-opener
  node-os-locale node-osenv node-p-cancelable node-p-finally node-p-limit
  node-p-locate node-p-timeout node-package-json node-parallel-transform
  node-path-exists node-path-is-absolute node-path-is-inside
  node-performance-now node-prepend-http node-promise-inflight node-promzard
  node-proto-list node-prr node-pseudomap node-pump node-pumpify node-punycode
  node-qs node-qw node-rc node-read node-read-package-json
  node-registry-auth-token node-registry-url node-request
  node-require-directory node-require-main-filename node-resolve-from
  node-retry node-rimraf node-run-queue node-safe-buffer node-semver
  node-semver-diff node-set-blocking node-sha node-signal-exit node-slash
  node-slide node-sorted-object node-spdx-correct node-spdx-expression-parse
  node-spdx-license-ids node-sshpk node-ssri node-stream-each
  node-stream-iterate node-stream-shift node-string-width node-strip-ansi
  node-strip-eof node-strip-json-comments node-supports-color node-tar
  node-term-size node-text-table node-through node-through2 node-timed-out
  node-tough-cookie node-tunnel-agent node-tweetnacl node-typedarray
  node-uid-number node-unique-filename node-unpipe node-url-parse-lax
  node-url-to-options node-validate-npm-package-license
  node-validate-npm-package-name node-verror node-wcwidth.js node-which
  node-which-module node-wide-align node-widest-line node-wrap-ansi
  node-wrappy node-write-file-atomic node-xdg-basedir node-xtend node-y18n
  node-yallist node-yargs node-yargs-parser nodejs nodejs-dev npm
The following packages will be upgraded:
  libuv1
1 upgraded, 244 newly installed, 0 to remove and 67 not upgraded.
Need to get 8,704 kB of archives.
After this operation, 38.5 MB of additional disk space will be used.
Get:1 http://deb.debian.org/debian stretch/main amd64 gyp all 0.1+20150913git1f374df9-1 [266 kB]
Get:2 http://deb.debian.org/debian stretch-backports/main amd64 libc-ares2 amd64 1.14.0-1~bpo9+1 [85.8 kB]
Get:3 http://deb.debian.org/debian stretch-backports/main amd64 libhttp-parser2.8 amd64 2.8.1-1~bpo9+1 [20.6 kB]
Get:4 http://deb.debian.org/debian stretch/main amd64 libjs-is-typedarray all 1.0.0-2 [2,876 B]
Get:5 http://deb.debian.org/debian stretch/main amd64 libjs-node-uuid all 1.4.0-1 [12.6 kB]
Get:6 http://deb.debian.org/debian stretch-backports/main amd64 libuv1 amd64 1.34.2-1~bpo9+1 [126 kB]
Get:7 http://deb.debian.org/debian stretch-backports/main amd64 libuv1-dev amd64 1.34.2-1~bpo9+1 [147 kB]
Get:8 http://deb.debian.org/debian stretch-backports/main amd64 nodejs amd64 8.11.1~dfsg-2~bpo9+1 [4,802 kB]
Get:9 http://deb.debian.org/debian stretch-backports/main amd64 node-abbrev all 1.1.1-1~bpo9+1 [4,342 B]
Get:10 http://deb.debian.org/debian stretch/main amd64 node-jsonify all 0.0.0-1 [5,408 B]
Get:11 http://deb.debian.org/debian stretch/main amd64 node-json-stable-stringify all 1.0.1-1 [4,450 B]
Get:12 http://deb.debian.org/debian stretch/main amd64 node-co all 4.6.0-1 [7,550 B]
Get:13 http://deb.debian.org/debian stretch-backports/main amd64 node-ajv all 5.0.0-1~bpo9+1 [65.0 kB]
Get:14 http://deb.debian.org/debian stretch/main amd64 node-clone all 2.1.0-1 [7,474 B]
Get:15 http://deb.debian.org/debian stretch/main amd64 node-defaults all 1.0.3-1 [3,108 B]
Get:16 http://deb.debian.org/debian stretch/main amd64 node-wcwidth.js all 1.0.0-1 [6,408 B]
Get:17 http://deb.debian.org/debian stretch-backports/main amd64 node-ansi-regex all 3.0.0-1~bpo9+1 [3,742 B]
Get:18 http://deb.debian.org/debian stretch-backports/main amd64 node-strip-ansi all 4.0.0-1~bpo9+1 [3,174 B]
Get:19 http://deb.debian.org/debian stretch/main amd64 node-string-width all 2.0.0-1 [3,882 B]
Get:20 http://deb.debian.org/debian stretch-backports/main amd64 node-ansi-align all 2.0.0-1~bpo9+1 [4,716 B]
Get:21 http://deb.debian.org/debian stretch-backports/main amd64 node-color-name all 1.1.3-1~bpo9+1 [4,182 B]
Get:22 http://deb.debian.org/debian stretch-backports/main amd64 node-color-convert all 1.9.0-3~bpo9+1 [10.1 kB]
Get:23 http://deb.debian.org/debian stretch-backports/main amd64 node-ansi-styles all 3.2.0-1~bpo9+1 [5,332 B]
Get:24 http://deb.debian.org/debian stretch-backports/main amd64 node-ansistyles all 0.1.3-1~bpo9+1 [4,136 B]
Get:25 http://deb.debian.org/debian stretch-backports/main amd64 node-aproba all 1.2.0-1~bpo9+1 [5,080 B]
Get:26 http://deb.debian.org/debian stretch-backports/main amd64 node-delegates all 1.0.0-1~bpo9+1 [3,946 B]
Get:27 http://deb.debian.org/debian stretch-backports/main amd64 node-are-we-there-yet all 1.1.4-1~bpo9+1 [7,740 B]
Get:28 http://deb.debian.org/debian stretch-backports/main amd64 node-asn1 all 0.2.3-1~bpo9+1 [6,966 B]
Get:29 http://deb.debian.org/debian stretch-backports/main amd64 node-assert-plus all 1.0.0-1~bpo9+1 [6,276 B]
Get:30 http://deb.debian.org/debian stretch-backports/main amd64 node-asynckit all 0.4.0-2~bpo9+1 [10.4 kB]
Get:31 http://deb.debian.org/debian stretch-backports/main amd64 node-aws-sign2 all 0.7.1-1~bpo9+1 [3,786 B]
Get:32 http://deb.debian.org/debian stretch-backports/main amd64 node-aws4 all 1.8.0-1~bpo9+1 [11.7 kB]
Get:33 http://deb.debian.org/debian stretch-backports/main amd64 node-tweetnacl all 0.14.5+dfsg-2~bpo9+1 [20.9 kB]
Get:34 http://deb.debian.org/debian stretch-backports/main amd64 node-bcrypt-pbkdf all 1.0.1-1~bpo9+1 [10.4 kB]
Get:35 http://deb.debian.org/debian stretch-backports/main amd64 node-bluebird all 3.5.1+dfsg2-2~bpo9+1 [36.4 kB]
Get:36 http://deb.debian.org/debian stretch-backports/main amd64 node-camelcase all 4.1.0-1~bpo9+1 [3,532 B]
Get:37 http://deb.debian.org/debian stretch/main amd64 node-escape-string-regexp all 1.0.5-1 [3,218 B]
Get:38 http://deb.debian.org/debian stretch/main amd64 node-has-flag all 2.0.0-1 [3,172 B]
Get:39 http://deb.debian.org/debian stretch-backports/main amd64 node-supports-color all 4.4.0-2~bpo9+1 [4,802 B]
Get:40 http://deb.debian.org/debian stretch-backports/main amd64 node-chalk all 2.3.0-2~bpo9+1 [11.2 kB]
Get:41 http://deb.debian.org/debian stretch-backports/main amd64 node-cli-boxes all 1.0.0-1~bpo9+1 [3,272 B]
Get:42 http://deb.debian.org/debian stretch-backports/main amd64 node-yallist all 3.0.2-1~bpo9+1 [5,872 B]
Get:43 http://deb.debian.org/debian stretch/main amd64 node-pseudomap all 1.0.2-1 [3,504 B]
Get:44 http://deb.debian.org/debian stretch-backports/main amd64 node-lru-cache all 4.1.1-1~bpo9+1 [8,168 B]
Get:45 http://deb.debian.org/debian stretch/main amd64 node-isexe all 1.1.2-1 [3,948 B]
Get:46 http://deb.debian.org/debian stretch-backports/main amd64 node-which all 1.3.0-1~bpo9+1 [5,652 B]
Get:47 http://deb.debian.org/debian stretch/main amd64 node-cross-spawn-async all 2.2.5-2 [6,398 B]
Get:48 http://deb.debian.org/debian stretch/main amd64 node-cross-spawn all 4.0.2-1 [6,992 B]
Get:49 http://deb.debian.org/debian stretch/main amd64 node-is-stream all 1.1.0-1 [2,998 B]
Get:50 http://deb.debian.org/debian stretch/main amd64 node-get-stream all 3.0.0-1 [4,724 B]
Get:51 http://deb.debian.org/debian stretch/main amd64 node-strip-eof all 1.0.0-2 [3,010 B]
Get:52 http://deb.debian.org/debian stretch/main amd64 node-npm-run-path all 2.0.2-1 [3,502 B]
Get:53 http://deb.debian.org/debian stretch-backports/main amd64 node-signal-exit all 3.0.2-1~bpo9+1 [5,658 B]
Get:54 http://deb.debian.org/debian stretch/main amd64 node-execa all 0.5.0-1 [6,822 B]
Get:55 http://deb.debian.org/debian stretch-backports/main amd64 node-term-size all 1.2.0+dfsg-2~bpo9+1 [3,940 B]
Get:56 http://deb.debian.org/debian stretch-backports/main amd64 node-widest-line all 1.2.2-1~bpo9+1 [3,374 B]
Get:57 http://deb.debian.org/debian stretch-backports/main amd64 node-boxen all 1.2.2-1~bpo9+1 [4,828 B]
Get:58 http://deb.debian.org/debian stretch/main amd64 node-balanced-match all 0.4.2-1 [3,982 B]
Get:59 http://deb.debian.org/debian stretch/main amd64 node-concat-map all 0.0.1-1 [3,462 B]
Get:60 http://deb.debian.org/debian stretch-backports/main amd64 node-brace-expansion all 1.1.8-1~bpo9+1 [5,894 B]
Get:61 http://deb.debian.org/debian stretch/main amd64 node-builtin-modules all 1.1.1-1 [3,298 B]
Get:62 http://deb.debian.org/debian stretch-backports/main amd64 node-builtins all 1.0.3-1~bpo9+1 [3,070 B]
Get:63 http://deb.debian.org/debian stretch-backports/main amd64 node-chownr all 1.1.1-1~bpo9+1 [3,424 B]
Get:64 http://deb.debian.org/debian stretch-backports/main amd64 node-minimatch all 3.0.4-3~bpo9+1 [13.5 kB]
Get:65 http://deb.debian.org/debian stretch/main amd64 libjs-inherits all 2.0.3-1 [2,762 B]
Get:66 http://deb.debian.org/debian stretch/main amd64 node-inherits all 2.0.3-1 [3,744 B]
Get:67 http://deb.debian.org/debian stretch/main amd64 node-wrappy all 1.0.2-1 [3,114 B]
Get:68 http://deb.debian.org/debian stretch/main amd64 node-once all 1.4.0-2 [3,356 B]
Get:69 http://deb.debian.org/debian stretch/main amd64 node-fs.realpath all 1.0.0-1 [5,522 B]
Get:70 http://deb.debian.org/debian stretch-backports/main amd64 node-inflight all 1.0.6-1~bpo9+1 [3,424 B]
Get:71 http://deb.debian.org/debian stretch/main amd64 node-path-is-absolute all 1.0.0-1 [3,266 B]
Get:72 http://deb.debian.org/debian stretch-backports/main amd64 node-glob all 7.1.3-1~bpo9+1 [18.9 kB]
Get:73 http://deb.debian.org/debian stretch/main amd64 node-graceful-fs all 4.1.11-1 [10.8 kB]
Get:74 http://deb.debian.org/debian stretch/main amd64 node-typedarray all 0.0.6-1 [8,202 B]
Get:75 http://deb.debian.org/debian stretch/main amd64 node-concat-stream all 1.5.1-2 [5,164 B]
Get:76 http://deb.debian.org/debian stretch/main amd64 node-end-of-stream all 1.1.0-1 [3,506 B]
Get:77 http://deb.debian.org/debian stretch/main amd64 node-stream-shift all 1.0.0-1 [2,850 B]
Get:78 http://deb.debian.org/debian stretch/main amd64 node-duplexify all 3.5.0-1 [5,022 B]
Get:79 http://deb.debian.org/debian stretch-backports/main amd64 node-flush-write-stream all 1.0.2-2~bpo9+1 [3,756 B]
Get:80 http://deb.debian.org/debian stretch/main amd64 node-from2 all 2.3.0-1 [4,338 B]
Get:81 http://deb.debian.org/debian stretch-backports/main amd64 node-cyclist all 1.0.1-2~bpo9+1 [3,584 B]
Get:82 http://deb.debian.org/debian stretch-backports/main amd64 node-parallel-transform all 1.1.0-2~bpo9+1 [4,118 B]
Get:83 http://deb.debian.org/debian stretch-backports/main amd64 node-pump all 3.0.0-1~bpo9+1 [4,946 B]
Get:84 http://deb.debian.org/debian stretch-backports/main amd64 node-pumpify all 1.3.5-1~bpo9+1 [4,520 B]
Get:85 http://deb.debian.org/debian stretch-backports/main amd64 node-stream-each all 1.2.2-1~bpo9+1 [3,664 B]
Get:86 http://deb.debian.org/debian stretch/main amd64 node-xtend all 4.0.1-1 [3,194 B]
Get:87 http://deb.debian.org/debian stretch/main amd64 node-through2 all 2.0.3-1 [6,158 B]
Get:88 http://deb.debian.org/debian stretch-backports/main amd64 node-mississippi all 3.0.0-1~bpo9+1 [8,102 B]
Get:89 http://deb.debian.org/debian stretch-backports/main amd64 node-mkdirp all 0.5.1-1~bpo9+1 [4,776 B]
Get:90 http://deb.debian.org/debian stretch-backports/main amd64 node-run-queue all 1.0.3-1~bpo9+1 [4,528 B]
Get:91 http://deb.debian.org/debian stretch-backports/main amd64 node-rimraf all 2.6.2-1~bpo9+1 [8,166 B]
Get:92 http://deb.debian.org/debian stretch-backports/main amd64 node-imurmurhash all 0.1.4-1~bpo9+1 [8,248 B]
Get:93 http://deb.debian.org/debian stretch-backports/main amd64 node-iferr all 1.0.2-1~bpo9+1 [3,476 B]
Get:94 http://deb.debian.org/debian stretch-backports/main amd64 node-fs-write-stream-atomic all 1.0.10-4~bpo9+1 [4,790 B]
Get:95 http://deb.debian.org/debian stretch-backports/main amd64 node-copy-concurrently all 1.0.5-4~bpo9+1 [6,500 B]
Get:96 http://deb.debian.org/debian stretch-backports/main amd64 node-move-concurrently all 1.0.1-1~bpo9+1 [4,502 B]
Get:97 http://deb.debian.org/debian stretch-backports/main amd64 node-promise-inflight all 1.0.1-1~bpo9+1 [3,208 B]
Get:98 http://deb.debian.org/debian stretch-backports/main amd64 node-safe-buffer all 5.1.2-1~bpo9+1 [12.2 kB]
Get:99 http://deb.debian.org/debian stretch-backports/main amd64 node-ssri all 5.2.4-2~bpo9+1 [14.1 kB]
Get:100 http://deb.debian.org/debian stretch-backports/main amd64 node-unique-filename all 1.1.0+ds-2~bpo9+1 [4,414 B]
Get:101 http://deb.debian.org/debian stretch/main amd64 node-y18n all 3.2.1-2 [4,708 B]
Get:102 http://deb.debian.org/debian stretch-backports/main amd64 node-cacache all 10.0.4-1~bpo9+1 [26.7 kB]
Get:103 http://deb.debian.org/debian stretch-backports/main amd64 node-call-limit all 1.1.0-1~bpo9+1 [3,588 B]
Get:104 http://deb.debian.org/debian stretch-backports/main amd64 node-caseless all 0.12.0-1~bpo9+1 [3,452 B]
Get:105 http://deb.debian.org/debian stretch/main amd64 node-wrap-ansi all 2.0.0-1 [4,780 B]
Get:106 http://deb.debian.org/debian stretch/main amd64 node-cliui all 3.2.0-2 [6,868 B]
Get:107 http://deb.debian.org/debian stretch/main amd64 node-delayed-stream all 0.0.5-1 [4,482 B]
Get:108 http://deb.debian.org/debian stretch-backports/main amd64 node-combined-stream all 1.0.6-1~bpo9+1 [5,860 B]
Get:109 http://deb.debian.org/debian stretch-backports/main amd64 node-proto-list all 1.2.4-1~bpo9+1 [3,166 B]
Get:110 http://deb.debian.org/debian stretch-backports/main amd64 node-ini all 1.3.5-1~bpo9+1 [5,738 B]
Get:111 http://deb.debian.org/debian stretch-backports/main amd64 node-config-chain all 1.1.11-1~bpo9+1 [7,654 B]
Get:112 http://deb.debian.org/debian stretch-backports/main amd64 node-console-control-strings all 1.1.0-1~bpo9+1 [5,108 B]
Get:113 http://deb.debian.org/debian stretch/main amd64 node-core-util-is all 1.0.2-1 [3,410 B]
Get:114 http://deb.debian.org/debian stretch-backports/main amd64 node-dashdash all 1.14.1-2~bpo9+1 [22.2 kB]
Get:115 http://deb.debian.org/debian stretch/main amd64 node-decamelize all 1.2.0-1 [3,044 B]
Get:116 http://deb.debian.org/debian stretch-backports/main amd64 node-mimic-response all 1.0.0-1~bpo9+1 [3,416 B]
Get:117 http://deb.debian.org/debian stretch-backports/main amd64 node-decompress-response all 3.3.0-1~bpo9+1 [3,378 B]
Get:118 http://deb.debian.org/debian stretch/main amd64 node-deep-extend all 0.4.1-1 [4,654 B]
Get:119 http://deb.debian.org/debian stretch/main amd64 node-detect-indent all 5.0.0-1 [4,392 B]
Get:120 http://deb.debian.org/debian stretch/main amd64 node-detect-newline all 2.1.0-1 [2,972 B]
Get:121 http://deb.debian.org/debian stretch-backports/main amd64 node-duplexer3 all 0.1.4-2~bpo9+1 [4,340 B]
Get:122 http://deb.debian.org/debian stretch-backports/main amd64 node-jsbn all 1.1.0-1~bpo9+1 [13.6 kB]
Get:123 http://deb.debian.org/debian stretch-backports/main amd64 node-ecc-jsbn all 0.1.1-1~bpo9+1 [8,918 B]
Get:124 http://deb.debian.org/debian stretch-backports/main amd64 node-editor all 1.0.0-1~bpo9+1 [3,424 B]
Get:125 http://deb.debian.org/debian stretch-backports/main amd64 node-prr all 1.0.1-1~bpo9+1 [3,774 B]
Get:126 http://deb.debian.org/debian stretch-backports/main amd64 node-errno all 0.1.4-1~bpo9+1 [6,644 B]
Get:127 http://deb.debian.org/debian stretch-backports/main amd64 node-extend all 3.0.2-1~bpo9+1 [6,730 B]
Get:128 http://deb.debian.org/debian stretch-backports/main amd64 node-extsprintf all 1.3.0-1~bpo9+1 [4,540 B]
Get:129 http://deb.debian.org/debian stretch-backports/main amd64 node-p-limit all 1.1.0-1~bpo9+1 [3,500 B]
Get:130 http://deb.debian.org/debian stretch-backports/main amd64 node-p-locate all 2.0.0-1~bpo9+1 [4,074 B]
Get:131 http://deb.debian.org/debian stretch/main amd64 node-path-exists all 3.0.0-1 [3,154 B]
Get:132 http://deb.debian.org/debian stretch-backports/main amd64 node-locate-path all 2.0.0-1~bpo9+1 [3,840 B]
Get:133 http://deb.debian.org/debian stretch-backports/main amd64 node-find-up all 2.1.0-1~bpo9+1 [3,636 B]
Get:134 http://deb.debian.org/debian stretch-backports/main amd64 node-forever-agent all 0.6.1-1~bpo9+1 [3,524 B]
Get:135 http://deb.debian.org/debian stretch-backports/main amd64 node-mime-types all 2.1.20-1~bpo9+1 [16.3 kB]
Get:136 http://deb.debian.org/debian stretch-backports/main amd64 node-form-data all 2.3.2-2~bpo9+1 [9,998 B]
Get:137 http://deb.debian.org/debian stretch-backports/main amd64 node-path-is-inside all 1.0.2-1~bpo9+1 [4,058 B]
Get:138 http://deb.debian.org/debian stretch-backports/main amd64 node-fs-vacuum all 1.2.10-2~bpo9+1 [4,228 B]
Get:139 http://deb.debian.org/debian stretch/main amd64 node-object-assign all 4.1.0-1 [3,824 B]
Get:140 http://deb.debian.org/debian stretch-backports/main amd64 node-has-unicode all 2.0.1-2~bpo9+1 [3,602 B]
Get:141 http://deb.debian.org/debian stretch-backports/main amd64 node-wide-align all 1.1.0-1~bpo9+1 [3,636 B]
Get:142 http://deb.debian.org/debian stretch-backports/main amd64 node-gauge all 2.7.4-1~bpo9+1 [25.3 kB]
Get:143 http://deb.debian.org/debian stretch/main amd64 node-get-caller-file all 1.0.2-1 [2,814 B]
Get:144 http://deb.debian.org/debian stretch-backports/main amd64 node-getpass all 0.1.7-1~bpo9+1 [4,230 B]
Get:145 http://deb.debian.org/debian stretch-backports/main amd64 node-is-retry-allowed all 1.1.0-1~bpo9+1 [3,382 B]
Get:146 http://deb.debian.org/debian stretch-backports/main amd64 node-p-cancelable all 0.3.0-1~bpo9+1 [4,410 B]
Get:147 http://deb.debian.org/debian stretch-backports/main amd64 node-p-finally all 1.0.0-2~bpo9+1 [3,302 B]
Get:148 http://deb.debian.org/debian stretch-backports/main amd64 node-p-timeout all 1.2.0-1~bpo9+1 [3,752 B]
Get:149 http://deb.debian.org/debian stretch-backports/main amd64 node-is-plain-obj all 1.1.0-1~bpo9+1 [3,002 B]
Get:150 http://deb.debian.org/debian stretch-backports/main amd64 node-url-to-options all 1.0.1-1~bpo9+1 [3,260 B]
Get:151 http://deb.debian.org/debian stretch-backports/main amd64 node-timed-out all 4.0.1-2~bpo9+1 [3,878 B]
Get:152 http://deb.debian.org/debian stretch-backports/main amd64 node-lowercase-keys all 1.0.0-2~bpo9+1 [3,096 B]
Get:153 http://deb.debian.org/debian stretch-backports/main amd64 node-is-object all 1.0.1-1~bpo9+1 [3,408 B]
Get:154 http://deb.debian.org/debian stretch-backports/main amd64 node-has-symbol-support-x all 1.4.1+dfsg-1~bpo9+1 [4,034 B]
Get:155 http://deb.debian.org/debian stretch-backports/main amd64 node-has-to-string-tag-x all 1.4.1+dfsg-1~bpo9+1 [4,152 B]
Get:156 http://deb.debian.org/debian stretch-backports/main amd64 node-isurl all 1.0.0-1~bpo9+1 [3,686 B]
Get:157 http://deb.debian.org/debian stretch-backports/main amd64 node-prepend-http all 2.0.0-1~bpo9+1 [3,262 B]
Get:158 http://deb.debian.org/debian stretch-backports/main amd64 node-url-parse-lax all 1.0.0-1~bpo9+1 [3,330 B]
Get:159 http://deb.debian.org/debian stretch-backports/main amd64 node-got all 7.1.0-1~bpo9+1 [11.8 kB]
Get:160 http://deb.debian.org/debian stretch-backports/main amd64 nodejs-dev amd64 8.11.1~dfsg-2~bpo9+1 [353 kB]
Get:161 http://deb.debian.org/debian stretch/main amd64 node-fstream all 1.0.10-1+deb9u1 [18.2 kB]
Get:162 http://deb.debian.org/debian stretch/main amd64 node-nopt all 3.0.6-3 [9,538 B]
Get:163 http://deb.debian.org/debian stretch/main amd64 node-set-blocking all 2.0.0-1 [3,806 B]
Get:164 http://deb.debian.org/debian stretch-backports/main amd64 node-npmlog all 4.1.2-1~bpo9+1 [8,594 B]
Get:165 http://deb.debian.org/debian stretch-backports/main amd64 node-osenv all 0.1.5-1~bpo9+1 [4,314 B]
Get:166 http://deb.debian.org/debian stretch-backports/main amd64 node-har-schema all 2.0.0-1~bpo9+1 [5,352 B]
Get:167 http://deb.debian.org/debian stretch-backports/main amd64 node-har-validator all 5.1.0-1~bpo9+1 [4,544 B]
Get:168 http://deb.debian.org/debian stretch-backports/main amd64 node-json-schema all 0.2.3-1~bpo9+1 [7,116 B]
Get:169 http://deb.debian.org/debian stretch-backports/main amd64 node-verror all 1.10.0-1~bpo9+1 [14.0 kB]
Get:170 http://deb.debian.org/debian stretch-backports/main amd64 node-jsprim all 1.4.0-1~bpo9+1 [13.2 kB]
Get:171 http://deb.debian.org/debian stretch-backports/main amd64 node-sshpk all 1.13.1+dfsg-1~bpo9+1 [44.2 kB]
Get:172 http://deb.debian.org/debian stretch-backports/main amd64 node-http-signature all 1.2.0-1~bpo9+1 [11.1 kB]
Get:173 http://deb.debian.org/debian stretch/main amd64 node-is-typedarray all 1.0.0-2 [2,422 B]
Get:174 http://deb.debian.org/debian stretch/main amd64 node-isstream all 0.1.2+dfsg-1 [3,546 B]
Get:175 http://deb.debian.org/debian stretch-backports/main amd64 node-json-stringify-safe all 5.0.1-1~bpo9+1 [4,104 B]
Get:176 http://deb.debian.org/debian stretch-backports/main amd64 node-oauth-sign all 0.9.0-1~bpo9+1 [3,662 B]
Get:177 http://deb.debian.org/debian stretch-backports/main amd64 node-performance-now all 2.1.0+debian-1~bpo9+1 [4,536 B]
Get:178 http://deb.debian.org/debian stretch-backports/main amd64 node-qs all 6.5.2-1~bpo9+1 [16.4 kB]
Get:179 http://deb.debian.org/debian stretch/main amd64 node-punycode all 2.0.1-1 [8,938 B]
Get:180 http://deb.debian.org/debian stretch-backports/main amd64 node-tough-cookie all 2.3.4+dfsg-1~bpo9+1 [56.0 kB]
Get:181 http://deb.debian.org/debian stretch-backports/main amd64 node-tunnel-agent all 0.6.1-1~bpo9+1 [4,278 B]
Get:182 http://deb.debian.org/debian stretch/main amd64 node-node-uuid all 1.4.0-1 [9,194 B]
Get:183 http://deb.debian.org/debian stretch-backports/main amd64 node-request all 2.88.1-2~bpo9+1 [53.9 kB]
Get:184 http://deb.debian.org/debian stretch-backports/main amd64 node-semver all 5.5.1-1~bpo9+1 [23.9 kB]
Get:185 http://deb.debian.org/debian stretch-backports/main amd64 node-tar all 4.4.6+ds1-3~bpo9+1 [31.9 kB]
Get:186 http://deb.debian.org/debian stretch-backports/main amd64 node-gyp all 3.6.2-2~bpo9+1 [34.7 kB]
Get:187 http://deb.debian.org/debian stretch-backports/main amd64 node-hosted-git-info all 2.7.1-1~bpo9+1 [8,290 B]
Get:188 http://deb.debian.org/debian stretch/main amd64 node-iconv-lite all 0.4.13-2 [122 kB]
Get:189 http://deb.debian.org/debian stretch-backports/main amd64 node-import-lazy all 3.0.0.REALLY.2.1.0-1~bpo9+1 [3,986 B]
Get:190 http://deb.debian.org/debian stretch/main amd64 node-invert-kv all 1.0.0-1 [2,862 B]
Get:191 http://deb.debian.org/debian stretch/main amd64 node-is-builtin-module all 1.0.0-1 [2,860 B]
Get:192 http://deb.debian.org/debian stretch-backports/main amd64 node-is-npm all 1.0.0-1~bpo9+1 [2,854 B]
Get:193 http://deb.debian.org/debian stretch-backports/main amd64 node-json-parse-better-errors all 1.0.2-2~bpo9+1 [5,050 B]
Get:194 http://deb.debian.org/debian stretch/main amd64 node-through all 2.3.8-1 [4,182 B]
Get:195 http://deb.debian.org/debian stretch/main amd64 node-jsonparse all 1.2.0-1 [6,008 B]
Get:196 http://deb.debian.org/debian stretch-backports/main amd64 node-jsonstream all 1.3.2-1~bpo9+1 [8,098 B]
Get:197 http://deb.debian.org/debian stretch/main amd64 node-minimist all 1.2.0-1 [5,588 B]
Get:198 http://deb.debian.org/debian stretch/main amd64 node-strip-json-comments all 2.0.1-1 [3,730 B]
Get:199 http://deb.debian.org/debian stretch/main amd64 node-rc all 1.1.6-2 [6,058 B]
Get:200 http://deb.debian.org/debian stretch-backports/main amd64 node-registry-url all 3.1.0-1~bpo9+1 [3,258 B]
Get:201 http://deb.debian.org/debian stretch-backports/main amd64 node-registry-auth-token all 3.3.1-1~bpo9+1 [5,724 B]
Get:202 http://deb.debian.org/debian stretch-backports/main amd64 node-package-json all 4.0.1-1~bpo9+1 [4,190 B]
Get:203 http://deb.debian.org/debian stretch-backports/main amd64 node-latest-version all 3.1.0-1~bpo9+1 [3,132 B]
Get:204 http://deb.debian.org/debian stretch-backports/main amd64 node-lazy-property all 1.0.0-3~bpo9+1 [3,540 B]
Get:205 http://deb.debian.org/debian stretch/main amd64 node-lcid all 1.0.0-1 [4,232 B]
Get:206 http://deb.debian.org/debian stretch-backports/main amd64 node-validate-npm-package-name all 3.0.0-1~bpo9+1 [4,454 B]
Get:207 http://deb.debian.org/debian stretch-backports/main amd64 node-npm-package-arg all 6.0.0-2~bpo9+1 [6,730 B]
Get:208 http://deb.debian.org/debian stretch/main amd64 node-require-directory all 2.1.1-1 [5,364 B]
Get:209 http://deb.debian.org/debian stretch/main amd64 node-require-main-filename all 1.0.1-1 [3,152 B]
Get:210 http://deb.debian.org/debian stretch-backports/main amd64 node-which-module all 2.0.0-1~bpo9+1 [3,778 B]
Get:211 http://deb.debian.org/debian stretch/main amd64 node-mimic-fn all 1.1.0-1 [3,070 B]
Get:212 http://deb.debian.org/debian stretch/main amd64 node-mem all 1.1.0-1 [4,076 B]
Get:213 http://deb.debian.org/debian stretch/main amd64 node-os-locale all 2.0.0-1 [3,702 B]
Get:214 http://deb.debian.org/debian stretch-backports/main amd64 node-yargs-parser all 8.0.0-1~bpo9+1 [13.8 kB]
Get:215 http://deb.debian.org/debian stretch-backports/main amd64 node-yargs all 10.0.3-2~bpo9+1 [57.2 kB]
Get:216 http://deb.debian.org/debian stretch-backports/main amd64 node-libnpx all 10.2.0-2~bpo9+1 [44.1 kB]
Get:217 http://deb.debian.org/debian stretch-backports/main amd64 node-lockfile all 1.0.4-1~bpo9+1 [7,252 B]
Get:218 http://deb.debian.org/debian stretch/main amd64 node-spdx-license-ids all 1.2.2-1 [4,754 B]
Get:219 http://deb.debian.org/debian stretch/main amd64 node-spdx-correct all 1.0.2-1 [3,678 B]
Get:220 http://deb.debian.org/debian stretch/main amd64 node-spdx-expression-parse all 1.0.4-1 [12.1 kB]
Get:221 http://deb.debian.org/debian stretch/main amd64 node-validate-npm-package-license all 3.0.1-1 [3,442 B]
Get:222 http://deb.debian.org/debian stretch-backports/main amd64 node-normalize-package-data all 2.4.0-1~bpo9+1 [10.8 kB]
Get:223 http://deb.debian.org/debian stretch-backports/main amd64 node-opener all 1.4.3-1~bpo9+1 [4,190 B]
Get:224 http://deb.debian.org/debian stretch/main amd64 node-mute-stream all 0.0.7-1 [4,344 B]
Get:225 http://deb.debian.org/debian stretch/main amd64 node-read all 1.0.7-1 [4,540 B]
Get:226 http://deb.debian.org/debian stretch-backports/main amd64 node-promzard all 0.3.0-1~bpo9+1 [9,008 B]
Get:227 http://deb.debian.org/debian stretch-backports/main amd64 node-qw all 1.0.1-1~bpo9+1 [3,146 B]
Get:228 http://deb.debian.org/debian stretch/main amd64 node-slash all 1.0.0-1 [2,976 B]
Get:229 http://deb.debian.org/debian stretch-backports/main amd64 node-read-package-json all 2.0.13-1~bpo9+1 [8,376 B]
Get:230 http://deb.debian.org/debian stretch-backports/main amd64 node-resolve-from all 4.0.0-1~bpo9+1 [3,672 B]
Get:231 http://deb.debian.org/debian stretch-backports/main amd64 node-retry all 0.10.1-1~bpo9+1 [7,986 B]
Get:232 http://deb.debian.org/debian stretch-backports/main amd64 node-semver-diff all 2.1.0-2~bpo9+1 [3,336 B]
Get:233 http://deb.debian.org/debian stretch-backports/main amd64 node-sha all 2.0.1-1~bpo9+1 [4,318 B]
Get:234 http://deb.debian.org/debian stretch-backports/main amd64 node-slide all 1.1.6-1~bpo9+1 [6,164 B]
Get:235 http://deb.debian.org/debian stretch/main amd64 node-sorted-object all 2.0.1-1 [3,686 B]
Get:236 http://deb.debian.org/debian stretch-backports/main amd64 node-stream-iterate all 1.2.0-4~bpo9+1 [3,710 B]
Get:237 http://deb.debian.org/debian stretch-backports/main amd64 node-text-table all 0.2.0-2~bpo9+1 [4,294 B]
Get:238 http://deb.debian.org/debian stretch/main amd64 node-uid-number all 0.0.6-1 [3,068 B]
Get:239 http://deb.debian.org/debian stretch/main amd64 node-unpipe all 1.0.0-1 [3,582 B]
Get:240 http://deb.debian.org/debian stretch-backports/main amd64 node-write-file-atomic all 2.3.0-1~bpo9+1 [4,990 B]
Get:241 http://deb.debian.org/debian stretch-backports/main amd64 node-xdg-basedir all 3.0.0-1~bpo9+1 [3,646 B]
Get:242 http://deb.debian.org/debian stretch/main amd64 node-archy all 1.0.0-1 [4,052 B]
Get:243 http://deb.debian.org/debian stretch/main amd64 node-encoding all 0.1.12-2 [4,262 B]
Get:244 http://deb.debian.org/debian stretch/main amd64 node-ansi all 0.3.0-2 [8,608 B]
Get:245 http://deb.debian.org/debian stretch-backports/main amd64 npm all 5.8.0+ds6-2~bpo9+1 [1,024 kB]

Extracting templates from packages: 12%
Extracting templates from packages: 24%
Extracting templates from packages: 36%
Extracting templates from packages: 48%
Extracting templates from packages: 61%
Extracting templates from packages: 73%
Extracting templates from packages: 85%
Extracting templates from packages: 97%
Extracting templates from packages: 100%
Fetched 8,704 kB in 2s (3,697 kB/s)
Selecting previously unselected package gyp.
(Reading database ... 65708 files and directories currently installed.)
Preparing to unpack .../000-gyp_0.1+20150913git1f374df9-1_all.deb ...
Unpacking gyp (0.1+20150913git1f374df9-1) ...
Selecting previously unselected package libc-ares2:amd64.
Preparing to unpack .../001-libc-ares2_1.14.0-1~bpo9+1_amd64.deb ...
Unpacking libc-ares2:amd64 (1.14.0-1~bpo9+1) ...
Selecting previously unselected package libhttp-parser2.8:amd64.
Preparing to unpack .../002-libhttp-parser2.8_2.8.1-1~bpo9+1_amd64.deb ...
Unpacking libhttp-parser2.8:amd64 (2.8.1-1~bpo9+1) ...
Selecting previously unselected package libjs-is-typedarray.
Preparing to unpack .../003-libjs-is-typedarray_1.0.0-2_all.deb ...
Unpacking libjs-is-typedarray (1.0.0-2) ...
Selecting previously unselected package libjs-node-uuid.
Preparing to unpack .../004-libjs-node-uuid_1.4.0-1_all.deb ...
Unpacking libjs-node-uuid (1.4.0-1) ...
Preparing to unpack .../005-libuv1_1.34.2-1~bpo9+1_amd64.deb ...
Unpacking libuv1:amd64 (1.34.2-1~bpo9+1) over (1.9.1-3) ...
Selecting previously unselected package libuv1-dev:amd64.
Preparing to unpack .../006-libuv1-dev_1.34.2-1~bpo9+1_amd64.deb ...
Unpacking libuv1-dev:amd64 (1.34.2-1~bpo9+1) ...
Selecting previously unselected package nodejs.
Preparing to unpack .../007-nodejs_8.11.1~dfsg-2~bpo9+1_amd64.deb ...
Unpacking nodejs (8.11.1~dfsg-2~bpo9+1) ...
Selecting previously unselected package node-abbrev.
Preparing to unpack .../008-node-abbrev_1.1.1-1~bpo9+1_all.deb ...
Unpacking node-abbrev (1.1.1-1~bpo9+1) ...
Selecting previously unselected package node-jsonify.
Preparing to unpack .../009-node-jsonify_0.0.0-1_all.deb ...
Unpacking node-jsonify (0.0.0-1) ...
Selecting previously unselected package node-json-stable-stringify.
Preparing to unpack .../010-node-json-stable-stringify_1.0.1-1_all.deb ...
Unpacking node-json-stable-stringify (1.0.1-1) ...
Selecting previously unselected package node-co.
Preparing to unpack .../011-node-co_4.6.0-1_all.deb ...
Unpacking node-co (4.6.0-1) ...
Selecting previously unselected package node-ajv.
Preparing to unpack .../012-node-ajv_5.0.0-1~bpo9+1_all.deb ...
Unpacking node-ajv (5.0.0-1~bpo9+1) ...
Selecting previously unselected package node-clone.
Preparing to unpack .../013-node-clone_2.1.0-1_all.deb ...
Unpacking node-clone (2.1.0-1) ...
Selecting previously unselected package node-defaults.
Preparing to unpack .../014-node-defaults_1.0.3-1_all.deb ...
Unpacking node-defaults (1.0.3-1) ...
Selecting previously unselected package node-wcwidth.js.
Preparing to unpack .../015-node-wcwidth.js_1.0.0-1_all.deb ...
Unpacking node-wcwidth.js (1.0.0-1) ...
Selecting previously unselected package node-ansi-regex.
Preparing to unpack .../016-node-ansi-regex_3.0.0-1~bpo9+1_all.deb ...
Unpacking node-ansi-regex (3.0.0-1~bpo9+1) ...
Selecting previously unselected package node-strip-ansi.
Preparing to unpack .../017-node-strip-ansi_4.0.0-1~bpo9+1_all.deb ...
Unpacking node-strip-ansi (4.0.0-1~bpo9+1) ...
Selecting previously unselected package node-string-width.
Preparing to unpack .../018-node-string-width_2.0.0-1_all.deb ...
Unpacking node-string-width (2.0.0-1) ...
Selecting previously unselected package node-ansi-align.
Preparing to unpack .../019-node-ansi-align_2.0.0-1~bpo9+1_all.deb ...
Unpacking node-ansi-align (2.0.0-1~bpo9+1) ...
Selecting previously unselected package node-color-name.
Preparing to unpack .../020-node-color-name_1.1.3-1~bpo9+1_all.deb ...
Unpacking node-color-name (1.1.3-1~bpo9+1) ...
Selecting previously unselected package node-color-convert.
Preparing to unpack .../021-node-color-convert_1.9.0-3~bpo9+1_all.deb ...
Unpacking node-color-convert (1.9.0-3~bpo9+1) ...
Selecting previously unselected package node-ansi-styles.
Preparing to unpack .../022-node-ansi-styles_3.2.0-1~bpo9+1_all.deb ...
Unpacking node-ansi-styles (3.2.0-1~bpo9+1) ...
Selecting previously unselected package node-ansistyles.
Preparing to unpack .../023-node-ansistyles_0.1.3-1~bpo9+1_all.deb ...
Unpacking node-ansistyles (0.1.3-1~bpo9+1) ...
Selecting previously unselected package node-aproba.
Preparing to unpack .../024-node-aproba_1.2.0-1~bpo9+1_all.deb ...
Unpacking node-aproba (1.2.0-1~bpo9+1) ...
Selecting previously unselected package node-delegates.
Preparing to unpack .../025-node-delegates_1.0.0-1~bpo9+1_all.deb ...
Unpacking node-delegates (1.0.0-1~bpo9+1) ...
Selecting previously unselected package node-are-we-there-yet.
Preparing to unpack .../026-node-are-we-there-yet_1.1.4-1~bpo9+1_all.deb ...
Unpacking node-are-we-there-yet (1.1.4-1~bpo9+1) ...
Selecting previously unselected package node-asn1.
Preparing to unpack .../027-node-asn1_0.2.3-1~bpo9+1_all.deb ...
Unpacking node-asn1 (0.2.3-1~bpo9+1) ...
Selecting previously unselected package node-assert-plus.
Preparing to unpack .../028-node-assert-plus_1.0.0-1~bpo9+1_all.deb ...
Unpacking node-assert-plus (1.0.0-1~bpo9+1) ...
Selecting previously unselected package node-asynckit.
Preparing to unpack .../029-node-asynckit_0.4.0-2~bpo9+1_all.deb ...
Unpacking node-asynckit (0.4.0-2~bpo9+1) ...
Selecting previously unselected package node-aws-sign2.
Preparing to unpack .../030-node-aws-sign2_0.7.1-1~bpo9+1_all.deb ...
Unpacking node-aws-sign2 (0.7.1-1~bpo9+1) ...
Selecting previously unselected package node-aws4.
Preparing to unpack .../031-node-aws4_1.8.0-1~bpo9+1_all.deb ...
Unpacking node-aws4 (1.8.0-1~bpo9+1) ...
Selecting previously unselected package node-tweetnacl.
Preparing to unpack .../032-node-tweetnacl_0.14.5+dfsg-2~bpo9+1_all.deb ...
Unpacking node-tweetnacl (0.14.5+dfsg-2~bpo9+1) ...
Selecting previously unselected package node-bcrypt-pbkdf.
Preparing to unpack .../033-node-bcrypt-pbkdf_1.0.1-1~bpo9+1_all.deb ...
Unpacking node-bcrypt-pbkdf (1.0.1-1~bpo9+1) ...
Selecting previously unselected package node-bluebird.
Preparing to unpack .../034-node-bluebird_3.5.1+dfsg2-2~bpo9+1_all.deb ...
Unpacking node-bluebird (3.5.1+dfsg2-2~bpo9+1) ...
Selecting previously unselected package node-camelcase.
Preparing to unpack .../035-node-camelcase_4.1.0-1~bpo9+1_all.deb ...
Unpacking node-camelcase (4.1.0-1~bpo9+1) ...
Selecting previously unselected package node-escape-string-regexp.
Preparing to unpack .../036-node-escape-string-regexp_1.0.5-1_all.deb ...
Unpacking node-escape-string-regexp (1.0.5-1) ...
Selecting previously unselected package node-has-flag.
Preparing to unpack .../037-node-has-flag_2.0.0-1_all.deb ...
Unpacking node-has-flag (2.0.0-1) ...
Selecting previously unselected package node-supports-color.
Preparing to unpack .../038-node-supports-color_4.4.0-2~bpo9+1_all.deb ...
Unpacking node-supports-color (4.4.0-2~bpo9+1) ...
Selecting previously unselected package node-chalk.
Preparing to unpack .../039-node-chalk_2.3.0-2~bpo9+1_all.deb ...
Unpacking node-chalk (2.3.0-2~bpo9+1) ...
Selecting previously unselected package node-cli-boxes.
Preparing to unpack .../040-node-cli-boxes_1.0.0-1~bpo9+1_all.deb ...
Unpacking node-cli-boxes (1.0.0-1~bpo9+1) ...
Selecting previously unselected package node-yallist.
Preparing to unpack .../041-node-yallist_3.0.2-1~bpo9+1_all.deb ...
Unpacking node-yallist (3.0.2-1~bpo9+1) ...
Selecting previously unselected package node-pseudomap.
Preparing to unpack .../042-node-pseudomap_1.0.2-1_all.deb ...
Unpacking node-pseudomap (1.0.2-1) ...
Selecting previously unselected package node-lru-cache.
Preparing to unpack .../043-node-lru-cache_4.1.1-1~bpo9+1_all.deb ...
Unpacking node-lru-cache (4.1.1-1~bpo9+1) ...
Selecting previously unselected package node-isexe.
Preparing to unpack .../044-node-isexe_1.1.2-1_all.deb ...
Unpacking node-isexe (1.1.2-1) ...
Selecting previously unselected package node-which.
Preparing to unpack .../045-node-which_1.3.0-1~bpo9+1_all.deb ...
Unpacking node-which (1.3.0-1~bpo9+1) ...
Selecting previously unselected package node-cross-spawn-async.
Preparing to unpack .../046-node-cross-spawn-async_2.2.5-2_all.deb ...
Unpacking node-cross-spawn-async (2.2.5-2) ...
Selecting previously unselected package node-cross-spawn.
Preparing to unpack .../047-node-cross-spawn_4.0.2-1_all.deb ...
Unpacking node-cross-spawn (4.0.2-1) ...
Selecting previously unselected package node-is-stream.
Preparing to unpack .../048-node-is-stream_1.1.0-1_all.deb ...
Unpacking node-is-stream (1.1.0-1) ...
Selecting previously unselected package node-get-stream.
Preparing to unpack .../049-node-get-stream_3.0.0-1_all.deb ...
Unpacking node-get-stream (3.0.0-1) ...
Selecting previously unselected package node-strip-eof.
Preparing to unpack .../050-node-strip-eof_1.0.0-2_all.deb ...
Unpacking node-strip-eof (1.0.0-2) ...
Selecting previously unselected package node-npm-run-path.
Preparing to unpack .../051-node-npm-run-path_2.0.2-1_all.deb ...
Unpacking node-npm-run-path (2.0.2-1) ...
Selecting previously unselected package node-signal-exit.
Preparing to unpack .../052-node-signal-exit_3.0.2-1~bpo9+1_all.deb ...
Unpacking node-signal-exit (3.0.2-1~bpo9+1) ...
Selecting previously unselected package node-execa.
Preparing to unpack .../053-node-execa_0.5.0-1_all.deb ...
Unpacking node-execa (0.5.0-1) ...
Selecting previously unselected package node-term-size.
Preparing to unpack .../054-node-term-size_1.2.0+dfsg-2~bpo9+1_all.deb ...
Unpacking node-term-size (1.2.0+dfsg-2~bpo9+1) ...
Selecting previously unselected package node-widest-line.
Preparing to unpack .../055-node-widest-line_1.2.2-1~bpo9+1_all.deb ...
Unpacking node-widest-line (1.2.2-1~bpo9+1) ...
Selecting previously unselected package node-boxen.
Preparing to unpack .../056-node-boxen_1.2.2-1~bpo9+1_all.deb ...
Unpacking node-boxen (1.2.2-1~bpo9+1) ...
Selecting previously unselected package node-balanced-match.
Preparing to unpack .../057-node-balanced-match_0.4.2-1_all.deb ...
Unpacking node-balanced-match (0.4.2-1) ...
Selecting previously unselected package node-concat-map.
Preparing to unpack .../058-node-concat-map_0.0.1-1_all.deb ...
Unpacking node-concat-map (0.0.1-1) ...
Selecting previously unselected package node-brace-expansion.
Preparing to unpack .../059-node-brace-expansion_1.1.8-1~bpo9+1_all.deb ...
Unpacking node-brace-expansion (1.1.8-1~bpo9+1) ...
Selecting previously unselected package node-builtin-modules.
Preparing to unpack .../060-node-builtin-modules_1.1.1-1_all.deb ...
Unpacking node-builtin-modules (1.1.1-1) ...
Selecting previously unselected package node-builtins.
Preparing to unpack .../061-node-builtins_1.0.3-1~bpo9+1_all.deb ...
Unpacking node-builtins (1.0.3-1~bpo9+1) ...
Selecting previously unselected package node-chownr.
Preparing to unpack .../062-node-chownr_1.1.1-1~bpo9+1_all.deb ...
Unpacking node-chownr (1.1.1-1~bpo9+1) ...
Selecting previously unselected package node-minimatch.
Preparing to unpack .../063-node-minimatch_3.0.4-3~bpo9+1_all.deb ...
Unpacking node-minimatch (3.0.4-3~bpo9+1) ...
Selecting previously unselected package libjs-inherits.
Preparing to unpack .../064-libjs-inherits_2.0.3-1_all.deb ...
Unpacking libjs-inherits (2.0.3-1) ...
Selecting previously unselected package node-inherits.
Preparing to unpack .../065-node-inherits_2.0.3-1_all.deb ...
Unpacking node-inherits (2.0.3-1) ...
Selecting previously unselected package node-wrappy.
Preparing to unpack .../066-node-wrappy_1.0.2-1_all.deb ...
Unpacking node-wrappy (1.0.2-1) ...
Selecting previously unselected package node-once.
Preparing to unpack .../067-node-once_1.4.0-2_all.deb ...
Unpacking node-once (1.4.0-2) ...
Selecting previously unselected package node-fs.realpath.
Preparing to unpack .../068-node-fs.realpath_1.0.0-1_all.deb ...
Unpacking node-fs.realpath (1.0.0-1) ...
Selecting previously unselected package node-inflight.
Preparing to unpack .../069-node-inflight_1.0.6-1~bpo9+1_all.deb ...
Unpacking node-inflight (1.0.6-1~bpo9+1) ...
Selecting previously unselected package node-path-is-absolute.
Preparing to unpack .../070-node-path-is-absolute_1.0.0-1_all.deb ...
Unpacking node-path-is-absolute (1.0.0-1) ...
Selecting previously unselected package node-glob.
Preparing to unpack .../071-node-glob_7.1.3-1~bpo9+1_all.deb ...
Unpacking node-glob (7.1.3-1~bpo9+1) ...
Selecting previously unselected package node-graceful-fs.
Preparing to unpack .../072-node-graceful-fs_4.1.11-1_all.deb ...
Unpacking node-graceful-fs (4.1.11-1) ...
Selecting previously unselected package node-typedarray.
Preparing to unpack .../073-node-typedarray_0.0.6-1_all.deb ...
Unpacking node-typedarray (0.0.6-1) ...
Selecting previously unselected package node-concat-stream.
Preparing to unpack .../074-node-concat-stream_1.5.1-2_all.deb ...
Unpacking node-concat-stream (1.5.1-2) ...
Selecting previously unselected package node-end-of-stream.
Preparing to unpack .../075-node-end-of-stream_1.1.0-1_all.deb ...
Unpacking node-end-of-stream (1.1.0-1) ...
Selecting previously unselected package node-stream-shift.
Preparing to unpack .../076-node-stream-shift_1.0.0-1_all.deb ...
Unpacking node-stream-shift (1.0.0-1) ...
Selecting previously unselected package node-duplexify.
Preparing to unpack .../077-node-duplexify_3.5.0-1_all.deb ...
Unpacking node-duplexify (3.5.0-1) ...
Selecting previously unselected package node-flush-write-stream.
Preparing to unpack .../078-node-flush-write-stream_1.0.2-2~bpo9+1_all.deb ...
Unpacking node-flush-write-stream (1.0.2-2~bpo9+1) ...
Selecting previously unselected package node-from2.
Preparing to unpack .../079-node-from2_2.3.0-1_all.deb ...
Unpacking node-from2 (2.3.0-1) ...
Selecting previously unselected package node-cyclist.
Preparing to unpack .../080-node-cyclist_1.0.1-2~bpo9+1_all.deb ...
Unpacking node-cyclist (1.0.1-2~bpo9+1) ...
Selecting previously unselected package node-parallel-transform.
Preparing to unpack .../081-node-parallel-transform_1.1.0-2~bpo9+1_all.deb ...
Unpacking node-parallel-transform (1.1.0-2~bpo9+1) ...
Selecting previously unselected package node-pump.
Preparing to unpack .../082-node-pump_3.0.0-1~bpo9+1_all.deb ...
Unpacking node-pump (3.0.0-1~bpo9+1) ...
Selecting previously unselected package node-pumpify.
Preparing to unpack .../083-node-pumpify_1.3.5-1~bpo9+1_all.deb ...
Unpacking node-pumpify (1.3.5-1~bpo9+1) ...
Selecting previously unselected package node-stream-each.
Preparing to unpack .../084-node-stream-each_1.2.2-1~bpo9+1_all.deb ...
Unpacking node-stream-each (1.2.2-1~bpo9+1) ...
Selecting previously unselected package node-xtend.
Preparing to unpack .../085-node-xtend_4.0.1-1_all.deb ...
Unpacking node-xtend (4.0.1-1) ...
Selecting previously unselected package node-through2.
Preparing to unpack .../086-node-through2_2.0.3-1_all.deb ...
Unpacking node-through2 (2.0.3-1) ...
Selecting previously unselected package node-mississippi.
Preparing to unpack .../087-node-mississippi_3.0.0-1~bpo9+1_all.deb ...
Unpacking node-mississippi (3.0.0-1~bpo9+1) ...
Selecting previously unselected package node-mkdirp.
Preparing to unpack .../088-node-mkdirp_0.5.1-1~bpo9+1_all.deb ...
Unpacking node-mkdirp (0.5.1-1~bpo9+1) ...
Selecting previously unselected package node-run-queue.
Preparing to unpack .../089-node-run-queue_1.0.3-1~bpo9+1_all.deb ...
Unpacking node-run-queue (1.0.3-1~bpo9+1) ...
Selecting previously unselected package node-rimraf.
Preparing to unpack .../090-node-rimraf_2.6.2-1~bpo9+1_all.deb ...
Unpacking node-rimraf (2.6.2-1~bpo9+1) ...
Selecting previously unselected package node-imurmurhash.
Preparing to unpack .../091-node-imurmurhash_0.1.4-1~bpo9+1_all.deb ...
Unpacking node-imurmurhash (0.1.4-1~bpo9+1) ...
Selecting previously unselected package node-iferr.
Preparing to unpack .../092-node-iferr_1.0.2-1~bpo9+1_all.deb ...
Unpacking node-iferr (1.0.2-1~bpo9+1) ...
Selecting previously unselected package node-fs-write-stream-atomic.
Preparing to unpack .../093-node-fs-write-stream-atomic_1.0.10-4~bpo9+1_all.deb ...
Unpacking node-fs-write-stream-atomic (1.0.10-4~bpo9+1) ...
Selecting previously unselected package node-copy-concurrently.
Preparing to unpack .../094-node-copy-concurrently_1.0.5-4~bpo9+1_all.deb ...
Unpacking node-copy-concurrently (1.0.5-4~bpo9+1) ...
Selecting previously unselected package node-move-concurrently.
Preparing to unpack .../095-node-move-concurrently_1.0.1-1~bpo9+1_all.deb ...
Unpacking node-move-concurrently (1.0.1-1~bpo9+1) ...
Selecting previously unselected package node-promise-inflight.
Preparing to unpack .../096-node-promise-inflight_1.0.1-1~bpo9+1_all.deb ...
Unpacking node-promise-inflight (1.0.1-1~bpo9+1) ...
Selecting previously unselected package node-safe-buffer.
Preparing to unpack .../097-node-safe-buffer_5.1.2-1~bpo9+1_all.deb ...
Unpacking node-safe-buffer (5.1.2-1~bpo9+1) ...
Selecting previously unselected package node-ssri.
Preparing to unpack .../098-node-ssri_5.2.4-2~bpo9+1_all.deb ...
Unpacking node-ssri (5.2.4-2~bpo9+1) ...
Selecting previously unselected package node-unique-filename.
Preparing to unpack .../099-node-unique-filename_1.1.0+ds-2~bpo9+1_all.deb ...
Unpacking node-unique-filename (1.1.0+ds-2~bpo9+1) ...
Selecting previously unselected package node-y18n.
Preparing to unpack .../100-node-y18n_3.2.1-2_all.deb ...
Unpacking node-y18n (3.2.1-2) ...
Selecting previously unselected package node-cacache.
Preparing to unpack .../101-node-cacache_10.0.4-1~bpo9+1_all.deb ...
Unpacking node-cacache (10.0.4-1~bpo9+1) ...
Selecting previously unselected package node-call-limit.
Preparing to unpack .../102-node-call-limit_1.1.0-1~bpo9+1_all.deb ...
Unpacking node-call-limit (1.1.0-1~bpo9+1) ...
Selecting previously unselected package node-caseless.
Preparing to unpack .../103-node-caseless_0.12.0-1~bpo9+1_all.deb ...
Unpacking node-caseless (0.12.0-1~bpo9+1) ...
Selecting previously unselected package node-wrap-ansi.
Preparing to unpack .../104-node-wrap-ansi_2.0.0-1_all.deb ...
Unpacking node-wrap-ansi (2.0.0-1) ...
Selecting previously unselected package node-cliui.
Preparing to unpack .../105-node-cliui_3.2.0-2_all.deb ...
Unpacking node-cliui (3.2.0-2) ...
Selecting previously unselected package node-delayed-stream.
Preparing to unpack .../106-node-delayed-stream_0.0.5-1_all.deb ...
Unpacking node-delayed-stream (0.0.5-1) ...
Selecting previously unselected package node-combined-stream.
Preparing to unpack .../107-node-combined-stream_1.0.6-1~bpo9+1_all.deb ...
Unpacking node-combined-stream (1.0.6-1~bpo9+1) ...
Selecting previously unselected package node-proto-list.
Preparing to unpack .../108-node-proto-list_1.2.4-1~bpo9+1_all.deb ...
Unpacking node-proto-list (1.2.4-1~bpo9+1) ...
Selecting previously unselected package node-ini.
Preparing to unpack .../109-node-ini_1.3.5-1~bpo9+1_all.deb ...
Unpacking node-ini (1.3.5-1~bpo9+1) ...
Selecting previously unselected package node-config-chain.
Preparing to unpack .../110-node-config-chain_1.1.11-1~bpo9+1_all.deb ...
Unpacking node-config-chain (1.1.11-1~bpo9+1) ...
Selecting previously unselected package node-console-control-strings.
Preparing to unpack .../111-node-console-control-strings_1.1.0-1~bpo9+1_all.deb ...
Unpacking node-console-control-strings (1.1.0-1~bpo9+1) ...
Selecting previously unselected package node-core-util-is.
Preparing to unpack .../112-node-core-util-is_1.0.2-1_all.deb ...
Unpacking node-core-util-is (1.0.2-1) ...
Selecting previously unselected package node-dashdash.
Preparing to unpack .../113-node-dashdash_1.14.1-2~bpo9+1_all.deb ...
Unpacking node-dashdash (1.14.1-2~bpo9+1) ...
Selecting previously unselected package node-decamelize.
Preparing to unpack .../114-node-decamelize_1.2.0-1_all.deb ...
Unpacking node-decamelize (1.2.0-1) ...
Selecting previously unselected package node-mimic-response.
Preparing to unpack .../115-node-mimic-response_1.0.0-1~bpo9+1_all.deb ...
Unpacking node-mimic-response (1.0.0-1~bpo9+1) ...
Selecting previously unselected package node-decompress-response.
Preparing to unpack .../116-node-decompress-response_3.3.0-1~bpo9+1_all.deb ...
Unpacking node-decompress-response (3.3.0-1~bpo9+1) ...
Selecting previously unselected package node-deep-extend.
Preparing to unpack .../117-node-deep-extend_0.4.1-1_all.deb ...
Unpacking node-deep-extend (0.4.1-1) ...
Selecting previously unselected package node-detect-indent.
Preparing to unpack .../118-node-detect-indent_5.0.0-1_all.deb ...
Unpacking node-detect-indent (5.0.0-1) ...
Selecting previously unselected package node-detect-newline.
Preparing to unpack .../119-node-detect-newline_2.1.0-1_all.deb ...
Unpacking node-detect-newline (2.1.0-1) ...
Selecting previously unselected package node-duplexer3.
Preparing to unpack .../120-node-duplexer3_0.1.4-2~bpo9+1_all.deb ...
Unpacking node-duplexer3 (0.1.4-2~bpo9+1) ...
Selecting previously unselected package node-jsbn.
Preparing to unpack .../121-node-jsbn_1.1.0-1~bpo9+1_all.deb ...
Unpacking node-jsbn (1.1.0-1~bpo9+1) ...
Selecting previously unselected package node-ecc-jsbn.
Preparing to unpack .../122-node-ecc-jsbn_0.1.1-1~bpo9+1_all.deb ...
Unpacking node-ecc-jsbn (0.1.1-1~bpo9+1) ...
Selecting previously unselected package node-editor.
Preparing to unpack .../123-node-editor_1.0.0-1~bpo9+1_all.deb ...
Unpacking node-editor (1.0.0-1~bpo9+1) ...
Selecting previously unselected package node-prr.
Preparing to unpack .../124-node-prr_1.0.1-1~bpo9+1_all.deb ...
Unpacking node-prr (1.0.1-1~bpo9+1) ...
Selecting previously unselected package node-errno.
Preparing to unpack .../125-node-errno_0.1.4-1~bpo9+1_all.deb ...
Unpacking node-errno (0.1.4-1~bpo9+1) ...
Selecting previously unselected package node-extend.
Preparing to unpack .../126-node-extend_3.0.2-1~bpo9+1_all.deb ...
Unpacking node-extend (3.0.2-1~bpo9+1) ...
Selecting previously unselected package node-extsprintf.
Preparing to unpack .../127-node-extsprintf_1.3.0-1~bpo9+1_all.deb ...
Unpacking node-extsprintf (1.3.0-1~bpo9+1) ...
Selecting previously unselected package node-p-limit.
Preparing to unpack .../128-node-p-limit_1.1.0-1~bpo9+1_all.deb ...
Unpacking node-p-limit (1.1.0-1~bpo9+1) ...
Selecting previously unselected package node-p-locate.
Preparing to unpack .../129-node-p-locate_2.0.0-1~bpo9+1_all.deb ...
Unpacking node-p-locate (2.0.0-1~bpo9+1) ...
Selecting previously unselected package node-path-exists.
Preparing to unpack .../130-node-path-exists_3.0.0-1_all.deb ...
Unpacking node-path-exists (3.0.0-1) ...
Selecting previously unselected package node-locate-path.
Preparing to unpack .../131-node-locate-path_2.0.0-1~bpo9+1_all.deb ...
Unpacking node-locate-path (2.0.0-1~bpo9+1) ...
Selecting previously unselected package node-find-up.
Preparing to unpack .../132-node-find-up_2.1.0-1~bpo9+1_all.deb ...
Unpacking node-find-up (2.1.0-1~bpo9+1) ...
Selecting previously unselected package node-forever-agent.
Preparing to unpack .../133-node-forever-agent_0.6.1-1~bpo9+1_all.deb ...
Unpacking node-forever-agent (0.6.1-1~bpo9+1) ...
Selecting previously unselected package node-mime-types.
Preparing to unpack .../134-node-mime-types_2.1.20-1~bpo9+1_all.deb ...
Unpacking node-mime-types (2.1.20-1~bpo9+1) ...
Selecting previously unselected package node-form-data.
Preparing to unpack .../135-node-form-data_2.3.2-2~bpo9+1_all.deb ...
Unpacking node-form-data (2.3.2-2~bpo9+1) ...
Selecting previously unselected package node-path-is-inside.
Preparing to unpack .../136-node-path-is-inside_1.0.2-1~bpo9+1_all.deb ...
Unpacking node-path-is-inside (1.0.2-1~bpo9+1) ...
Selecting previously unselected package node-fs-vacuum.
Preparing to unpack .../137-node-fs-vacuum_1.2.10-2~bpo9+1_all.deb ...
Unpacking node-fs-vacuum (1.2.10-2~bpo9+1) ...
Selecting previously unselected package node-object-assign.
Preparing to unpack .../138-node-object-assign_4.1.0-1_all.deb ...
Unpacking node-object-assign (4.1.0-1) ...
Selecting previously unselected package node-has-unicode.
Preparing to unpack .../139-node-has-unicode_2.0.1-2~bpo9+1_all.deb ...
Unpacking node-has-unicode (2.0.1-2~bpo9+1) ...
Selecting previously unselected package node-wide-align.
Preparing to unpack .../140-node-wide-align_1.1.0-1~bpo9+1_all.deb ...
Unpacking node-wide-align (1.1.0-1~bpo9+1) ...
Selecting previously unselected package node-gauge.
Preparing to unpack .../141-node-gauge_2.7.4-1~bpo9+1_all.deb ...
Unpacking node-gauge (2.7.4-1~bpo9+1) ...
Selecting previously unselected package node-get-caller-file.
Preparing to unpack .../142-node-get-caller-file_1.0.2-1_all.deb ...
Unpacking node-get-caller-file (1.0.2-1) ...
Selecting previously unselected package node-getpass.
Preparing to unpack .../143-node-getpass_0.1.7-1~bpo9+1_all.deb ...
Unpacking node-getpass (0.1.7-1~bpo9+1) ...
Selecting previously unselected package node-is-retry-allowed.
Preparing to unpack .../144-node-is-retry-allowed_1.1.0-1~bpo9+1_all.deb ...
Unpacking node-is-retry-allowed (1.1.0-1~bpo9+1) ...
Selecting previously unselected package node-p-cancelable.
Preparing to unpack .../145-node-p-cancelable_0.3.0-1~bpo9+1_all.deb ...
Unpacking node-p-cancelable (0.3.0-1~bpo9+1) ...
Selecting previously unselected package node-p-finally.
Preparing to unpack .../146-node-p-finally_1.0.0-2~bpo9+1_all.deb ...
Unpacking node-p-finally (1.0.0-2~bpo9+1) ...
Selecting previously unselected package node-p-timeout.
Preparing to unpack .../147-node-p-timeout_1.2.0-1~bpo9+1_all.deb ...
Unpacking node-p-timeout (1.2.0-1~bpo9+1) ...
Selecting previously unselected package node-is-plain-obj.
Preparing to unpack .../148-node-is-plain-obj_1.1.0-1~bpo9+1_all.deb ...
Unpacking node-is-plain-obj (1.1.0-1~bpo9+1) ...
Selecting previously unselected package node-url-to-options.
Preparing to unpack .../149-node-url-to-options_1.0.1-1~bpo9+1_all.deb ...
Unpacking node-url-to-options (1.0.1-1~bpo9+1) ...
Selecting previously unselected package node-timed-out.
Preparing to unpack .../150-node-timed-out_4.0.1-2~bpo9+1_all.deb ...
Unpacking node-timed-out (4.0.1-2~bpo9+1) ...
Selecting previously unselected package node-lowercase-keys.
Preparing to unpack .../151-node-lowercase-keys_1.0.0-2~bpo9+1_all.deb ...
Unpacking node-lowercase-keys (1.0.0-2~bpo9+1) ...
Selecting previously unselected package node-is-object.
Preparing to unpack .../152-node-is-object_1.0.1-1~bpo9+1_all.deb ...
Unpacking node-is-object (1.0.1-1~bpo9+1) ...
Selecting previously unselected package node-has-symbol-support-x.
Preparing to unpack .../153-node-has-symbol-support-x_1.4.1+dfsg-1~bpo9+1_all.deb ...
Unpacking node-has-symbol-support-x (1.4.1+dfsg-1~bpo9+1) ...
Selecting previously unselected package node-has-to-string-tag-x.
Preparing to unpack .../154-node-has-to-string-tag-x_1.4.1+dfsg-1~bpo9+1_all.deb ...
Unpacking node-has-to-string-tag-x (1.4.1+dfsg-1~bpo9+1) ...
Selecting previously unselected package node-isurl.
Preparing to unpack .../155-node-isurl_1.0.0-1~bpo9+1_all.deb ...
Unpacking node-isurl (1.0.0-1~bpo9+1) ...
Selecting previously unselected package node-prepend-http.
Preparing to unpack .../156-node-prepend-http_2.0.0-1~bpo9+1_all.deb ...
Unpacking node-prepend-http (2.0.0-1~bpo9+1) ...
Selecting previously unselected package node-url-parse-lax.
Preparing to unpack .../157-node-url-parse-lax_1.0.0-1~bpo9+1_all.deb ...
Unpacking node-url-parse-lax (1.0.0-1~bpo9+1) ...
Selecting previously unselected package node-got.
Preparing to unpack .../158-node-got_7.1.0-1~bpo9+1_all.deb ...
Unpacking node-got (7.1.0-1~bpo9+1) ...
Selecting previously unselected package nodejs-dev.
Preparing to unpack .../159-nodejs-dev_8.11.1~dfsg-2~bpo9+1_amd64.deb ...
Unpacking nodejs-dev (8.11.1~dfsg-2~bpo9+1) ...
Selecting previously unselected package node-fstream.
Preparing to unpack .../160-node-fstream_1.0.10-1+deb9u1_all.deb ...
Unpacking node-fstream (1.0.10-1+deb9u1) ...
Selecting previously unselected package node-nopt.
Preparing to unpack .../161-node-nopt_3.0.6-3_all.deb ...
Unpacking node-nopt (3.0.6-3) ...
Selecting previously unselected package node-set-blocking.
Preparing to unpack .../162-node-set-blocking_2.0.0-1_all.deb ...
Unpacking node-set-blocking (2.0.0-1) ...
Selecting previously unselected package node-npmlog.
Preparing to unpack .../163-node-npmlog_4.1.2-1~bpo9+1_all.deb ...
Unpacking node-npmlog (4.1.2-1~bpo9+1) ...
Selecting previously unselected package node-osenv.
Preparing to unpack .../164-node-osenv_0.1.5-1~bpo9+1_all.deb ...
Unpacking node-osenv (0.1.5-1~bpo9+1) ...
Selecting previously unselected package node-har-schema.
Preparing to unpack .../165-node-har-schema_2.0.0-1~bpo9+1_all.deb ...
Unpacking node-har-schema (2.0.0-1~bpo9+1) ...
Selecting previously unselected package node-har-validator.
Preparing to unpack .../166-node-har-validator_5.1.0-1~bpo9+1_all.deb ...
Unpacking node-har-validator (5.1.0-1~bpo9+1) ...
Selecting previously unselected package node-json-schema.
Preparing to unpack .../167-node-json-schema_0.2.3-1~bpo9+1_all.deb ...
Unpacking node-json-schema (0.2.3-1~bpo9+1) ...
Selecting previously unselected package node-verror.
Preparing to unpack .../168-node-verror_1.10.0-1~bpo9+1_all.deb ...
Unpacking node-verror (1.10.0-1~bpo9+1) ...
Selecting previously unselected package node-jsprim.
Preparing to unpack .../169-node-jsprim_1.4.0-1~bpo9+1_all.deb ...
Unpacking node-jsprim (1.4.0-1~bpo9+1) ...
Selecting previously unselected package node-sshpk.
Preparing to unpack .../170-node-sshpk_1.13.1+dfsg-1~bpo9+1_all.deb ...
Unpacking node-sshpk (1.13.1+dfsg-1~bpo9+1) ...
Selecting previously unselected package node-http-signature.
Preparing to unpack .../171-node-http-signature_1.2.0-1~bpo9+1_all.deb ...
Unpacking node-http-signature (1.2.0-1~bpo9+1) ...
Selecting previously unselected package node-is-typedarray.
Preparing to unpack .../172-node-is-typedarray_1.0.0-2_all.deb ...
Unpacking node-is-typedarray (1.0.0-2) ...
Selecting previously unselected package node-isstream.
Preparing to unpack .../173-node-isstream_0.1.2+dfsg-1_all.deb ...
Unpacking node-isstream (0.1.2+dfsg-1) ...
Selecting previously unselected package node-json-stringify-safe.
Preparing to unpack .../174-node-json-stringify-safe_5.0.1-1~bpo9+1_all.deb ...
Unpacking node-json-stringify-safe (5.0.1-1~bpo9+1) ...
Selecting previously unselected package node-oauth-sign.
Preparing to unpack .../175-node-oauth-sign_0.9.0-1~bpo9+1_all.deb ...
Unpacking node-oauth-sign (0.9.0-1~bpo9+1) ...
Selecting previously unselected package node-performance-now.
Preparing to unpack .../176-node-performance-now_2.1.0+debian-1~bpo9+1_all.deb ...
Unpacking node-performance-now (2.1.0+debian-1~bpo9+1) ...
Selecting previously unselected package node-qs.
Preparing to unpack .../177-node-qs_6.5.2-1~bpo9+1_all.deb ...
Unpacking node-qs (6.5.2-1~bpo9+1) ...
Selecting previously unselected package node-punycode.
Preparing to unpack .../178-node-punycode_2.0.1-1_all.deb ...
Unpacking node-punycode (2.0.1-1) ...
Selecting previously unselected package node-tough-cookie.
Preparing to unpack .../179-node-tough-cookie_2.3.4+dfsg-1~bpo9+1_all.deb ...
Unpacking node-tough-cookie (2.3.4+dfsg-1~bpo9+1) ...
Selecting previously unselected package node-tunnel-agent.
Preparing to unpack .../180-node-tunnel-agent_0.6.1-1~bpo9+1_all.deb ...
Unpacking node-tunnel-agent (0.6.1-1~bpo9+1) ...
Selecting previously unselected package node-node-uuid.
Preparing to unpack .../181-node-node-uuid_1.4.0-1_all.deb ...
Unpacking node-node-uuid (1.4.0-1) ...
Selecting previously unselected package node-request.
Preparing to unpack .../182-node-request_2.88.1-2~bpo9+1_all.deb ...
Unpacking node-request (2.88.1-2~bpo9+1) ...
Selecting previously unselected package node-semver.
Preparing to unpack .../183-node-semver_5.5.1-1~bpo9+1_all.deb ...
Unpacking node-semver (5.5.1-1~bpo9+1) ...
Selecting previously unselected package node-tar.
Preparing to unpack .../184-node-tar_4.4.6+ds1-3~bpo9+1_all.deb ...
Unpacking node-tar (4.4.6+ds1-3~bpo9+1) ...
Selecting previously unselected package node-gyp.
Preparing to unpack .../185-node-gyp_3.6.2-2~bpo9+1_all.deb ...
Unpacking node-gyp (3.6.2-2~bpo9+1) ...
Selecting previously unselected package node-hosted-git-info.
Preparing to unpack .../186-node-hosted-git-info_2.7.1-1~bpo9+1_all.deb ...
Unpacking node-hosted-git-info (2.7.1-1~bpo9+1) ...
Selecting previously unselected package node-iconv-lite.
Preparing to unpack .../187-node-iconv-lite_0.4.13-2_all.deb ...
Unpacking node-iconv-lite (0.4.13-2) ...
Selecting previously unselected package node-import-lazy.
Preparing to unpack .../188-node-import-lazy_3.0.0.REALLY.2.1.0-1~bpo9+1_all.deb ...
Unpacking node-import-lazy (3.0.0.REALLY.2.1.0-1~bpo9+1) ...
Selecting previously unselected package node-invert-kv.
Preparing to unpack .../189-node-invert-kv_1.0.0-1_all.deb ...
Unpacking node-invert-kv (1.0.0-1) ...
Selecting previously unselected package node-is-builtin-module.
Preparing to unpack .../190-node-is-builtin-module_1.0.0-1_all.deb ...
Unpacking node-is-builtin-module (1.0.0-1) ...
Selecting previously unselected package node-is-npm.
Preparing to unpack .../191-node-is-npm_1.0.0-1~bpo9+1_all.deb ...
Unpacking node-is-npm (1.0.0-1~bpo9+1) ...
Selecting previously unselected package node-json-parse-better-errors.
Preparing to unpack .../192-node-json-parse-better-errors_1.0.2-2~bpo9+1_all.deb ...
Unpacking node-json-parse-better-errors (1.0.2-2~bpo9+1) ...
Selecting previously unselected package node-through.
Preparing to unpack .../193-node-through_2.3.8-1_all.deb ...
Unpacking node-through (2.3.8-1) ...
Selecting previously unselected package node-jsonparse.
Preparing to unpack .../194-node-jsonparse_1.2.0-1_all.deb ...
Unpacking node-jsonparse (1.2.0-1) ...
Selecting previously unselected package node-jsonstream.
Preparing to unpack .../195-node-jsonstream_1.3.2-1~bpo9+1_all.deb ...
Unpacking node-jsonstream (1.3.2-1~bpo9+1) ...
Selecting previously unselected package node-minimist.
Preparing to unpack .../196-node-minimist_1.2.0-1_all.deb ...
Unpacking node-minimist (1.2.0-1) ...
Selecting previously unselected package node-strip-json-comments.
Preparing to unpack .../197-node-strip-json-comments_2.0.1-1_all.deb ...
Unpacking node-strip-json-comments (2.0.1-1) ...
Selecting previously unselected package node-rc.
Preparing to unpack .../198-node-rc_1.1.6-2_all.deb ...
Unpacking node-rc (1.1.6-2) ...
Selecting previously unselected package node-registry-url.
Preparing to unpack .../199-node-registry-url_3.1.0-1~bpo9+1_all.deb ...
Unpacking node-registry-url (3.1.0-1~bpo9+1) ...
Selecting previously unselected package node-registry-auth-token.
Preparing to unpack .../200-node-registry-auth-token_3.3.1-1~bpo9+1_all.deb ...
Unpacking node-registry-auth-token (3.3.1-1~bpo9+1) ...
Selecting previously unselected package node-package-json.
Preparing to unpack .../201-node-package-json_4.0.1-1~bpo9+1_all.deb ...
Unpacking node-package-json (4.0.1-1~bpo9+1) ...
Selecting previously unselected package node-latest-version.
Preparing to unpack .../202-node-latest-version_3.1.0-1~bpo9+1_all.deb ...
Unpacking node-latest-version (3.1.0-1~bpo9+1) ...
Selecting previously unselected package node-lazy-property.
Preparing to unpack .../203-node-lazy-property_1.0.0-3~bpo9+1_all.deb ...
Unpacking node-lazy-property (1.0.0-3~bpo9+1) ...
Selecting previously unselected package node-lcid.
Preparing to unpack .../204-node-lcid_1.0.0-1_all.deb ...
Unpacking node-lcid (1.0.0-1) ...
Selecting previously unselected package node-validate-npm-package-name.
Preparing to unpack .../205-node-validate-npm-package-name_3.0.0-1~bpo9+1_all.deb ...
Unpacking node-validate-npm-package-name (3.0.0-1~bpo9+1) ...
Selecting previously unselected package node-npm-package-arg.
Preparing to unpack .../206-node-npm-package-arg_6.0.0-2~bpo9+1_all.deb ...
Unpacking node-npm-package-arg (6.0.0-2~bpo9+1) ...
Selecting previously unselected package node-require-directory.
Preparing to unpack .../207-node-require-directory_2.1.1-1_all.deb ...
Unpacking node-require-directory (2.1.1-1) ...
Selecting previously unselected package node-require-main-filename.
Preparing to unpack .../208-node-require-main-filename_1.0.1-1_all.deb ...
Unpacking node-require-main-filename (1.0.1-1) ...
Selecting previously unselected package node-which-module.
Preparing to unpack .../209-node-which-module_2.0.0-1~bpo9+1_all.deb ...
Unpacking node-which-module (2.0.0-1~bpo9+1) ...
Selecting previously unselected package node-mimic-fn.
Preparing to unpack .../210-node-mimic-fn_1.1.0-1_all.deb ...
Unpacking node-mimic-fn (1.1.0-1) ...
Selecting previously unselected package node-mem.
Preparing to unpack .../211-node-mem_1.1.0-1_all.deb ...
Unpacking node-mem (1.1.0-1) ...
Selecting previously unselected package node-os-locale.
Preparing to unpack .../212-node-os-locale_2.0.0-1_all.deb ...
Unpacking node-os-locale (2.0.0-1) ...
Selecting previously unselected package node-yargs-parser.
Preparing to unpack .../213-node-yargs-parser_8.0.0-1~bpo9+1_all.deb ...
Unpacking node-yargs-parser (8.0.0-1~bpo9+1) ...
Selecting previously unselected package node-yargs.
Preparing to unpack .../214-node-yargs_10.0.3-2~bpo9+1_all.deb ...
Unpacking node-yargs (10.0.3-2~bpo9+1) ...
Selecting previously unselected package node-libnpx.
Preparing to unpack .../215-node-libnpx_10.2.0-2~bpo9+1_all.deb ...
Unpacking node-libnpx (10.2.0-2~bpo9+1) ...
Selecting previously unselected package node-lockfile.
Preparing to unpack .../216-node-lockfile_1.0.4-1~bpo9+1_all.deb ...
Unpacking node-lockfile (1.0.4-1~bpo9+1) ...
Selecting previously unselected package node-spdx-license-ids.
Preparing to unpack .../217-node-spdx-license-ids_1.2.2-1_all.deb ...
Unpacking node-spdx-license-ids (1.2.2-1) ...
Selecting previously unselected package node-spdx-correct.
Preparing to unpack .../218-node-spdx-correct_1.0.2-1_all.deb ...
Unpacking node-spdx-correct (1.0.2-1) ...
Selecting previously unselected package node-spdx-expression-parse.
Preparing to unpack .../219-node-spdx-expression-parse_1.0.4-1_all.deb ...
Unpacking node-spdx-expression-parse (1.0.4-1) ...
Selecting previously unselected package node-validate-npm-package-license.
Preparing to unpack .../220-node-validate-npm-package-license_3.0.1-1_all.deb ...
Unpacking node-validate-npm-package-license (3.0.1-1) ...
Selecting previously unselected package node-normalize-package-data.
Preparing to unpack .../221-node-normalize-package-data_2.4.0-1~bpo9+1_all.deb ...
Unpacking node-normalize-package-data (2.4.0-1~bpo9+1) ...
Selecting previously unselected package node-opener.
Preparing to unpack .../222-node-opener_1.4.3-1~bpo9+1_all.deb ...
Unpacking node-opener (1.4.3-1~bpo9+1) ...
Selecting previously unselected package node-mute-stream.
Preparing to unpack .../223-node-mute-stream_0.0.7-1_all.deb ...
Unpacking node-mute-stream (0.0.7-1) ...
Selecting previously unselected package node-read.
Preparing to unpack .../224-node-read_1.0.7-1_all.deb ...
Unpacking node-read (1.0.7-1) ...
Selecting previously unselected package node-promzard.
Preparing to unpack .../225-node-promzard_0.3.0-1~bpo9+1_all.deb ...
Unpacking node-promzard (0.3.0-1~bpo9+1) ...
Selecting previously unselected package node-qw.
Preparing to unpack .../226-node-qw_1.0.1-1~bpo9+1_all.deb ...
Unpacking node-qw (1.0.1-1~bpo9+1) ...
Selecting previously unselected package node-slash.
Preparing to unpack .../227-node-slash_1.0.0-1_all.deb ...
Unpacking node-slash (1.0.0-1) ...
Selecting previously unselected package node-read-package-json.
Preparing to unpack .../228-node-read-package-json_2.0.13-1~bpo9+1_all.deb ...
Unpacking node-read-package-json (2.0.13-1~bpo9+1) ...
Selecting previously unselected package node-resolve-from.
Preparing to unpack .../229-node-resolve-from_4.0.0-1~bpo9+1_all.deb ...
Unpacking node-resolve-from (4.0.0-1~bpo9+1) ...
Selecting previously unselected package node-retry.
Preparing to unpack .../230-node-retry_0.10.1-1~bpo9+1_all.deb ...
Unpacking node-retry (0.10.1-1~bpo9+1) ...
Selecting previously unselected package node-semver-diff.
Preparing to unpack .../231-node-semver-diff_2.1.0-2~bpo9+1_all.deb ...
Unpacking node-semver-diff (2.1.0-2~bpo9+1) ...
Selecting previously unselected package node-sha.
Preparing to unpack .../232-node-sha_2.0.1-1~bpo9+1_all.deb ...
Unpacking node-sha (2.0.1-1~bpo9+1) ...
Selecting previously unselected package node-slide.
Preparing to unpack .../233-node-slide_1.1.6-1~bpo9+1_all.deb ...
Unpacking node-slide (1.1.6-1~bpo9+1) ...
Selecting previously unselected package node-sorted-object.
Preparing to unpack .../234-node-sorted-object_2.0.1-1_all.deb ...
Unpacking node-sorted-object (2.0.1-1) ...
Selecting previously unselected package node-stream-iterate.
Preparing to unpack .../235-node-stream-iterate_1.2.0-4~bpo9+1_all.deb ...
Unpacking node-stream-iterate (1.2.0-4~bpo9+1) ...
Selecting previously unselected package node-text-table.
Preparing to unpack .../236-node-text-table_0.2.0-2~bpo9+1_all.deb ...
Unpacking node-text-table (0.2.0-2~bpo9+1) ...
Selecting previously unselected package node-uid-number.
Preparing to unpack .../237-node-uid-number_0.0.6-1_all.deb ...
Unpacking node-uid-number (0.0.6-1) ...
Selecting previously unselected package node-unpipe.
Preparing to unpack .../238-node-unpipe_1.0.0-1_all.deb ...
Unpacking node-unpipe (1.0.0-1) ...
Selecting previously unselected package node-write-file-atomic.
Preparing to unpack .../239-node-write-file-atomic_2.3.0-1~bpo9+1_all.deb ...
Unpacking node-write-file-atomic (2.3.0-1~bpo9+1) ...
Selecting previously unselected package node-xdg-basedir.
Preparing to unpack .../240-node-xdg-basedir_3.0.0-1~bpo9+1_all.deb ...
Unpacking node-xdg-basedir (3.0.0-1~bpo9+1) ...
Selecting previously unselected package node-archy.
Preparing to unpack .../241-node-archy_1.0.0-1_all.deb ...
Unpacking node-archy (1.0.0-1) ...
Selecting previously unselected package node-encoding.
Preparing to unpack .../242-node-encoding_0.1.12-2_all.deb ...
Unpacking node-encoding (0.1.12-2) ...
Selecting previously unselected package node-ansi.
Preparing to unpack .../243-node-ansi_0.3.0-2_all.deb ...
Unpacking node-ansi (0.3.0-2) ...
Selecting previously unselected package npm.
Preparing to unpack .../244-npm_5.8.0+ds6-2~bpo9+1_all.deb ...
Unpacking npm (5.8.0+ds6-2~bpo9+1) ...
Setting up libjs-node-uuid (1.4.0-1) ...
Setting up libjs-inherits (2.0.3-1) ...
Setting up libuv1:amd64 (1.34.2-1~bpo9+1) ...
Processing triggers for libc-bin (2.24-11+deb9u4) ...
Setting up gyp (0.1+20150913git1f374df9-1) ...
Setting up libjs-is-typedarray (1.0.0-2) ...
Setting up libc-ares2:amd64 (1.14.0-1~bpo9+1) ...
Setting up libuv1-dev:amd64 (1.34.2-1~bpo9+1) ...
Setting up libhttp-parser2.8:amd64 (2.8.1-1~bpo9+1) ...
Setting up nodejs (8.11.1~dfsg-2~bpo9+1) ...
update-alternatives: using /usr/bin/nodejs to provide /usr/bin/js (js) in auto mode
Setting up node-balanced-match (0.4.2-1) ...
Setting up node-mimic-fn (1.1.0-1) ...
Setting up node-qw (1.0.1-1~bpo9+1) ...
Setting up node-typedarray (0.0.6-1) ...
Setting up node-proto-list (1.2.4-1~bpo9+1) ...
Setting up node-node-uuid (1.4.0-1) ...
Setting up node-has-symbol-support-x (1.4.1+dfsg-1~bpo9+1) ...
Setting up node-object-assign (4.1.0-1) ...
Setting up node-asynckit (0.4.0-2~bpo9+1) ...
Setting up node-yallist (3.0.2-1~bpo9+1) ...
Setting up node-iconv-lite (0.4.13-2) ...
Setting up node-slide (1.1.6-1~bpo9+1) ...
Setting up node-p-cancelable (0.3.0-1~bpo9+1) ...
Setting up node-has-to-string-tag-x (1.4.1+dfsg-1~bpo9+1) ...
Setting up node-jsbn (1.1.0-1~bpo9+1) ...
Setting up node-pseudomap (1.0.2-1) ...
Setting up node-bluebird (3.5.1+dfsg2-2~bpo9+1) ...
Setting up node-import-lazy (3.0.0.REALLY.2.1.0-1~bpo9+1) ...
Setting up node-caseless (0.12.0-1~bpo9+1) ...
Setting up node-imurmurhash (0.1.4-1~bpo9+1) ...
Setting up node-console-control-strings (1.1.0-1~bpo9+1) ...
Setting up node-ansistyles (0.1.3-1~bpo9+1) ...
Setting up node-ecc-jsbn (0.1.1-1~bpo9+1) ...
Setting up node-spdx-license-ids (1.2.2-1) ...
Setting up node-json-schema (0.2.3-1~bpo9+1) ...
Setting up node-tweetnacl (0.14.5+dfsg-2~bpo9+1) ...
Setting up node-wrappy (1.0.2-1) ...
Setting up node-uid-number (0.0.6-1) ...
Setting up node-has-flag (2.0.0-1) ...
Setting up node-has-unicode (2.0.1-2~bpo9+1) ...
Setting up node-strip-json-comments (2.0.1-1) ...
Setting up node-url-to-options (1.0.1-1~bpo9+1) ...
Setting up node-jsonify (0.0.0-1) ...
Setting up node-p-limit (1.1.0-1~bpo9+1) ...
Setting up node-har-schema (2.0.0-1~bpo9+1) ...
Setting up node-is-typedarray (1.0.0-2) ...
Setting up node-abbrev (1.1.1-1~bpo9+1) ...
Setting up node-mem (1.1.0-1) ...
Setting up node-get-caller-file (1.0.2-1) ...
Setting up node-minimist (1.2.0-1) ...
Setting up node-semver (5.5.1-1~bpo9+1) ...
Setting up node-get-stream (3.0.0-1) ...
Setting up node-retry (0.10.1-1~bpo9+1) ...
Setting up node-prepend-http (2.0.0-1~bpo9+1) ...
Setting up node-url-parse-lax (1.0.0-1~bpo9+1) ...
Setting up node-extsprintf (1.3.0-1~bpo9+1) ...
Setting up node-performance-now (2.1.0+debian-1~bpo9+1) ...
Setting up node-stream-shift (1.0.0-1) ...
Setting up node-forever-agent (0.6.1-1~bpo9+1) ...
Setting up node-set-blocking (2.0.0-1) ...
Setting up node-require-directory (2.1.1-1) ...
Setting up node-cli-boxes (1.0.0-1~bpo9+1) ...
Setting up node-aws-sign2 (0.7.1-1~bpo9+1) ...
Setting up node-is-npm (1.0.0-1~bpo9+1) ...
Setting up node-assert-plus (1.0.0-1~bpo9+1) ...
Setting up node-is-plain-obj (1.1.0-1~bpo9+1) ...
Setting up node-path-is-inside (1.0.2-1~bpo9+1) ...
Setting up node-json-stringify-safe (5.0.1-1~bpo9+1) ...
Setting up node-iferr (1.0.2-1~bpo9+1) ...
Setting up node-signal-exit (3.0.2-1~bpo9+1) ...
Setting up node-dashdash (1.14.1-2~bpo9+1) ...
Setting up node-inherits (2.0.3-1) ...
Setting up node-aws4 (1.8.0-1~bpo9+1) ...
Setting up node-lowercase-keys (1.0.0-2~bpo9+1) ...
Setting up node-camelcase (4.1.0-1~bpo9+1) ...
Setting up node-opener (1.4.3-1~bpo9+1) ...
Setting up node-is-object (1.0.1-1~bpo9+1) ...
Setting up node-which-module (2.0.0-1~bpo9+1) ...
Setting up node-unique-filename (1.1.0+ds-2~bpo9+1) ...
Setting up node-bcrypt-pbkdf (1.0.1-1~bpo9+1) ...
Setting up node-graceful-fs (4.1.11-1) ...
Setting up node-sorted-object (2.0.1-1) ...
Setting up node-extend (3.0.2-1~bpo9+1) ...
Setting up node-archy (1.0.0-1) ...
Setting up node-cyclist (1.0.1-2~bpo9+1) ...
Setting up node-path-is-absolute (1.0.0-1) ...
Setting up node-builtin-modules (1.1.1-1) ...
Setting up node-decamelize (1.2.0-1) ...
Setting up node-y18n (3.2.1-2) ...
Setting up node-ansi-regex (3.0.0-1~bpo9+1) ...
Setting up node-call-limit (1.1.0-1~bpo9+1) ...
Setting up node-isexe (1.1.2-1) ...
Setting up node-co (4.6.0-1) ...
Setting up node-npm-run-path (2.0.2-1) ...
Setting up node-spdx-correct (1.0.2-1) ...
Setting up node-builtins (1.0.3-1~bpo9+1) ...
Setting up node-unpipe (1.0.0-1) ...
Setting up node-delegates (1.0.0-1~bpo9+1) ...
Setting up node-editor (1.0.0-1~bpo9+1) ...
Setting up node-mute-stream (0.0.7-1) ...
Setting up node-slash (1.0.0-1) ...
Setting up node-detect-indent (5.0.0-1) ...
Setting up node-parallel-transform (1.1.0-2~bpo9+1) ...
Setting up node-lazy-property (1.0.0-3~bpo9+1) ...
Setting up node-xdg-basedir (3.0.0-1~bpo9+1) ...
Setting up node-concat-map (0.0.1-1) ...
Setting up node-ini (1.3.5-1~bpo9+1) ...
Setting up node-strip-eof (1.0.0-2) ...
Setting up node-config-chain (1.1.11-1~bpo9+1) ...
Setting up node-mkdirp (0.5.1-1~bpo9+1) ...
Setting up node-require-main-filename (1.0.1-1) ...
Setting up node-isurl (1.0.0-1~bpo9+1) ...
Setting up node-once (1.4.0-2) ...
Setting up nodejs-dev (8.11.1~dfsg-2~bpo9+1) ...
Setting up node-jsonparse (1.2.0-1) ...
Setting up node-strip-ansi (4.0.0-1~bpo9+1) ...
Setting up node-yargs-parser (8.0.0-1~bpo9+1) ...
Setting up node-sha (2.0.1-1~bpo9+1) ...
Setting up node-stream-iterate (1.2.0-4~bpo9+1) ...
Setting up node-path-exists (3.0.0-1) ...
Setting up node-clone (2.1.0-1) ...
Setting up node-fs.realpath (1.0.0-1) ...
Setting up node-lockfile (1.0.4-1~bpo9+1) ...
Setting up node-brace-expansion (1.1.8-1~bpo9+1) ...
Setting up node-prr (1.0.1-1~bpo9+1) ...
Setting up node-safe-buffer (5.1.2-1~bpo9+1) ...
Setting up node-spdx-expression-parse (1.0.4-1) ...
Setting up node-core-util-is (1.0.2-1) ...
Setting up node-qs (6.5.2-1~bpo9+1) ...
Setting up node-detect-newline (2.1.0-1) ...
Setting up node-chownr (1.1.1-1~bpo9+1) ...
Setting up node-xtend (4.0.1-1) ...
Setting up node-json-stable-stringify (1.0.1-1) ...
Setting up node-ssri (5.2.4-2~bpo9+1) ...
Setting up node-write-file-atomic (2.3.0-1~bpo9+1) ...
Setting up node-invert-kv (1.0.0-1) ...
Setting up node-osenv (0.1.5-1~bpo9+1) ...
Setting up node-fs-write-stream-atomic (1.0.10-4~bpo9+1) ...
Setting up node-mime-types (2.1.20-1~bpo9+1) ...
Setting up node-ansi (0.3.0-2) ...
Setting up node-deep-extend (0.4.1-1) ...
Setting up node-is-builtin-module (1.0.0-1) ...
Setting up node-color-name (1.1.3-1~bpo9+1) ...
Setting up node-lcid (1.0.0-1) ...
Setting up node-p-locate (2.0.0-1~bpo9+1) ...
Setting up node-promise-inflight (1.0.1-1~bpo9+1) ...
Setting up node-text-table (0.2.0-2~bpo9+1) ...
Setting up node-punycode (2.0.1-1) ...
Setting up node-resolve-from (4.0.0-1~bpo9+1) ...
Setting up node-timed-out (4.0.1-2~bpo9+1) ...
Setting up node-tough-cookie (2.3.4+dfsg-1~bpo9+1) ...
Setting up node-hosted-git-info (2.7.1-1~bpo9+1) ...
Setting up node-defaults (1.0.3-1) ...
Setting up node-json-parse-better-errors (1.0.2-2~bpo9+1) ...
Setting up node-escape-string-regexp (1.0.5-1) ...
Setting up node-duplexer3 (0.1.4-2~bpo9+1) ...
Setting up node-aproba (1.2.0-1~bpo9+1) ...
Setting up node-p-finally (1.0.0-2~bpo9+1) ...
Setting up node-mimic-response (1.0.0-1~bpo9+1) ...
Setting up node-rc (1.1.6-2) ...
Setting up node-semver-diff (2.1.0-2~bpo9+1) ...
Setting up node-delayed-stream (0.0.5-1) ...
Setting up node-getpass (0.1.7-1~bpo9+1) ...
Setting up node-through (2.3.8-1) ...
Setting up node-isstream (0.1.2+dfsg-1) ...
Setting up node-is-stream (1.1.0-1) ...
Setting up node-supports-color (4.4.0-2~bpo9+1) ...
Setting up node-are-we-there-yet (1.1.4-1~bpo9+1) ...
Setting up node-oauth-sign (0.9.0-1~bpo9+1) ...
Setting up node-asn1 (0.2.3-1~bpo9+1) ...
Setting up node-is-retry-allowed (1.1.0-1~bpo9+1) ...
Setting up node-jsonstream (1.3.2-1~bpo9+1) ...
Setting up node-tunnel-agent (0.6.1-1~bpo9+1) ...
Setting up node-validate-npm-package-name (3.0.0-1~bpo9+1) ...
Setting up node-encoding (0.1.12-2) ...
Setting up node-ajv (5.0.0-1~bpo9+1) ...
Setting up node-npm-package-arg (6.0.0-2~bpo9+1) ...
Setting up node-decompress-response (3.3.0-1~bpo9+1) ...
Setting up node-nopt (3.0.6-3) ...
Setting up node-flush-write-stream (1.0.2-2~bpo9+1) ...
Setting up node-which (1.3.0-1~bpo9+1) ...
Setting up node-lru-cache (4.1.1-1~bpo9+1) ...
Setting up node-end-of-stream (1.1.0-1) ...
Setting up node-p-timeout (1.2.0-1~bpo9+1) ...
Setting up node-combined-stream (1.0.6-1~bpo9+1) ...
Setting up node-duplexify (3.5.0-1) ...
Setting up node-run-queue (1.0.3-1~bpo9+1) ...
Setting up node-validate-npm-package-license (3.0.1-1) ...
Setting up node-inflight (1.0.6-1~bpo9+1) ...
Setting up node-registry-auth-token (3.3.1-1~bpo9+1) ...
Setting up node-stream-each (1.2.2-1~bpo9+1) ...
Setting up node-tar (4.4.6+ds1-3~bpo9+1) ...
Setting up node-through2 (2.0.3-1) ...
Setting up node-concat-stream (1.5.1-2) ...
Setting up node-read (1.0.7-1) ...
Setting up node-from2 (2.3.0-1) ...
Setting up node-errno (0.1.4-1~bpo9+1) ...
Setting up node-verror (1.10.0-1~bpo9+1) ...
Setting up node-cross-spawn-async (2.2.5-2) ...
Setting up node-color-convert (1.9.0-3~bpo9+1) ...
Setting up node-form-data (2.3.2-2~bpo9+1) ...
Setting up node-sshpk (1.13.1+dfsg-1~bpo9+1) ...
Setting up node-minimatch (3.0.4-3~bpo9+1) ...
Setting up node-registry-url (3.1.0-1~bpo9+1) ...
Setting up node-wcwidth.js (1.0.0-1) ...
Setting up node-pump (3.0.0-1~bpo9+1) ...
Setting up node-normalize-package-data (2.4.0-1~bpo9+1) ...
Setting up node-locate-path (2.0.0-1~bpo9+1) ...
Setting up node-har-validator (5.1.0-1~bpo9+1) ...
Setting up node-string-width (2.0.0-1) ...
Setting up node-got (7.1.0-1~bpo9+1) ...
Setting up node-promzard (0.3.0-1~bpo9+1) ...
Setting up node-glob (7.1.3-1~bpo9+1) ...
Setting up node-jsprim (1.4.0-1~bpo9+1) ...
Setting up node-cross-spawn (4.0.2-1) ...
Setting up node-wrap-ansi (2.0.0-1) ...
Setting up node-ansi-styles (3.2.0-1~bpo9+1) ...
Setting up node-widest-line (1.2.2-1~bpo9+1) ...
Setting up node-ansi-align (2.0.0-1~bpo9+1) ...
Setting up node-cliui (3.2.0-2) ...
Setting up node-pumpify (1.3.5-1~bpo9+1) ...
Setting up node-package-json (4.0.1-1~bpo9+1) ...
Setting up node-find-up (2.1.0-1~bpo9+1) ...
Setting up node-mississippi (3.0.0-1~bpo9+1) ...
Setting up node-chalk (2.3.0-2~bpo9+1) ...
Setting up node-latest-version (3.1.0-1~bpo9+1) ...
Setting up node-execa (0.5.0-1) ...
Setting up node-wide-align (1.1.0-1~bpo9+1) ...
Setting up node-term-size (1.2.0+dfsg-2~bpo9+1) ...
Setting up node-os-locale (2.0.0-1) ...
Setting up node-rimraf (2.6.2-1~bpo9+1) ...
Setting up node-http-signature (1.2.0-1~bpo9+1) ...
Setting up node-read-package-json (2.0.13-1~bpo9+1) ...
Setting up node-copy-concurrently (1.0.5-4~bpo9+1) ...
Setting up node-gauge (2.7.4-1~bpo9+1) ...
Setting up node-move-concurrently (1.0.1-1~bpo9+1) ...
Setting up node-yargs (10.0.3-2~bpo9+1) ...
Setting up node-request (2.88.1-2~bpo9+1) ...
Setting up node-fstream (1.0.10-1+deb9u1) ...
Setting up node-boxen (1.2.2-1~bpo9+1) ...
Setting up node-npmlog (4.1.2-1~bpo9+1) ...
Setting up node-fs-vacuum (1.2.10-2~bpo9+1) ...
Setting up node-libnpx (10.2.0-2~bpo9+1) ...
Setting up node-cacache (10.0.4-1~bpo9+1) ...
Setting up node-gyp (3.6.2-2~bpo9+1) ...
Setting up npm (5.8.0+ds6-2~bpo9+1) ...
Processing triggers for libc-bin (2.24-11+deb9u4) ...
2022-05-08 13:12:29,266 DEBUG: > sudo passwd --lock root
passwd: password expiry information changed.
2022-05-08 13:12:29,470 DEBUG: > sudo SUDO_FORCE_REMOVE=yes dpkg --purge sudo
(Reading database ... 70615 files and directories currently installed.)
Removing sudo (1.8.19p1-2.1+deb9u3) ...
Purging configuration files for sudo (1.8.19p1-2.1+deb9u3) ...
Processing triggers for systemd (232-25+deb9u13) ...
2022-05-08 13:12:34,882 INFO: Getting source for revision 17f8db57dcdad3c08f1a2e60e8abe7eb2d2b88cf
2022-05-08 13:12:34,882 DEBUG: Directory: build/app.zeusln.zeus
2022-05-08 13:12:34,883 DEBUG: > git rev-parse --show-toplevel
2022-05-08 13:12:35,089 DEBUG: Directory: build/app.zeusln.zeus
2022-05-08 13:12:35,089 DEBUG: > git submodule foreach --recursive git reset --hard
2022-05-08 13:12:35,194 DEBUG: Directory: build/app.zeusln.zeus
2022-05-08 13:12:35,194 DEBUG: > git reset --hard
2022-05-08 13:12:35,399 DEBUG: Directory: build/app.zeusln.zeus
2022-05-08 13:12:35,400 DEBUG: > git submodule foreach --recursive git clean -dffx
2022-05-08 13:12:35,504 DEBUG: Directory: build/app.zeusln.zeus
2022-05-08 13:12:35,505 DEBUG: > git clean -dffx
2022-05-08 13:12:35,713 DEBUG: Directory: build/app.zeusln.zeus
2022-05-08 13:12:35,713 DEBUG: > git -c core.askpass=/bin/true -c core.sshCommand=/bin/false -c url.https://.insteadOf=ssh:// -c url.https://u:p@bitbucket.org/.insteadOf=git@bitbucket.org: -c url.https://u:p@bitbucket.org.insteadOf=git://bitbucket.org -c url.https://u:p@bitbucket.org.insteadOf=https://bitbucket.org -c url.https://u:p@github.com/.insteadOf=git@github.com: -c url.https://u:p@github.com.insteadOf=git://github.com -c url.https://u:p@github.com.insteadOf=https://github.com -c url.https://u:p@gitlab.com/.insteadOf=git@gitlab.com: -c url.https://u:p@gitlab.com.insteadOf=git://gitlab.com -c url.https://u:p@gitlab.com.insteadOf=https://gitlab.com fetch origin
2022-05-08 13:12:36,129 DEBUG: Directory: build/app.zeusln.zeus
2022-05-08 13:12:36,130 DEBUG: > git -c core.askpass=/bin/true -c core.sshCommand=/bin/false -c url.https://.insteadOf=ssh:// -c url.https://u:p@bitbucket.org/.insteadOf=git@bitbucket.org: -c url.https://u:p@bitbucket.org.insteadOf=git://bitbucket.org -c url.https://u:p@bitbucket.org.insteadOf=https://bitbucket.org -c url.https://u:p@github.com/.insteadOf=git@github.com: -c url.https://u:p@github.com.insteadOf=git://github.com -c url.https://u:p@github.com.insteadOf=https://github.com -c url.https://u:p@gitlab.com/.insteadOf=git@gitlab.com: -c url.https://u:p@gitlab.com.insteadOf=git://gitlab.com -c url.https://u:p@gitlab.com.insteadOf=https://gitlab.com remote prune origin
2022-05-08 13:12:36,440 DEBUG: Directory: build/app.zeusln.zeus
2022-05-08 13:12:36,441 DEBUG: > git -c core.askpass=/bin/true -c core.sshCommand=/bin/false -c url.https://.insteadOf=ssh:// -c url.https://u:p@bitbucket.org/.insteadOf=git@bitbucket.org: -c url.https://u:p@bitbucket.org.insteadOf=git://bitbucket.org -c url.https://u:p@bitbucket.org.insteadOf=https://bitbucket.org -c url.https://u:p@github.com/.insteadOf=git@github.com: -c url.https://u:p@github.com.insteadOf=git://github.com -c url.https://u:p@github.com.insteadOf=https://github.com -c url.https://u:p@gitlab.com/.insteadOf=git@gitlab.com: -c url.https://u:p@gitlab.com.insteadOf=git://gitlab.com -c url.https://u:p@gitlab.com.insteadOf=https://gitlab.com fetch --prune --tags --force origin
2022-05-08 13:12:36,748 DEBUG: Directory: build/app.zeusln.zeus
2022-05-08 13:12:36,749 DEBUG: > git remote set-head origin --auto
2022-05-08 13:12:37,533 DEBUG: Directory: build/app.zeusln.zeus
2022-05-08 13:12:37,533 DEBUG: > git checkout -f 17f8db57dcdad3c08f1a2e60e8abe7eb2d2b88cf
2022-05-08 13:12:37,741 DEBUG: Directory: build/app.zeusln.zeus
2022-05-08 13:12:37,741 DEBUG: > git clean -dffx
2022-05-08 13:12:37,852 INFO: Collecting source libraries
2022-05-08 13:12:37,871 DEBUG: Removing debuggable flags from build/srclib/rustup
2022-05-08 13:12:37,884 DEBUG: Removing debuggable flags from build/srclib/sifir-rs-sdk
2022-05-08 13:12:37,887 INFO: Creating local.properties file at build/app.zeusln.zeus/local.properties
2022-05-08 13:12:37,888 INFO: Creating local.properties file at build/app.zeusln.zeus/android/local.properties
2022-05-08 13:12:37,888 INFO: Creating local.properties file at build/app.zeusln.zeus/android/app/local.properties
2022-05-08 13:12:37,888 DEBUG: Removing debuggable flags from build/app.zeusln.zeus/android/app
2022-05-08 13:12:37,892 INFO: Cleaned build.gradle of keysigning configs at build/app.zeusln.zeus/android/app/build.gradle
2022-05-08 13:12:37,895 INFO: Running 'prebuild' commands in build/app.zeusln.zeus/android/app
2022-05-08 13:12:37,896 DEBUG: Directory: build/app.zeusln.zeus/android/app
2022-05-08 13:12:37,896 DEBUG: > bash -x -c -- sed -i -e "/swiperefreshlayout/a implementation(project(':react-native-camera')) { exclude group\x3a 'com.google.firebase'\\ exclude group\x3a 'com.google.android.gms'\\ }" build.gradle && echo -e '\n' 'org.gradle.jvmargs=-Xmx2048m -XX:MaxPermSize=512m -XX:+HeapDumpOnOutOfMemoryError -Dfile.encoding=UTF-8' >> ../gradle.properties && cd ../.. && npm install && npm run postinstall && cp -r /home/vagrant/build/srclib/sifir-rs-sdk .
+ sed -i -e '/swiperefreshlayout/a implementation(project('\'':react-native-camera'\'')) { exclude group\x3a '\''com.google.firebase'\''\ exclude group\x3a '\''com.google.android.gms'\''\ }' build.gradle
+ echo -e '\n' 'org.gradle.jvmargs=-Xmx2048m -XX:MaxPermSize=512m -XX:+HeapDumpOnOutOfMemoryError -Dfile.encoding=UTF-8'
+ cd ../..
+ npm install
npm WARN read-shrinkwrap This version of npm is compatible with lockfileVersion@1, but package-lock.json was generated for lockfileVersion@2. I'll try to do my best with it!
npm WARN notice [SECURITY] bl has the following vulnerabilities: 1 high, 1 moderate. Go here for more details: https://github.com/advisories?query=bl - Run `npm i npm@latest -g` to upgrade your npm version, and then `npm audit` to get more info.
npm WARN notice [SECURITY] node-fetch has the following vulnerabilities: 1 high, 1 low. Go here for more details: https://github.com/advisories?query=node-fetch - Run `npm i npm@latest -g` to upgrade your npm version, and then `npm audit` to get more info.
npm WARN notice [SECURITY] semver has the following vulnerability: 1 moderate. Go here for more details: https://github.com/advisories?query=semver - Run `npm i npm@latest -g` to upgrade your npm version, and then `npm audit` to get more info.

> secp256k1@3.8.0 install /home/vagrant/build/app.zeusln.zeus/node_modules/secp256k1
> npm run rebuild || echo "Secp256k1 bindings compilation fail. Pure JS implementation will be used."


> secp256k1@3.8.0 rebuild /home/vagrant/build/app.zeusln.zeus/node_modules/secp256k1
> node-gyp rebuild

make: Entering directory '/home/vagrant/build/app.zeusln.zeus/node_modules/secp256k1/build'
  CXX(target) Release/obj.target/secp256k1/src/addon.o
  CXX(target) Release/obj.target/secp256k1/src/privatekey.o
../src/privatekey.cc: In function ‘Nan::NAN_METHOD_RETURN_TYPE privateKeyNegate(Nan::NAN_METHOD_ARGS_TYPE)’:
../src/privatekey.cc:73:61: warning: ignoring return value of ‘int secp256k1_ec_privkey_negate(const secp256k1_context*, unsigned char*)’, declared with attribute warn_unused_result [-Wunused-result]
   secp256k1_ec_privkey_negate(secp256k1ctx, &private_key[0]);
                                                             ^
  CXX(target) Release/obj.target/secp256k1/src/publickey.o
  CXX(target) Release/obj.target/secp256k1/src/signature.o
  CXX(target) Release/obj.target/secp256k1/src/ecdsa.o
  CXX(target) Release/obj.target/secp256k1/src/ecdh.o
  CC(target) Release/obj.target/secp256k1/src/secp256k1-src/src/secp256k1.o
  CC(target) Release/obj.target/secp256k1/src/secp256k1-src/contrib/lax_der_parsing.o
  CC(target) Release/obj.target/secp256k1/src/secp256k1-src/contrib/lax_der_privatekey_parsing.o
  SOLINK_MODULE(target) Release/obj.target/secp256k1.node
  COPY Release/secp256k1.node
make: Leaving directory '/home/vagrant/build/app.zeusln.zeus/node_modules/secp256k1/build'

> react-native-elements@2.3.2 postinstall /home/vagrant/build/app.zeusln.zeus/node_modules/react-native-elements
> opencollective-postinstall || exit 0

Thank you for using react-native-elements!
If you rely on this package, please consider supporting our open collective:
> https://opencollective.com/react-native-elements/donate


> react-native-unimodules@0.7.0 postinstall /home/vagrant/build/app.zeusln.zeus/node_modules/react-native-unimodules
> node ./scripts/postinstall.js


Successfully installed react-native-unimodules. This package contains core unimodules that are commonly depended on by other unimodules. You will need to configure your project before using other unimodules like expo-camera, expo-media-library and others.
See configuration guide:
  https://www.npmjs.com/package/react-native-unimodules/v/0.7.0


> zeus@0.6.4 postinstall /home/vagrant/build/app.zeusln.zeus
> rn-nodeify --install --hack; npx jetify

not overwriting "assert"
not overwriting "browserify-zlib"
not overwriting "buffer"
not overwriting "inherits"
not overwriting "console-browserify"
not overwriting "constants-browserify"
not overwriting "react-native-crypto"
not overwriting "dns.js"
not overwriting "domain-browser"
not overwriting "events"
not overwriting "@tradle/react-native-http"
not overwriting "https-browserify"
not overwriting "react-native-os"
not overwriting "path-browserify"
not overwriting "process"
not overwriting "punycode"
not overwriting "querystring-es3"
not overwriting "react-native-level-fs"
not overwriting "react-native-udp"
not overwriting "stream-browserify"
not overwriting "string_decoder"
not overwriting "timers-browserify"
not overwriting "tty-browserify"
not overwriting "url"
not overwriting "util"
not overwriting "react-native-tcp"
not overwriting "vm-browserify"
not overwriting "readable-stream"
not overwriting "react-native-randombytes"
not overwriting shim.js. For the latest version, see rn-nodeify/shim.js
removing browser exclude node_modules/bn.js/package.json buffer
removing browser exclude node_modules/readable-stream/package.json util
removing browser exclude node_modules/typescript/package.json buffer
removing browser exclude node_modules/browserify-rsa/node_modules/bn.js/package.json buffer
removing browser exclude node_modules/browserify-sign/node_modules/bn.js/package.json buffer
removing browser exclude node_modules/browserify-sign/node_modules/readable-stream/package.json util
normalized "main" browser mapping in readable-stream, fixed here: https://github.com/facebook/metro-bundler/pull/3
removing browser exclude node_modules/concat-stream/node_modules/readable-stream/package.json util
normalized "main" browser mapping in readable-stream, fixed here: https://github.com/facebook/metro-bundler/pull/3
removing browser exclude node_modules/hash-base/node_modules/readable-stream/package.json util
normalized "main" browser mapping in readable-stream, fixed here: https://github.com/facebook/metro-bundler/pull/3
removing browser exclude node_modules/through2/node_modules/readable-stream/package.json util
normalized "main" browser mapping in readable-stream, fixed here: https://github.com/facebook/metro-bundler/pull/3
failed to parse node_modules/resolve/test/resolver/malformed_package_json/package.json
hacking /home/vagrant/build/app.zeusln.zeus/node_modules/assert/assert.js
hacking /home/vagrant/build/app.zeusln.zeus/node_modules/form-data/package.json
hacking /home/vagrant/build/app.zeusln.zeus/node_modules/iconv-lite/package.json
hacking /home/vagrant/build/app.zeusln.zeus/node_modules/pbkdf2/browser.js
hacking /home/vagrant/build/app.zeusln.zeus/node_modules/readable-stream/readable.js
hacking /home/vagrant/build/app.zeusln.zeus/node_modules/stream-browserify/index.js
hacking /home/vagrant/build/app.zeusln.zeus/node_modules/levelup/lib/util.js
hacking /home/vagrant/build/app.zeusln.zeus/node_modules/react-native-gesture-handler/DrawerLayout/package.json
hacking /home/vagrant/build/app.zeusln.zeus/node_modules/react-native-gesture-handler/Swipeable/package.json
hacking /home/vagrant/build/app.zeusln.zeus/node_modules/react-native-screens/createNativeStackNavigator/package.json
hacking /home/vagrant/build/app.zeusln.zeus/node_modules/react-native-screens/native-stack/package.json
hacking /home/vagrant/build/app.zeusln.zeus/node_modules/readable-stream/lib/_stream_readable.js
hacking /home/vagrant/build/app.zeusln.zeus/node_modules/readable-stream/lib/_stream_writable.js
hacking /home/vagrant/build/app.zeusln.zeus/node_modules/browserify-sign/node_modules/readable-stream/package.json
hacking /home/vagrant/build/app.zeusln.zeus/node_modules/browserify-sign/node_modules/readable-stream/readable.js
hacking /home/vagrant/build/app.zeusln.zeus/node_modules/concat-stream/node_modules/readable-stream/readable.js
hacking /home/vagrant/build/app.zeusln.zeus/node_modules/hash-base/node_modules/readable-stream/package.json
hacking /home/vagrant/build/app.zeusln.zeus/node_modules/hash-base/node_modules/readable-stream/readable.js
hacking /home/vagrant/build/app.zeusln.zeus/node_modules/through2/node_modules/readable-stream/readable.js
hacking /home/vagrant/build/app.zeusln.zeus/node_modules/react-native-reanimated/node_modules/react-native-screens/createNativeStackNavigator/package.json
hacking /home/vagrant/build/app.zeusln.zeus/node_modules/react-native-reanimated/node_modules/react-native-screens/native-stack/package.json
Jetifier is deprecated. Future versions of react-native CLI may not run it by default.
Jetifier found 1520 file(s) to forward-jetify. Using 6 workers...
Jetifier: propose an AndroidX conversion PR to this repository: node_modules/react-native-tcp/android/src/main/java/com/peel/react/TcpSocketManager.java
Jetifier: propose an AndroidX conversion PR to this repository: node_modules/react-native-tcp/android/src/main/java/com/peel/react/TcpSockets.java
Jetifier: propose an AndroidX conversion PR to this repository: node_modules/react-native-udp/android/src/main/java/com/tradle/react/UdpSocketClient.java
Jetifier: propose an AndroidX conversion PR to this repository: node_modules/react-native-udp/android/src/main/java/com/tradle/react/UdpSockets.java
npm WARN optional SKIPPING OPTIONAL DEPENDENCY: fsevents@2.3.2 (node_modules/fsevents):
npm WARN notsup SKIPPING OPTIONAL DEPENDENCY: Unsupported platform for fsevents@2.3.2: wanted {"os":"darwin","arch":"any"} (current: {"os":"linux","arch":"x64"})

added 1634 packages from 941 contributors in 69.45s
+ npm run postinstall

> zeus@0.6.4 postinstall /home/vagrant/build/app.zeusln.zeus
> rn-nodeify --install --hack; npx jetify

not overwriting "assert"
not overwriting "browserify-zlib"
not overwriting "buffer"
not overwriting "inherits"
not overwriting "console-browserify"
not overwriting "constants-browserify"
not overwriting "react-native-crypto"
not overwriting "dns.js"
not overwriting "domain-browser"
not overwriting "events"
not overwriting "@tradle/react-native-http"
not overwriting "https-browserify"
not overwriting "react-native-os"
not overwriting "path-browserify"
not overwriting "process"
not overwriting "punycode"
not overwriting "querystring-es3"
not overwriting "react-native-level-fs"
not overwriting "react-native-udp"
not overwriting "stream-browserify"
not overwriting "string_decoder"
not overwriting "timers-browserify"
not overwriting "tty-browserify"
not overwriting "url"
not overwriting "util"
not overwriting "react-native-tcp"
not overwriting "vm-browserify"
not overwriting "readable-stream"
not overwriting "react-native-randombytes"
not overwriting shim.js. For the latest version, see rn-nodeify/shim.js
failed to parse node_modules/resolve/test/resolver/malformed_package_json/package.json
Jetifier is deprecated. Future versions of react-native CLI may not run it by default.
Jetifier found 1520 file(s) to forward-jetify. Using 6 workers...
+ cp -r /home/vagrant/build/srclib/sifir-rs-sdk .
2022-05-08 13:13:53,960 INFO: Cleaning Gradle project...
2022-05-08 13:13:53,961 DEBUG: Directory: build/app.zeusln.zeus/android/app
2022-05-08 13:13:53,961 DEBUG: > /home/vagrant/fdroidserver/gradlew-fdroid clean
Found 7.2 via distributionUrl
Downloading missing gradle version 7.2
cachedir /home/vagrant/.cache/fdroidserver
/home/vagrant/.cache/fdroidserver/gradle-7.2-bin.zip: OK
Running /opt/gradle/versions/7.2/bin/gradle clean

Welcome to Gradle 7.2!

Here are the highlights of this release:
 - Toolchain support for Scala
 - More cache hits when Java source files have platform-specific line endings
 - More resilient remote HTTP build cache behavior

For more details see https://docs.gradle.org/7.2/release-notes.html

To honour the JVM settings for this build a single-use Daemon process will be forked. See https://docs.gradle.org/7.2/userguide/gradle_daemon.html#sec:disabling_the_daemon.
Daemon will be stopped at the end of the build 
:ReactNative:Unexpected empty result of running '[node, -e, console.log(require('react-native/cli').bin);]' command.
:ReactNative:Running '[node, -e, console.log(require('react-native/cli').bin);]' command failed.

FAILURE: Build failed with an exception.

* Where:
Script '/home/vagrant/build/app.zeusln.zeus/node_modules/@react-native-community/cli-platform-android/native_modules.gradle' line: 213

* What went wrong:
A problem occurred evaluating script.
> /home/vagrant/build/app.zeusln.zeus/node_modules/@react-native-community/cli/build/commands/doctor/healthchecks/index.js:48  } catch {}          ^SyntaxError: Unexpected token {    at createScript (vm.js:80:10)    at Object.runInThisContext (vm.js:139:10)    at Module._compile (module.js:616:28)    at Object.Module._extensions..js (module.js:663:10)    at Module.load (module.js:565:32)    at tryModuleLoad (module.js:505:12)    at Function.Module._load (module.js:497:3)    at Module.require (module.js:596:17)    at require (internal/module.js:11:18)    at Object.<anonymous> (/home/vagrant/build/app.zeusln.zeus/node_modules/@react-native-community/cli/build/commands/doctor/doctor.js:28:21)

* Try:
Run with --stacktrace option to get the stack trace. Run with --info or --debug option to get more log output. Run with --scan to get full insights.

* Get more help at https://help.gradle.org

BUILD FAILED in 20s
2022-05-08 13:14:21,145 ERROR: Could not build app app.zeusln.zeus: Error cleaning app.zeusln.zeus:0.6.4
==== detail begin ====
Found 7.2 via distributionUrl
Downloading missing gradle version 7.2
cachedir /home/vagrant/.cache/fdroidserver
/home/vagrant/.cache/fdroidserver/gradle-7.2-bin.zip: OK
Running /opt/gradle/versions/7.2/bin/gradle clean

Welcome to Gradle 7.2!

Here are the highlights of this release:
 - Toolchain support for Scala
 - More cache hits when Java source files have platform-specific line endings
 - More resilient remote HTTP build cache behavior

For more details see https://docs.gradle.org/7.2/release-notes.html

To honour the JVM settings for this build a single-use Daemon process will be forked. See https://docs.gradle.org/7.2/userguide/gradle_daemon.html#sec:disabling_the_daemon.
Daemon will be stopped at the end of the build 
:ReactNative:Unexpected empty result of running '[node, -e, console.log(require('react-native/cli').bin);]' command.
:ReactNative:Running '[node, -e, console.log(require('react-native/cli').bin);]' command failed.

FAILURE: Build failed with an exception.

* Where:
Script '/home/vagrant/build/app.zeusln.zeus/node_modules/@react-native-community/cli-platform-android/native_modules.gradle' line: 213

* What went wrong:
A problem occurred evaluating script.
> /home/vagrant/build/app.zeusln.zeus/node_modules/@react-native-community/cli/build/commands/doctor/healthchecks/index.js:48  } catch {}          ^SyntaxError: Unexpected token {    at createScript (vm.js:80:10)    at Object.runInThisContext (vm.js:139:10)    at Module._compile (module.js:616:28)    at Object.Module._extensions..js (module.js:663:10)    at Module.load (module.js:565:32)    at tryModuleLoad (module.js:505:12)    at Function.Module._load (module.js:497:3)    at Module.require (module.js:596:17)    at require (internal/module.js:11:18)    at Object.<anonymous> (/home/vagrant/build/app.zeusln.zeus/node_modules/@react-native-community/cli/build/commands/doctor/doctor.js:28:21)

* Try:
Run with --stacktrace option to get the stack trace. Run with --info or --debug option to get more log output. Run with --scan to get full insights.

* Get more help at https://help.gradle.org

BUILD FAILED in 20s
==== detail end ====
2022-05-08 13:14:21,145 DEBUG: Error encoutered, stopping by user request.
==== detail end ====