log for com.donnnno.arcticons.light:67

== Installed Android Tools ==

2021-09-20 10:49:42,684 DEBUG: Reading 'config.yml'
2021-09-20 10:49:42,694 INFO: Using /opt/android-sdk/build-tools/29.0.3/apksigner 
2021-09-20 10:49:42,698 INFO: Creating log directory
2021-09-20 10:49:42,698 INFO: Creating temporary directory
2021-09-20 10:49:42,698 INFO: Creating output directory
2021-09-20 10:49:42,700 DEBUG: Getting git vcs interface for https://github.com/Donnnno/Arcticons
2021-09-20 10:49:42,701 DEBUG: > git --version
git version 2.11.0
2021-09-20 10:49:43,118 INFO: Using git version 2.11.0
2021-09-20 10:49:43,118 DEBUG: Checking 2.1.8
2021-09-20 10:49:43,119 INFO: Building version 2.1.8 (67) of com.donnnno.arcticons.light
2021-09-20 10:49:43,119 INFO: Running 'sudo' commands in /home/vagrant
2021-09-20 10:49:43,120 DEBUG: > sudo DEBIAN_FRONTEND=noninteractive bash -x -c apt-get update || apt-get update && apt-get install -y openjdk-11-jdk-headless && update-alternatives --auto java
+ apt-get update
Get:1 http://security.debian.org/debian-security stretch/updates InRelease [53.0 kB]
Ign:2 https://deb.debian.org/debian stretch InRelease
Hit:3 https://deb.debian.org/debian stretch-updates InRelease
Get:4 https://deb.debian.org/debian stretch-backports-sloppy InRelease [46.7 kB]
Get:5 https://deb.debian.org/debian stretch-backports InRelease [91.8 kB]
Get:6 https://deb.debian.org/debian testing InRelease [128 kB]
Hit:7 https://deb.debian.org/debian stretch Release
Get:8 http://security.debian.org/debian-security stretch/updates/main i386 Packages [717 kB]
Get:9 http://security.debian.org/debian-security stretch/updates/main amd64 Packages [716 kB]
Get:10 http://security.debian.org/debian-security stretch/updates/main Translation-en [330 kB]
Get:11 https://deb.debian.org/debian testing/main amd64 Packages.diff/Index [63.6 kB]
Get:12 https://deb.debian.org/debian testing/main i386 Packages.diff/Index [63.6 kB]
Get:13 https://deb.debian.org/debian testing/main Translation-en.diff/Index [63.6 kB]
Ign:11 https://deb.debian.org/debian testing/main amd64 Packages.diff/Index
Ign:12 https://deb.debian.org/debian testing/main i386 Packages.diff/Index
Get:15 https://deb.debian.org/debian testing/main Translation-en T-2021-09-20-0801.22-F-2021-08-25-2010.21.pdiff [94.5 kB]
Get:15 https://deb.debian.org/debian testing/main Translation-en T-2021-09-20-0801.22-F-2021-08-25-2010.21.pdiff [94.5 kB]
Get:16 https://deb.debian.org/debian testing/main amd64 Packages [8,297 kB]
Get:17 https://deb.debian.org/debian testing/main i386 Packages [8,234 kB]
Fetched 18.9 MB in 4s (4,220 kB/s)
Reading package lists...
+ apt-get install -y openjdk-11-jdk-headless
Reading package lists...
Building dependency tree...
Reading state information...
The following additional packages will be installed:
  libasound2 libasound2-data openjdk-11-jre-headless
Suggested packages:
  libasound2-plugins alsa-utils openjdk-11-demo openjdk-11-source libnss-mdns
  fonts-dejavu-extra fonts-ipafont-gothic fonts-ipafont-mincho
  fonts-wqy-microhei | fonts-wqy-zenhei fonts-indic
The following NEW packages will be installed:
  libasound2 libasound2-data openjdk-11-jdk-headless openjdk-11-jre-headless
0 upgraded, 4 newly installed, 0 to remove and 6 not upgraded.
Need to get 230 MB of archives.
After this operation, 374 MB of additional disk space will be used.
Get:1 https://deb.debian.org/debian stretch/main amd64 libasound2-data all 1.1.3-5 [173 kB]
Get:2 https://deb.debian.org/debian stretch/main amd64 libasound2 amd64 1.1.3-5 [497 kB]
Get:3 https://deb.debian.org/debian stretch-backports/main amd64 openjdk-11-jre-headless amd64 11.0.6+10-1~bpo9+1 [37.4 MB]
Get:4 https://deb.debian.org/debian stretch-backports/main amd64 openjdk-11-jdk-headless amd64 11.0.6+10-1~bpo9+1 [192 MB]
Fetched 230 MB in 2s (77.9 MB/s)
Selecting previously unselected package libasound2-data.
(Reading database ... 64894 files and directories currently installed.)
Preparing to unpack .../libasound2-data_1.1.3-5_all.deb ...
Unpacking libasound2-data (1.1.3-5) ...
Selecting previously unselected package libasound2:amd64.
Preparing to unpack .../libasound2_1.1.3-5_amd64.deb ...
Unpacking libasound2:amd64 (1.1.3-5) ...
Selecting previously unselected package openjdk-11-jre-headless:amd64.
Preparing to unpack .../openjdk-11-jre-headless_11.0.6+10-1~bpo9+1_amd64.deb ...
Unpacking openjdk-11-jre-headless:amd64 (11.0.6+10-1~bpo9+1) ...
Selecting previously unselected package openjdk-11-jdk-headless:amd64.
Preparing to unpack .../openjdk-11-jdk-headless_11.0.6+10-1~bpo9+1_amd64.deb ...
Unpacking openjdk-11-jdk-headless:amd64 (11.0.6+10-1~bpo9+1) ...
Setting up libasound2-data (1.1.3-5) ...
Setting up libasound2:amd64 (1.1.3-5) ...
Processing triggers for libc-bin (2.24-11+deb9u4) ...
Setting up openjdk-11-jre-headless:amd64 (11.0.6+10-1~bpo9+1) ...
Setting up openjdk-11-jdk-headless:amd64 (11.0.6+10-1~bpo9+1) ...
update-alternatives: using /usr/lib/jvm/java-11-openjdk-amd64/bin/jdeprscan to provide /usr/bin/jdeprscan (jdeprscan) in auto mode
update-alternatives: using /usr/lib/jvm/java-11-openjdk-amd64/bin/jimage to provide /usr/bin/jimage (jimage) in auto mode
update-alternatives: using /usr/lib/jvm/java-11-openjdk-amd64/bin/jlink to provide /usr/bin/jlink (jlink) in auto mode
update-alternatives: using /usr/lib/jvm/java-11-openjdk-amd64/bin/jmod to provide /usr/bin/jmod (jmod) in auto mode
update-alternatives: using /usr/lib/jvm/java-11-openjdk-amd64/bin/jshell to provide /usr/bin/jshell (jshell) in auto mode
update-alternatives: using /usr/lib/jvm/java-11-openjdk-amd64/bin/jaotc to provide /usr/bin/jaotc (jaotc) in auto mode
update-alternatives: using /usr/lib/jvm/java-11-openjdk-amd64/bin/jhsdb to provide /usr/bin/jhsdb (jhsdb) in auto mode
+ update-alternatives --auto java
update-alternatives: using /usr/lib/jvm/java-11-openjdk-amd64/bin/java to provide /usr/bin/java (java) in auto mode
2021-09-20 10:50:13,596 DEBUG: > sudo passwd --lock root
passwd: password expiry information changed.
2021-09-20 10:50:13,800 DEBUG: > sudo SUDO_FORCE_REMOVE=yes dpkg --purge sudo
(Reading database ... 65551 files and directories currently installed.)
Removing sudo (1.8.19p1-2.1+deb9u3) ...
Purging configuration files for sudo (1.8.19p1-2.1+deb9u3) ...
Processing triggers for systemd (232-25+deb9u13) ...
2021-09-20 10:50:19,802 INFO: Getting source for revision 18bb273eed72ed46be37ea3fb3c9a0adcc4f38d2
2021-09-20 10:50:19,802 DEBUG: Directory: build/com.donnnno.arcticons.light
2021-09-20 10:50:19,803 DEBUG: > git rev-parse --show-toplevel
2021-09-20 10:50:20,015 DEBUG: Directory: build/com.donnnno.arcticons.light
2021-09-20 10:50:20,015 DEBUG: > git submodule foreach --recursive git reset --hard
2021-09-20 10:50:20,222 DEBUG: Directory: build/com.donnnno.arcticons.light
2021-09-20 10:50:20,223 DEBUG: > git reset --hard
2021-09-20 10:50:21,047 DEBUG: Directory: build/com.donnnno.arcticons.light
2021-09-20 10:50:21,047 DEBUG: > git submodule foreach --recursive git clean -dffx
2021-09-20 10:50:21,150 DEBUG: Directory: build/com.donnnno.arcticons.light
2021-09-20 10:50:21,150 DEBUG: > git clean -dffx
2021-09-20 10:50:21,309 DEBUG: Directory: build/com.donnnno.arcticons.light
2021-09-20 10:50:21,309 DEBUG: > git -c core.askpass=/bin/true -c core.sshCommand=/bin/false -c url.https://.insteadOf=ssh:// -c url.https://u:p@bitbucket.org/.insteadOf=git@bitbucket.org: -c url.https://u:p@bitbucket.org.insteadOf=git://bitbucket.org -c url.https://u:p@bitbucket.org.insteadOf=https://bitbucket.org -c url.https://u:p@github.com/.insteadOf=git@github.com: -c url.https://u:p@github.com.insteadOf=git://github.com -c url.https://u:p@github.com.insteadOf=https://github.com -c url.https://u:p@gitlab.com/.insteadOf=git@gitlab.com: -c url.https://u:p@gitlab.com.insteadOf=git://gitlab.com -c url.https://u:p@gitlab.com.insteadOf=https://gitlab.com fetch origin
2021-09-20 10:50:21,716 DEBUG: Directory: build/com.donnnno.arcticons.light
2021-09-20 10:50:21,716 DEBUG: > git -c core.askpass=/bin/true -c core.sshCommand=/bin/false -c url.https://.insteadOf=ssh:// -c url.https://u:p@bitbucket.org/.insteadOf=git@bitbucket.org: -c url.https://u:p@bitbucket.org.insteadOf=git://bitbucket.org -c url.https://u:p@bitbucket.org.insteadOf=https://bitbucket.org -c url.https://u:p@github.com/.insteadOf=git@github.com: -c url.https://u:p@github.com.insteadOf=git://github.com -c url.https://u:p@github.com.insteadOf=https://github.com -c url.https://u:p@gitlab.com/.insteadOf=git@gitlab.com: -c url.https://u:p@gitlab.com.insteadOf=git://gitlab.com -c url.https://u:p@gitlab.com.insteadOf=https://gitlab.com fetch --prune --tags --force origin
2021-09-20 10:50:22,021 DEBUG: Directory: build/com.donnnno.arcticons.light
2021-09-20 10:50:22,021 DEBUG: > git remote set-head origin --auto
2021-09-20 10:50:22,474 DEBUG: Directory: build/com.donnnno.arcticons.light
2021-09-20 10:50:22,475 DEBUG: > git checkout -f 18bb273eed72ed46be37ea3fb3c9a0adcc4f38d2
2021-09-20 10:50:22,998 DEBUG: Directory: build/com.donnnno.arcticons.light
2021-09-20 10:50:22,998 DEBUG: > git clean -dffx
2021-09-20 10:50:23,190 INFO: Creating local.properties file at build/com.donnnno.arcticons.light/local.properties
2021-09-20 10:50:23,191 INFO: Creating local.properties file at build/com.donnnno.arcticons.light/app/local.properties
2021-09-20 10:50:23,191 DEBUG: Removing debuggable flags from build/com.donnnno.arcticons.light/app
2021-09-20 10:50:23,216 INFO: Cleaning Gradle project...
2021-09-20 10:50:23,216 DEBUG: Directory: build/com.donnnno.arcticons.light/app
2021-09-20 10:50:23,216 DEBUG: > /home/vagrant/fdroidserver/gradlew-fdroid clean
No suitable gradle version found - defaulting to 7.2
Downloading missing gradle version 7.2
cachedir /home/vagrant/.cache/fdroidserver
/home/vagrant/.cache/fdroidserver/gradle-7.2-bin.zip: OK
Running /opt/gradle/versions/7.2/bin/gradle clean

Welcome to Gradle 7.2!

Here are the highlights of this release:
 - Toolchain support for Scala
 - More cache hits when Java source files have platform-specific line endings
 - More resilient remote HTTP build cache behavior

For more details see https://docs.gradle.org/7.2/release-notes.html

To honour the JVM settings for this build a single-use Daemon process will be forked. See https://docs.gradle.org/7.2/userguide/gradle_daemon.html#sec:disabling_the_daemon.
Daemon will be stopped at the end of the build 
Configuration cache is an incubating feature.
Calculating task graph as no configuration cache is available for tasks: clean
> Task :app:clean UP-TO-DATE

BUILD SUCCESSFUL in 30s
1 actionable task: 1 up-to-date
Configuration cache entry stored.
2021-09-20 10:50:59,044 INFO: Scanning source for common problems...
2021-09-20 10:50:59,392 INFO: Creating source tarball...
2021-09-20 10:51:02,736 INFO: Building Gradle project...
2021-09-20 10:51:02,736 DEBUG: Directory: build/com.donnnno.arcticons.light/app
2021-09-20 10:51:02,737 DEBUG: > /home/vagrant/fdroidserver/gradlew-fdroid assembleLightRelease
No suitable gradle version found - defaulting to 7.2
Running /opt/gradle/versions/7.2/bin/gradle assembleLightRelease
To honour the JVM settings for this build a single-use Daemon process will be forked. See https://docs.gradle.org/7.2/userguide/gradle_daemon.html#sec:disabling_the_daemon.
Daemon will be stopped at the end of the build 
Configuration cache is an incubating feature.
Calculating task graph as no configuration cache is available for tasks: assembleLightRelease
Checking the license for package Android SDK Build-Tools 30.0.2 in /opt/android-sdk/licenses
License for package Android SDK Build-Tools 30.0.2 accepted.
Preparing "Install Android SDK Build-Tools 30.0.2 (revision: 30.0.2)".
"Install Android SDK Build-Tools 30.0.2 (revision: 30.0.2)" ready.
Installing Android SDK Build-Tools 30.0.2 in /opt/android-sdk/build-tools/30.0.2
"Install Android SDK Build-Tools 30.0.2 (revision: 30.0.2)" complete.
"Install Android SDK Build-Tools 30.0.2 (revision: 30.0.2)" finished.
Checking the license for package Android SDK Platform 30 in /opt/android-sdk/licenses
License for package Android SDK Platform 30 accepted.
Preparing "Install Android SDK Platform 30 (revision: 3)".
"Install Android SDK Platform 30 (revision: 3)" ready.
Installing Android SDK Platform 30 in /opt/android-sdk/platforms/android-30
"Install Android SDK Platform 30 (revision: 3)" complete.
"Install Android SDK Platform 30 (revision: 3)" finished.
> Task :app:preBuild UP-TO-DATE
> Task :app:preLightReleaseBuild UP-TO-DATE
> Task :app:compileLightReleaseAidl NO-SOURCE
> Task :app:compileLightReleaseRenderscript NO-SOURCE
> Task :app:dataBindingMergeDependencyArtifactsLightRelease
> Task :app:dataBindingMergeGenClassesLightRelease
> Task :app:generateLightReleaseResValues
> Task :app:generateLightReleaseResources

> Task :app:mergeLightReleaseResources
/home/vagrant/.gradle/caches/transforms-3/b6e93056a66f1b878f2d05dae35cf5de/transformed/jetified-library-3.12.1/res/values-fr-rFR/values-fr-rFR.xml:107:4: Multiple substitutions specified in non-positional format of string resource string/apply_launcher_incompatible. Did you mean to add the formatted="false" attribute?
/home/vagrant/.gradle/caches/transforms-3/b6e93056a66f1b878f2d05dae35cf5de/transformed/jetified-library-3.12.1/res/values-ar-rSA/values-ar-rSA.xml:95:4: Multiple substitutions specified in non-positional format of string resource string/apply_launcher_incompatible. Did you mean to add the formatted="false" attribute?
/home/vagrant/.gradle/caches/transforms-3/b6e93056a66f1b878f2d05dae35cf5de/transformed/jetified-library-3.12.1/res/values/values.xml:528:4: Multiple substitutions specified in non-positional format of string resource string/apply_launcher_incompatible. Did you mean to add the formatted="false" attribute?
/home/vagrant/.gradle/caches/transforms-3/b6e93056a66f1b878f2d05dae35cf5de/transformed/jetified-library-3.12.1/res/values-uk-rUA/values-uk-rUA.xml:99:4: Multiple substitutions specified in non-positional format of string resource string/apply_launcher_incompatible. Did you mean to add the formatted="false" attribute?
/home/vagrant/.gradle/caches/transforms-3/b6e93056a66f1b878f2d05dae35cf5de/transformed/jetified-library-3.12.1/res/values-de-rDE/values-de-rDE.xml:113:4: Multiple substitutions specified in non-positional format of string resource string/apply_launcher_incompatible. Did you mean to add the formatted="false" attribute?
/home/vagrant/.gradle/caches/transforms-3/b6e93056a66f1b878f2d05dae35cf5de/transformed/jetified-library-3.12.1/res/values-nl-rNL/values-nl-rNL.xml:39:4: Multiple substitutions specified in non-positional format of string resource string/apply_launcher_incompatible. Did you mean to add the formatted="false" attribute?
/home/vagrant/.gradle/caches/transforms-3/b6e93056a66f1b878f2d05dae35cf5de/transformed/jetified-library-3.12.1/res/values-hu-rHU/values-hu-rHU.xml:109:4: Multiple substitutions specified in non-positional format of string resource string/apply_launcher_incompatible. Did you mean to add the formatted="false" attribute?
/home/vagrant/.gradle/caches/transforms-3/b6e93056a66f1b878f2d05dae35cf5de/transformed/jetified-library-3.12.1/res/values-es-rES/values-es-rES.xml:110:4: Multiple substitutions specified in non-positional format of string resource string/apply_launcher_incompatible. Did you mean to add the formatted="false" attribute?
/home/vagrant/.gradle/caches/transforms-3/b6e93056a66f1b878f2d05dae35cf5de/transformed/jetified-library-3.12.1/res/values-cs-rCZ/values-cs-rCZ.xml:114:4: Multiple substitutions specified in non-positional format of string resource string/apply_launcher_incompatible. Did you mean to add the formatted="false" attribute?
/home/vagrant/.gradle/caches/transforms-3/b6e93056a66f1b878f2d05dae35cf5de/transformed/jetified-library-3.12.1/res/values-it-rIT/values-it-rIT.xml:113:4: Multiple substitutions specified in non-positional format of string resource string/apply_launcher_incompatible. Did you mean to add the formatted="false" attribute?

> Task :app:generateLightReleaseBuildConfig
> Task :app:javaPreCompileLightRelease
> Task :app:checkLightReleaseAarMetadata
> Task :app:createLightReleaseCompatibleScreenManifests
> Task :app:extractDeepLinksLightRelease

> Task :app:processLightReleaseMainManifest
/home/vagrant/build/com.donnnno.arcticons.light/app/src/main/AndroidManifest.xml:17:5-269:19 Warning:
	application@android:icon was tagged at AndroidManifest.xml:17 to replace other declarations but no other declaration present

> Task :app:mergeLightReleaseResources
/home/vagrant/.gradle/caches/transforms-3/b6e93056a66f1b878f2d05dae35cf5de/transformed/jetified-library-3.12.1/res/values-in-rID/values-in-rID.xml:112:4: Multiple substitutions specified in non-positional format of string resource string/apply_launcher_incompatible. Did you mean to add the formatted="false" attribute?
/home/vagrant/.gradle/caches/transforms-3/b6e93056a66f1b878f2d05dae35cf5de/transformed/jetified-library-3.12.1/res/values-bg-rBG/values-bg-rBG.xml:92:4: Multiple substitutions specified in non-positional format of string resource string/apply_manual. Did you mean to add the formatted="false" attribute?
/home/vagrant/.gradle/caches/transforms-3/b6e93056a66f1b878f2d05dae35cf5de/transformed/jetified-library-3.12.1/res/values-pt-rBR/values-pt-rBR.xml:107:4: Multiple substitutions specified in non-positional format of string resource string/apply_launcher_incompatible. Did you mean to add the formatted="false" attribute?
/home/vagrant/.gradle/caches/transforms-3/b6e93056a66f1b878f2d05dae35cf5de/transformed/jetified-library-3.12.1/res/values-ne-rNP/values-ne-rNP.xml:105:4: Multiple substitutions specified in non-positional format of string resource string/apply_launcher_incompatible. Did you mean to add the formatted="false" attribute?

> Task :app:processLightReleaseManifest
> Task :app:processLightReleaseManifestForPackage
> Task :app:mergeLightReleaseJniLibFolders
> Task :app:mergeLightReleaseNativeLibs NO-SOURCE
> Task :app:stripLightReleaseDebugSymbols NO-SOURCE
> Task :app:extractLightReleaseNativeSymbolTables NO-SOURCE
> Task :app:mergeLightReleaseNativeDebugMetadata NO-SOURCE
> Task :app:mergeLightReleaseArtProfile
> Task :app:checkLightReleaseDuplicateClasses
> Task :app:extractProguardFiles
> Task :app:processLightReleaseJavaRes NO-SOURCE
> Task :app:mergeLightReleaseJavaResource
> Task :app:mergeLightReleaseShaders
> Task :app:compileLightReleaseShaders NO-SOURCE
> Task :app:generateLightReleaseAssets UP-TO-DATE
> Task :app:mergeLightReleaseAssets
> Task :app:compressLightReleaseAssets
> Task :app:collectLightReleaseDependencies
> Task :app:sdkLightReleaseDependencyData
> Task :app:writeLightReleaseAppMetadata
> Task :app:writeLightReleaseSigningConfigVersions
> Task :app:dataBindingGenBaseClassesLightRelease
> Task :app:processLightReleaseResources
> Task :app:compileLightReleaseJavaWithJavac
> Task :app:compileLightReleaseSources
> Task :app:mergeLightReleaseGeneratedProguardFiles

> Task :app:minifyLightReleaseWithR8
WARNING:Missing classes detected while running R8. Please add the missing classes or apply additional keep rules that are generated in /home/vagrant/build/com.donnnno.arcticons.light/app/build/outputs/mapping/lightRelease/missing_rules.txt.

WARNING:R8: Missing class org.conscrypt.Conscrypt$Version (referenced from: boolean okhttp3.internal.platform.ConscryptPlatform$Companion.atLeastVersion(int, int, int))
Missing class org.conscrypt.Conscrypt (referenced from: boolean okhttp3.internal.platform.ConscryptPlatform$Companion.atLeastVersion(int, int, int) and 3 other contexts)
Missing class org.conscrypt.ConscryptHostnameVerifier (referenced from: okhttp3.internal.platform.ConscryptPlatform$configureTrustManager$1)
Missing class org.openjsse.javax.net.ssl.SSLParameters (referenced from: void okhttp3.internal.platform.OpenJSSEPlatform.configureTlsExtensions(javax.net.ssl.SSLSocket, java.util.List))
Missing class org.openjsse.javax.net.ssl.SSLSocket (referenced from: void okhttp3.internal.platform.OpenJSSEPlatform.configureTlsExtensions(javax.net.ssl.SSLSocket, java.util.List) and 1 other context)
Missing class org.openjsse.net.ssl.OpenJSSE (referenced from: void okhttp3.internal.platform.OpenJSSEPlatform.<init>())

> Task :app:compileLightReleaseArtProfile
> Task :app:optimizeLightReleaseResources
> Task :app:packageLightRelease
> Task :app:assembleLightRelease

FAILURE: Build failed with an exception.

* What went wrong:
Configuration cache problems found in this build.

1 problem was found storing the configuration cache.
- Task `:app:collectLightReleaseDependencies` of type `com.android.build.gradle.internal.tasks.PerModuleReportDependenciesTask`: invocation of 'Task.project' at execution time is unsupported.
  See https://docs.gradle.org/7.2/userguide/configuration_cache.html#config_cache:requirements:use_project_during_execution

See the complete report at file:///home/vagrant/build/com.donnnno.arcticons.light/build/reports/configuration-cache/8vnv6kz8fhkcyddk0bw1u7vue/3hp1nktcjj2fk89vc18kv5jjq/configuration-cache-report.html
> Invocation of 'Task.project' by task ':app:collectLightReleaseDependencies' at execution time is unsupported.

* Try:
Run with --stacktrace option to get the stack trace. Run with --info or --debug option to get more log output. Run with --scan to get full insights.

* Get more help at https://help.gradle.org

BUILD FAILED in 1m 26s
32 actionable tasks: 32 executed
Configuration cache entry discarded with 1 problem.
2021-09-20 10:52:30,930 DEBUG: Popen(['git', 'cat-file', '--batch-check'], cwd=/home/vagrant/build/com.donnnno.arcticons.light, universal_newlines=False, shell=None)
2021-09-20 10:52:30,938 ERROR: Could not build app com.donnnno.arcticons.light: Build failed for com.donnnno.arcticons.light:2.1.8@18bb273eed72ed46be37ea3fb3c9a0adcc4f38d2
==== detail begin ====
No suitable gradle version found - defaulting to 7.2
Running /opt/gradle/versions/7.2/bin/gradle assembleLightRelease
To honour the JVM settings for this build a single-use Daemon process will be forked. See https://docs.gradle.org/7.2/userguide/gradle_daemon.html#sec:disabling_the_daemon.
Daemon will be stopped at the end of the build 
Configuration cache is an incubating feature.
Calculating task graph as no configuration cache is available for tasks: assembleLightRelease
Checking the license for package Android SDK Build-Tools 30.0.2 in /opt/android-sdk/licenses
License for package Android SDK Build-Tools 30.0.2 accepted.
Preparing "Install Android SDK Build-Tools 30.0.2 (revision: 30.0.2)".
"Install Android SDK Build-Tools 30.0.2 (revision: 30.0.2)" ready.
Installing Android SDK Build-Tools 30.0.2 in /opt/android-sdk/build-tools/30.0.2
"Install Android SDK Build-Tools 30.0.2 (revision: 30.0.2)" complete.
"Install Android SDK Build-Tools 30.0.2 (revision: 30.0.2)" finished.
Checking the license for package Android SDK Platform 30 in /opt/android-sdk/licenses
License for package Android SDK Platform 30 accepted.
Preparing "Install Android SDK Platform 30 (revision: 3)".
"Install Android SDK Platform 30 (revision: 3)" ready.
Installing Android SDK Platform 30 in /opt/android-sdk/platforms/android-30
"Install Android SDK Platform 30 (revision: 3)" complete.
"Install Android SDK Platform 30 (revision: 3)" finished.
> Task :app:preBuild UP-TO-DATE
> Task :app:preLightReleaseBuild UP-TO-DATE
> Task :app:compileLightReleaseAidl NO-SOURCE
> Task :app:compileLightReleaseRenderscript NO-SOURCE
> Task :app:dataBindingMergeDependencyArtifactsLightRelease
> Task :app:dataBindingMergeGenClassesLightRelease
> Task :app:generateLightReleaseResValues
> Task :app:generateLightReleaseResources

> Task :app:mergeLightReleaseResources
/home/vagrant/.gradle/caches/transforms-3/b6e93056a66f1b878f2d05dae35cf5de/transformed/jetified-library-3.12.1/res/values-fr-rFR/values-fr-rFR.xml:107:4: Multiple substitutions specified in non-positional format of string resource string/apply_launcher_incompatible. Did you mean to add the formatted="false" attribute?
/home/vagrant/.gradle/caches/transforms-3/b6e93056a66f1b878f2d05dae35cf5de/transformed/jetified-library-3.12.1/res/values-ar-rSA/values-ar-rSA.xml:95:4: Multiple substitutions specified in non-positional format of string resource string/apply_launcher_incompatible. Did you mean to add the formatted="false" attribute?
/home/vagrant/.gradle/caches/transforms-3/b6e93056a66f1b878f2d05dae35cf5de/transformed/jetified-library-3.12.1/res/values/values.xml:528:4: Multiple substitutions specified in non-positional format of string resource string/apply_launcher_incompatible. Did you mean to add the formatted="false" attribute?
/home/vagrant/.gradle/caches/transforms-3/b6e93056a66f1b878f2d05dae35cf5de/transformed/jetified-library-3.12.1/res/values-uk-rUA/values-uk-rUA.xml:99:4: Multiple substitutions specified in non-positional format of string resource string/apply_launcher_incompatible. Did you mean to add the formatted="false" attribute?
/home/vagrant/.gradle/caches/transforms-3/b6e93056a66f1b878f2d05dae35cf5de/transformed/jetified-library-3.12.1/res/values-de-rDE/values-de-rDE.xml:113:4: Multiple substitutions specified in non-positional format of string resource string/apply_launcher_incompatible. Did you mean to add the formatted="false" attribute?
/home/vagrant/.gradle/caches/transforms-3/b6e93056a66f1b878f2d05dae35cf5de/transformed/jetified-library-3.12.1/res/values-nl-rNL/values-nl-rNL.xml:39:4: Multiple substitutions specified in non-positional format of string resource string/apply_launcher_incompatible. Did you mean to add the formatted="false" attribute?
/home/vagrant/.gradle/caches/transforms-3/b6e93056a66f1b878f2d05dae35cf5de/transformed/jetified-library-3.12.1/res/values-hu-rHU/values-hu-rHU.xml:109:4: Multiple substitutions specified in non-positional format of string resource string/apply_launcher_incompatible. Did you mean to add the formatted="false" attribute?
/home/vagrant/.gradle/caches/transforms-3/b6e93056a66f1b878f2d05dae35cf5de/transformed/jetified-library-3.12.1/res/values-es-rES/values-es-rES.xml:110:4: Multiple substitutions specified in non-positional format of string resource string/apply_launcher_incompatible. Did you mean to add the formatted="false" attribute?
/home/vagrant/.gradle/caches/transforms-3/b6e93056a66f1b878f2d05dae35cf5de/transformed/jetified-library-3.12.1/res/values-cs-rCZ/values-cs-rCZ.xml:114:4: Multiple substitutions specified in non-positional format of string resource string/apply_launcher_incompatible. Did you mean to add the formatted="false" attribute?
/home/vagrant/.gradle/caches/transforms-3/b6e93056a66f1b878f2d05dae35cf5de/transformed/jetified-library-3.12.1/res/values-it-rIT/values-it-rIT.xml:113:4: Multiple substitutions specified in non-positional format of string resource string/apply_launcher_incompatible. Did you mean to add the formatted="false" attribute?

> Task :app:generateLightReleaseBuildConfig
> Task :app:javaPreCompileLightRelease
> Task :app:checkLightReleaseAarMetadata
> Task :app:createLightReleaseCompatibleScreenManifests
> Task :app:extractDeepLinksLightRelease

> Task :app:processLightReleaseMainManifest
/home/vagrant/build/com.donnnno.arcticons.light/app/src/main/AndroidManifest.xml:17:5-269:19 Warning:
	application@android:icon was tagged at AndroidManifest.xml:17 to replace other declarations but no other declaration present

> Task :app:mergeLightReleaseResources
/home/vagrant/.gradle/caches/transforms-3/b6e93056a66f1b878f2d05dae35cf5de/transformed/jetified-library-3.12.1/res/values-in-rID/values-in-rID.xml:112:4: Multiple substitutions specified in non-positional format of string resource string/apply_launcher_incompatible. Did you mean to add the formatted="false" attribute?
/home/vagrant/.gradle/caches/transforms-3/b6e93056a66f1b878f2d05dae35cf5de/transformed/jetified-library-3.12.1/res/values-bg-rBG/values-bg-rBG.xml:92:4: Multiple substitutions specified in non-positional format of string resource string/apply_manual. Did you mean to add the formatted="false" attribute?
/home/vagrant/.gradle/caches/transforms-3/b6e93056a66f1b878f2d05dae35cf5de/transformed/jetified-library-3.12.1/res/values-pt-rBR/values-pt-rBR.xml:107:4: Multiple substitutions specified in non-positional format of string resource string/apply_launcher_incompatible. Did you mean to add the formatted="false" attribute?
/home/vagrant/.gradle/caches/transforms-3/b6e93056a66f1b878f2d05dae35cf5de/transformed/jetified-library-3.12.1/res/values-ne-rNP/values-ne-rNP.xml:105:4: Multiple substitutions specified in non-positional format of string resource string/apply_launcher_incompatible. Did you mean to add the formatted="false" attribute?

> Task :app:processLightReleaseManifest
> Task :app:processLightReleaseManifestForPackage
> Task :app:mergeLightReleaseJniLibFolders
> Task :app:mergeLightReleaseNativeLibs NO-SOURCE
> Task :app:stripLightReleaseDebugSymbols NO-SOURCE
> Task :app:extractLightReleaseNativeSymbolTables NO-SOURCE
> Task :app:mergeLightReleaseNativeDebugMetadata NO-SOURCE
> Task :app:mergeLightReleaseArtProfile
> Task :app:checkLightReleaseDuplicateClasses
> Task :app:extractProguardFiles
> Task :app:processLightReleaseJavaRes NO-SOURCE
> Task :app:mergeLightReleaseJavaResource
> Task :app:mergeLightReleaseShaders
> Task :app:compileLightReleaseShaders NO-SOURCE
> Task :app:generateLightReleaseAssets UP-TO-DATE
> Task :app:mergeLightReleaseAssets
> Task :app:compressLightReleaseAssets
> Task :app:collectLightReleaseDependencies
> Task :app:sdkLightReleaseDependencyData
> Task :app:writeLightReleaseAppMetadata
> Task :app:writeLightReleaseSigningConfigVersions
> Task :app:dataBindingGenBaseClassesLightRelease
> Task :app:processLightReleaseResources
> Task :app:compileLightReleaseJavaWithJavac
> Task :app:compileLightReleaseSources
> Task :app:mergeLightReleaseGeneratedProguardFiles

> Task :app:minifyLightReleaseWithR8
WARNING:Missing classes detected while running R8. Please add the missing classes or apply additional keep rules that are generated in /home/vagrant/build/com.donnnno.arcticons.light/app/build/outputs/mapping/lightRelease/missing_rules.txt.

WARNING:R8: Missing class org.conscrypt.Conscrypt$Version (referenced from: boolean okhttp3.internal.platform.ConscryptPlatform$Companion.atLeastVersion(int, int, int))
Missing class org.conscrypt.Conscrypt (referenced from: boolean okhttp3.internal.platform.ConscryptPlatform$Companion.atLeastVersion(int, int, int) and 3 other contexts)
Missing class org.conscrypt.ConscryptHostnameVerifier (referenced from: okhttp3.internal.platform.ConscryptPlatform$configureTrustManager$1)
Missing class org.openjsse.javax.net.ssl.SSLParameters (referenced from: void okhttp3.internal.platform.OpenJSSEPlatform.configureTlsExtensions(javax.net.ssl.SSLSocket, java.util.List))
Missing class org.openjsse.javax.net.ssl.SSLSocket (referenced from: void okhttp3.internal.platform.OpenJSSEPlatform.configureTlsExtensions(javax.net.ssl.SSLSocket, java.util.List) and 1 other context)
Missing class org.openjsse.net.ssl.OpenJSSE (referenced from: void okhttp3.internal.platform.OpenJSSEPlatform.<init>())

> Task :app:compileLightReleaseArtProfile
> Task :app:optimizeLightReleaseResources
> Task :app:packageLightRelease
> Task :app:assembleLightRelease

FAILURE: Build failed with an exception.

* What went wrong:
Configuration cache problems found in this build.

1 problem was found storing the configuration cache.
- Task `:app:collectLightReleaseDependencies` of type `com.android.build.gradle.internal.tasks.PerModuleReportDependenciesTask`: invocation of 'Task.project' at execution time is unsupported.
  See https://docs.gradle.org/7.2/userguide/configuration_cache.html#config_cache:requirements:use_project_during_execution

See the complete report at file:///home/vagrant/build/com.donnnno.arcticons.light/build/reports/configuration-cache/8vnv6kz8fhkcyddk0bw1u7vue/3hp1nktcjj2fk89vc18kv5jjq/configuration-cache-report.html
> Invocation of 'Task.project' by task ':app:collectLightReleaseDependencies' at execution time is unsupported.

* Try:
Run with --stacktrace option to get the stack trace. Run with --info or --debug option to get more log output. Run with --scan to get full insights.

* Get more help at https://help.gradle.org

BUILD FAILED in 1m 26s
32 actionable tasks: 32 executed
Configuration cache entry discarded with 1 problem.
==== detail end ====
2021-09-20 10:52:30,939 DEBUG: Error encoutered, stopping by user request.