log for com.maltaisn.notes.sync:10402

Traceback (most recent call last):
  File "/home/fbuild/fdroidserver/fdroidserver/build.py", line 1127, in main
    options.onserver, options.refresh):
  File "/home/fbuild/fdroidserver/fdroidserver/build.py", line 885, in trybuild
    build_server(app, build, vcs, build_dir, output_dir, log_dir, force)
  File "/home/fbuild/fdroidserver/fdroidserver/build.py", line 268, in build_server
    str(output, 'utf-8'))
fdroidserver.exception.BuildException: Timeout exceeded! Build VM force-stopped for com.maltaisn.notes.sync:1.4.2
==== detail begin ====
== Installed Android Tools ==

2022-01-13 04:13:59,738 DEBUG: Reading 'config.yml'
2022-01-13 04:13:59,747 INFO: Using /opt/android-sdk/build-tools/29.0.3/apksigner 
2022-01-13 04:13:59,751 INFO: Creating log directory
2022-01-13 04:13:59,751 INFO: Creating temporary directory
2022-01-13 04:13:59,751 INFO: Creating output directory
2022-01-13 04:13:59,754 DEBUG: Getting git vcs interface for https://github.com/maltaisn/another-notes-app/
2022-01-13 04:13:59,754 DEBUG: > git --version
git version 2.11.0
2022-01-13 04:13:59,970 INFO: Using git version 2.11.0
2022-01-13 04:13:59,971 DEBUG: Checking 1.4.2
2022-01-13 04:13:59,971 INFO: Building version 1.4.2 (10402) of com.maltaisn.notes.sync
2022-01-13 04:13:59,972 INFO: Running 'sudo' commands in /home/vagrant
2022-01-13 04:13:59,972 DEBUG: > sudo DEBIAN_FRONTEND=noninteractive bash -x -c apt-get update || apt-get update && apt-get install -y openjdk-11-jdk-headless && update-alternatives --auto java
+ apt-get update
Ign:1 http://deb.debian.org/debian stretch InRelease
Get:2 http://security.debian.org/debian-security stretch/updates InRelease [53.0 kB]
Hit:3 http://deb.debian.org/debian stretch-updates InRelease
Get:4 http://deb.debian.org/debian stretch-backports-sloppy InRelease [46.7 kB]
Get:5 http://deb.debian.org/debian stretch-backports InRelease [91.8 kB]
Get:6 http://deb.debian.org/debian testing InRelease [129 kB]
Hit:7 http://deb.debian.org/debian stretch Release
Get:8 http://security.debian.org/debian-security stretch/updates/main amd64 Packages [763 kB]
Get:9 http://security.debian.org/debian-security stretch/updates/main i386 Packages [764 kB]
Get:10 http://security.debian.org/debian-security stretch/updates/main Translation-en [357 kB]
Get:11 http://deb.debian.org/debian testing/main amd64 Packages.diff/Index [63.6 kB]
Get:13 http://deb.debian.org/debian testing/main i386 Packages.diff/Index [63.6 kB]
Get:14 http://deb.debian.org/debian testing/main Translation-en.diff/Index [63.6 kB]
Get:15 http://deb.debian.org/debian testing/main amd64 Packages T-2022-01-13-0210.55-F-2022-01-12-0804.47.pdiff [52.5 kB]
Get:15 http://deb.debian.org/debian testing/main amd64 Packages T-2022-01-13-0210.55-F-2022-01-12-0804.47.pdiff [52.5 kB]
Get:16 http://deb.debian.org/debian testing/main i386 Packages T-2022-01-13-0210.55-F-2022-01-12-0804.47.pdiff [52.5 kB]
Get:16 http://deb.debian.org/debian testing/main i386 Packages T-2022-01-13-0210.55-F-2022-01-12-0804.47.pdiff [52.5 kB]
Get:17 http://deb.debian.org/debian testing/main Translation-en T-2022-01-13-0210.55-F-2022-01-12-0804.47.pdiff [5,326 B]
Get:17 http://deb.debian.org/debian testing/main Translation-en T-2022-01-13-0210.55-F-2022-01-12-0804.47.pdiff [5,326 B]
Fetched 2,505 kB in 4s (579 kB/s)
Reading package lists...
+ apt-get install -y openjdk-11-jdk-headless
Reading package lists...
Building dependency tree...
Reading state information...
The following additional packages will be installed:
  libasound2 libasound2-data openjdk-11-jre-headless
Suggested packages:
  libasound2-plugins alsa-utils openjdk-11-demo openjdk-11-source libnss-mdns
  fonts-dejavu-extra fonts-ipafont-gothic fonts-ipafont-mincho
  fonts-wqy-microhei | fonts-wqy-zenhei fonts-indic
The following NEW packages will be installed:
  libasound2 libasound2-data openjdk-11-jdk-headless openjdk-11-jre-headless
0 upgraded, 4 newly installed, 0 to remove and 2 not upgraded.
Need to get 230 MB of archives.
After this operation, 374 MB of additional disk space will be used.
Get:1 http://deb.debian.org/debian stretch/main amd64 libasound2-data all 1.1.3-5 [173 kB]
Get:2 http://deb.debian.org/debian stretch/main amd64 libasound2 amd64 1.1.3-5 [497 kB]
Get:3 http://deb.debian.org/debian stretch-backports/main amd64 openjdk-11-jre-headless amd64 11.0.6+10-1~bpo9+1 [37.4 MB]
Get:4 http://deb.debian.org/debian stretch-backports/main amd64 openjdk-11-jdk-headless amd64 11.0.6+10-1~bpo9+1 [192 MB]
Fetched 230 MB in 3s (65.2 MB/s)
Selecting previously unselected package libasound2-data.
(Reading database ... 64893 files and directories currently installed.)
Preparing to unpack .../libasound2-data_1.1.3-5_all.deb ...
Unpacking libasound2-data (1.1.3-5) ...
Selecting previously unselected package libasound2:amd64.
Preparing to unpack .../libasound2_1.1.3-5_amd64.deb ...
Unpacking libasound2:amd64 (1.1.3-5) ...
Selecting previously unselected package openjdk-11-jre-headless:amd64.
Preparing to unpack .../openjdk-11-jre-headless_11.0.6+10-1~bpo9+1_amd64.deb ...
Unpacking openjdk-11-jre-headless:amd64 (11.0.6+10-1~bpo9+1) ...
Selecting previously unselected package openjdk-11-jdk-headless:amd64.
Preparing to unpack .../openjdk-11-jdk-headless_11.0.6+10-1~bpo9+1_amd64.deb ...
Unpacking openjdk-11-jdk-headless:amd64 (11.0.6+10-1~bpo9+1) ...
Setting up libasound2-data (1.1.3-5) ...
Setting up libasound2:amd64 (1.1.3-5) ...
Processing triggers for libc-bin (2.24-11+deb9u4) ...
Setting up openjdk-11-jre-headless:amd64 (11.0.6+10-1~bpo9+1) ...
Setting up openjdk-11-jdk-headless:amd64 (11.0.6+10-1~bpo9+1) ...
update-alternatives: using /usr/lib/jvm/java-11-openjdk-amd64/bin/jdeprscan to provide /usr/bin/jdeprscan (jdeprscan) in auto mode
update-alternatives: using /usr/lib/jvm/java-11-openjdk-amd64/bin/jimage to provide /usr/bin/jimage (jimage) in auto mode
update-alternatives: using /usr/lib/jvm/java-11-openjdk-amd64/bin/jlink to provide /usr/bin/jlink (jlink) in auto mode
update-alternatives: using /usr/lib/jvm/java-11-openjdk-amd64/bin/jmod to provide /usr/bin/jmod (jmod) in auto mode
update-alternatives: using /usr/lib/jvm/java-11-openjdk-amd64/bin/jshell to provide /usr/bin/jshell (jshell) in auto mode
update-alternatives: using /usr/lib/jvm/java-11-openjdk-amd64/bin/jaotc to provide /usr/bin/jaotc (jaotc) in auto mode
update-alternatives: using /usr/lib/jvm/java-11-openjdk-amd64/bin/jhsdb to provide /usr/bin/jhsdb (jhsdb) in auto mode
+ update-alternatives --auto java
update-alternatives: using /usr/lib/jvm/java-11-openjdk-amd64/bin/java to provide /usr/bin/java (java) in auto mode
2022-01-13 04:14:24,006 DEBUG: > sudo passwd --lock root
passwd: password expiry information changed.
2022-01-13 04:14:24,236 DEBUG: > sudo SUDO_FORCE_REMOVE=yes dpkg --purge sudo
(Reading database ... 65550 files and directories currently installed.)
Removing sudo (1.8.19p1-2.1+deb9u3) ...
Purging configuration files for sudo (1.8.19p1-2.1+deb9u3) ...
Processing triggers for systemd (232-25+deb9u13) ...
2022-01-13 04:14:29,787 INFO: Getting source for revision 1a343ef826d212de2d29bd52fe33f6007cb55360
2022-01-13 04:14:29,787 DEBUG: Directory: build/com.maltaisn.notes.sync
2022-01-13 04:14:29,788 DEBUG: > git rev-parse --show-toplevel
2022-01-13 04:14:30,085 DEBUG: Directory: build/com.maltaisn.notes.sync
2022-01-13 04:14:30,086 DEBUG: > git submodule foreach --recursive git reset --hard
2022-01-13 04:14:30,197 DEBUG: Directory: build/com.maltaisn.notes.sync
2022-01-13 04:14:30,197 DEBUG: > git reset --hard
2022-01-13 04:14:30,406 DEBUG: Directory: build/com.maltaisn.notes.sync
2022-01-13 04:14:30,407 DEBUG: > git submodule foreach --recursive git clean -dffx
2022-01-13 04:14:30,513 DEBUG: Directory: build/com.maltaisn.notes.sync
2022-01-13 04:14:30,513 DEBUG: > git clean -dffx
2022-01-13 04:14:30,625 DEBUG: Directory: build/com.maltaisn.notes.sync
2022-01-13 04:14:30,626 DEBUG: > git -c core.askpass=/bin/true -c core.sshCommand=/bin/false -c url.https://.insteadOf=ssh:// -c url.https://u:p@bitbucket.org/.insteadOf=git@bitbucket.org: -c url.https://u:p@bitbucket.org.insteadOf=git://bitbucket.org -c url.https://u:p@bitbucket.org.insteadOf=https://bitbucket.org -c url.https://u:p@github.com/.insteadOf=git@github.com: -c url.https://u:p@github.com.insteadOf=git://github.com -c url.https://u:p@github.com.insteadOf=https://github.com -c url.https://u:p@gitlab.com/.insteadOf=git@gitlab.com: -c url.https://u:p@gitlab.com.insteadOf=git://gitlab.com -c url.https://u:p@gitlab.com.insteadOf=https://gitlab.com fetch origin
2022-01-13 04:14:31,343 DEBUG: Directory: build/com.maltaisn.notes.sync
2022-01-13 04:14:31,343 DEBUG: > git -c core.askpass=/bin/true -c core.sshCommand=/bin/false -c url.https://.insteadOf=ssh:// -c url.https://u:p@bitbucket.org/.insteadOf=git@bitbucket.org: -c url.https://u:p@bitbucket.org.insteadOf=git://bitbucket.org -c url.https://u:p@bitbucket.org.insteadOf=https://bitbucket.org -c url.https://u:p@github.com/.insteadOf=git@github.com: -c url.https://u:p@github.com.insteadOf=git://github.com -c url.https://u:p@github.com.insteadOf=https://github.com -c url.https://u:p@gitlab.com/.insteadOf=git@gitlab.com: -c url.https://u:p@gitlab.com.insteadOf=git://gitlab.com -c url.https://u:p@gitlab.com.insteadOf=https://gitlab.com remote prune origin
2022-01-13 04:14:31,657 DEBUG: Directory: build/com.maltaisn.notes.sync
2022-01-13 04:14:31,657 DEBUG: > git -c core.askpass=/bin/true -c core.sshCommand=/bin/false -c url.https://.insteadOf=ssh:// -c url.https://u:p@bitbucket.org/.insteadOf=git@bitbucket.org: -c url.https://u:p@bitbucket.org.insteadOf=git://bitbucket.org -c url.https://u:p@bitbucket.org.insteadOf=https://bitbucket.org -c url.https://u:p@github.com/.insteadOf=git@github.com: -c url.https://u:p@github.com.insteadOf=git://github.com -c url.https://u:p@github.com.insteadOf=https://github.com -c url.https://u:p@gitlab.com/.insteadOf=git@gitlab.com: -c url.https://u:p@gitlab.com.insteadOf=git://gitlab.com -c url.https://u:p@gitlab.com.insteadOf=https://gitlab.com fetch --prune --tags --force origin
2022-01-13 04:14:31,968 DEBUG: Directory: build/com.maltaisn.notes.sync
2022-01-13 04:14:31,969 DEBUG: > git remote set-head origin --auto
2022-01-13 04:14:32,297 DEBUG: Directory: build/com.maltaisn.notes.sync
2022-01-13 04:14:32,298 DEBUG: > git checkout -f 1a343ef826d212de2d29bd52fe33f6007cb55360
2022-01-13 04:14:32,510 DEBUG: Directory: build/com.maltaisn.notes.sync
2022-01-13 04:14:32,510 DEBUG: > git clean -dffx
2022-01-13 04:14:32,617 INFO: Creating local.properties file at build/com.maltaisn.notes.sync/local.properties
2022-01-13 04:14:32,618 INFO: Creating local.properties file at build/com.maltaisn.notes.sync/app/local.properties
2022-01-13 04:14:32,619 DEBUG: Removing debuggable flags from build/com.maltaisn.notes.sync/app
2022-01-13 04:14:32,631 INFO: Cleaned build.gradle of keysigning configs at build/com.maltaisn.notes.sync/app/build.gradle
2022-01-13 04:14:32,635 INFO: Cleaning Gradle project...
2022-01-13 04:14:32,635 DEBUG: Directory: build/com.maltaisn.notes.sync/app
2022-01-13 04:14:32,635 DEBUG: > /home/vagrant/fdroidserver/gradlew-fdroid clean
Found 7.2 via distributionUrl
Downloading missing gradle version 7.2
cachedir /home/vagrant/.cache/fdroidserver
/home/vagrant/.cache/fdroidserver/gradle-7.2-bin.zip: OK
Running /opt/gradle/versions/7.2/bin/gradle clean

Welcome to Gradle 7.2!

Here are the highlights of this release:
 - Toolchain support for Scala
 - More cache hits when Java source files have platform-specific line endings
 - More resilient remote HTTP build cache behavior

For more details see https://docs.gradle.org/7.2/release-notes.html

To honour the JVM settings for this build a single-use Daemon process will be forked. See https://docs.gradle.org/7.2/userguide/gradle_daemon.html#sec:disabling_the_daemon.
Daemon will be stopped at the end of the build 

> Configure project :app
WARNING:API 'BaseVariant.getApplicationIdTextResource' is obsolete and has been replaced with 'VariantProperties.applicationId'.
It will be removed in version 7.0 of the Android Gradle plugin.
For more information, see TBD.
To determine what is calling BaseVariant.getApplicationIdTextResource, use -Pandroid.debug.obsoleteApi=true on the command line to display more information.
Checking the license for package Android SDK Build-Tools 30.0.3 in /opt/android-sdk/licenses
License for package Android SDK Build-Tools 30.0.3 accepted.
Preparing "Install Android SDK Build-Tools 30.0.3 (revision: 30.0.3)".
"Install Android SDK Build-Tools 30.0.3 (revision: 30.0.3)" ready.
Installing Android SDK Build-Tools 30.0.3 in /opt/android-sdk/build-tools/30.0.3
"Install Android SDK Build-Tools 30.0.3 (revision: 30.0.3)" complete.
"Install Android SDK Build-Tools 30.0.3 (revision: 30.0.3)" finished.
Checking the license for package Android SDK Platform 31 in /opt/android-sdk/licenses
License for package Android SDK Platform 31 accepted.
Preparing "Install Android SDK Platform 31 (revision: 1)".
"Install Android SDK Platform 31 (revision: 1)" ready.
Installing Android SDK Platform 31 in /opt/android-sdk/platforms/android-31
"Install Android SDK Platform 31 (revision: 1)" complete.
"Install Android SDK Platform 31 (revision: 1)" finished.

> Task :app:clean UP-TO-DATE

BUILD SUCCESSFUL in 44s
1 actionable task: 1 up-to-date
2022-01-13 04:15:22,598 INFO: Scanning source for common problems...
2022-01-13 04:15:22,603 INFO: Removing gradle-wrapper.jar at gradle/wrapper/gradle-wrapper.jar
2022-01-13 04:15:22,625 INFO: Creating source tarball...
2022-01-13 04:15:22,879 INFO: Building Gradle project...
2022-01-13 04:15:22,879 DEBUG: Directory: build/com.maltaisn.notes.sync/app
2022-01-13 04:15:22,879 DEBUG: > /home/vagrant/fdroidserver/gradlew-fdroid assembleRelease
Found 7.2 via distributionUrl
Running /opt/gradle/versions/7.2/bin/gradle assembleRelease
To honour the JVM settings for this build a single-use Daemon process will be forked. See https://docs.gradle.org/7.2/userguide/gradle_daemon.html#sec:disabling_the_daemon.
Daemon will be stopped at the end of the build 

> Configure project :app
WARNING:API 'BaseVariant.getApplicationIdTextResource' is obsolete and has been replaced with 'VariantProperties.applicationId'.
It will be removed in version 7.0 of the Android Gradle plugin.
For more information, see TBD.
To determine what is calling BaseVariant.getApplicationIdTextResource, use -Pandroid.debug.obsoleteApi=true on the command line to display more information.

> Task :app:preBuild UP-TO-DATE

> Task :app:prepareLibraryDefinitionsRelease
All dependencies.size=86
Could not get the name for androidx_databinding__viewbinding, Using androidx.databinding:viewbinding
Could not get the name for com_github_YarikSOffice_Venom__venom_no_op, Using com.github.YarikSOffice.Venom:venom-no-op
--> Had to resolve name from custom mapping for: androidx_savedstate__savedstate as SavedState
--> Retrieved POM for: com_google_dagger__dagger from org.sonatype.oss:oss-parent:7

> Task :app:preReleaseBuild
> Task :app:compileReleaseAidl NO-SOURCE
> Task :app:compileReleaseRenderscript NO-SOURCE
> Task :app:dataBindingMergeDependencyArtifactsRelease
> Task :app:dataBindingMergeGenClassesRelease
> Task :app:generateReleaseResValues
> Task :app:generateReleaseResources
> Task :app:generateReleaseBuildConfig
> Task :app:writeReleaseApplicationId
> Task :app:generateSafeArgsRelease
> Task :app:checkReleaseAarMetadata
> Task :app:createReleaseCompatibleScreenManifests
> Task :app:extractDeepLinksRelease
> Task :app:mergeReleaseResources
> Task :app:processReleaseMainManifest
> Task :app:dataBindingGenBaseClassesRelease
> Task :app:processReleaseManifest
> Task :app:buildKotlinToolingMetadata
> Task :app:javaPreCompileRelease
> Task :app:extractProguardFiles
> Task :app:mergeReleaseJniLibFolders
> Task :app:mergeReleaseNativeLibs NO-SOURCE
> Task :app:stripReleaseDebugSymbols NO-SOURCE
> Task :app:extractReleaseNativeSymbolTables NO-SOURCE
> Task :app:mergeReleaseNativeDebugMetadata NO-SOURCE
> Task :app:processReleaseJavaRes NO-SOURCE
> Task :app:mergeReleaseShaders
> Task :app:mergeReleaseArtProfile
> Task :app:compileReleaseShaders NO-SOURCE
> Task :app:generateReleaseAssets UP-TO-DATE
> Task :app:checkReleaseDuplicateClasses
> Task :app:mergeReleaseAssets
> Task :app:compressReleaseAssets
> Task :app:collectReleaseDependencies
> Task :app:sdkReleaseDependencyData
> Task :app:writeReleaseAppMetadata
> Task :app:writeReleaseSigningConfigVersions
> Task :app:processReleaseManifestForPackage
> Task :app:processReleaseResources
> Task :app:kaptGenerateStubsReleaseKotlin
> Task :app:kaptReleaseKotlin

> Task :app:compileReleaseKotlin
w: /home/vagrant/build/com.maltaisn.notes.sync/app/src/release/kotlin/com/maltaisn/notes/DebugExtensions.kt: (22, 16): Parameter 'value' is never used
w: /home/vagrant/build/com.maltaisn.notes.sync/app/src/release/kotlin/com/maltaisn/notes/DebugExtensions.kt: (22, 32): Parameter 'message' is never used
w: /home/vagrant/build/com.maltaisn.notes.sync/app/src/release/kotlin/com/maltaisn/notes/DebugExtensions.kt: (24, 18): Parameter 'value' is never used
w: /home/vagrant/build/com.maltaisn.notes.sync/app/src/release/kotlin/com/maltaisn/notes/DebugExtensions.kt: (24, 34): Parameter 'message' is never used

> Task :app:compileReleaseJavaWithJavac
> Task :app:compileReleaseSources
> Task :app:mergeReleaseGeneratedProguardFiles
> Task :app:bundleReleaseClasses
> Task :app:mergeReleaseJavaResource
> Task :app:lintVitalAnalyzeRelease
> Task :app:minifyReleaseWithR8
> Task :app:compileReleaseArtProfile
> Task :app:shrinkReleaseRes
> Task :app:optimizeReleaseResources
> Task :app:packageRelease
> Task :app:lintVitalAnalyzeRelease FAILED

FAILURE: Build failed with an exception.

* What went wrong:
Execution failed for task ':app:lintVitalAnalyzeRelease'.
> A failure occurred while executing com.android.build.gradle.internal.lint.AndroidLintWorkAction
   > java.lang.reflect.InvocationTargetException (no error message)

* Try:
Run with --stacktrace option to get the stack trace. Run with --info or --debug option to get more log output. Run with --scan to get full insights.

* Get more help at https://help.gradle.org

BUILD FAILED in 2m 51s
42 actionable tasks: 42 executed

FAILURE: Build failed with an exception.

* What went wrong:
Metaspace

* Try:
Run with --stacktrace option to get the stack trace. Run with --info or --debug option to get more log output. Run with --scan to get full insights.

* Get more help at https://help.gradle.org

BUILD FAILED in 2m 55s
==== detail end ====