log for com.mirfatif.permissionmanagerx:107

== Installed Android Tools ==

2021-07-20 15:49:52,292 DEBUG: Reading 'config.yml'
2021-07-20 15:49:52,301 INFO: Using /opt/android-sdk/build-tools/29.0.3/apksigner 
2021-07-20 15:49:52,303 INFO: Creating log directory
2021-07-20 15:49:52,304 INFO: Creating temporary directory
2021-07-20 15:49:52,304 INFO: Creating output directory
2021-07-20 15:49:52,307 DEBUG: Getting git vcs interface for https://github.com/mirfatif/PermissionManagerX
2021-07-20 15:49:52,307 DEBUG: > git --version
git version 2.11.0
2021-07-20 15:49:52,530 INFO: Using git version 2.11.0
2021-07-20 15:49:52,530 DEBUG: Checking v1.07
2021-07-20 15:49:52,530 INFO: Building version v1.07 (107) of com.mirfatif.permissionmanagerx
2021-07-20 15:49:52,531 INFO: Running 'sudo' commands in /home/vagrant
2021-07-20 15:49:52,531 DEBUG: > sudo DEBIAN_FRONTEND=noninteractive bash -x -c apt-get update || apt-get update && apt-get install -y openjdk-11-jdk && update-alternatives --auto java
+ apt-get update
Ign:1 http://deb.debian.org/debian stretch InRelease
Get:2 http://security.debian.org/debian-security stretch/updates InRelease [53.0 kB]
Get:3 http://deb.debian.org/debian stretch-updates InRelease [93.6 kB]
Get:4 http://deb.debian.org/debian stretch-backports-sloppy InRelease [46.7 kB]
Get:5 http://deb.debian.org/debian stretch-backports InRelease [91.8 kB]
Get:6 http://deb.debian.org/debian testing InRelease [150 kB]
Hit:7 http://deb.debian.org/debian stretch Release
Get:8 http://security.debian.org/debian-security stretch/updates/main i386 Packages [702 kB]
Get:9 http://security.debian.org/debian-security stretch/updates/main amd64 Packages [701 kB]
Get:10 http://security.debian.org/debian-security stretch/updates/main Translation-en [322 kB]
Get:11 http://deb.debian.org/debian testing/main i386 Packages.diff/Index [63.6 kB]
Get:13 http://deb.debian.org/debian testing/main amd64 Packages.diff/Index [63.6 kB]
Get:14 http://deb.debian.org/debian testing/main i386 Packages T-2021-07-20-1409.46-F-2021-07-20-1409.46.pdiff [449 B]
Get:14 http://deb.debian.org/debian testing/main i386 Packages T-2021-07-20-1409.46-F-2021-07-20-1409.46.pdiff [449 B]
Get:15 http://deb.debian.org/debian testing/main amd64 Packages T-2021-07-20-1409.46-F-2021-07-20-1409.46.pdiff [450 B]
Get:15 http://deb.debian.org/debian testing/main amd64 Packages T-2021-07-20-1409.46-F-2021-07-20-1409.46.pdiff [450 B]
Fetched 2,287 kB in 2s (831 kB/s)
Reading package lists...
+ apt-get install -y openjdk-11-jdk
Reading package lists...
Building dependency tree...
Reading state information...
The following additional packages will be installed:
  libasound2 libasound2-data libgif7 libgl1-mesa-glx libglapi-mesa libxcb-glx0
  libxxf86vm1 openjdk-11-jdk-headless openjdk-11-jre openjdk-11-jre-headless
Suggested packages:
  libasound2-plugins alsa-utils openjdk-11-demo openjdk-11-source visualvm
  libnss-mdns fonts-dejavu-extra fonts-ipafont-gothic fonts-ipafont-mincho
  fonts-wqy-microhei | fonts-wqy-zenhei fonts-indic
Recommended packages:
  libgl1-mesa-dri libxt-dev libatk-wrapper-java-jni fonts-dejavu-extra
The following NEW packages will be installed:
  libasound2 libasound2-data libgif7 libgl1-mesa-glx libglapi-mesa libxcb-glx0
  libxxf86vm1 openjdk-11-jdk openjdk-11-jdk-headless openjdk-11-jre
  openjdk-11-jre-headless
0 upgraded, 11 newly installed, 0 to remove and 3 not upgraded.
Need to get 230 MB of archives.
After this operation, 375 MB of additional disk space will be used.
Get:1 http://deb.debian.org/debian stretch/main amd64 libasound2-data all 1.1.3-5 [173 kB]
Get:2 http://deb.debian.org/debian stretch/main amd64 libasound2 amd64 1.1.3-5 [497 kB]
Get:3 http://deb.debian.org/debian stretch/main amd64 libgif7 amd64 5.1.4-0.4 [43.1 kB]
Get:4 http://deb.debian.org/debian stretch/main amd64 libglapi-mesa amd64 13.0.6-1+b2 [58.9 kB]
Get:5 http://deb.debian.org/debian stretch/main amd64 libxcb-glx0 amd64 1.12-1 [113 kB]
Get:6 http://deb.debian.org/debian stretch/main amd64 libxxf86vm1 amd64 1:1.1.4-1+b2 [20.8 kB]
Get:7 http://deb.debian.org/debian stretch/main amd64 libgl1-mesa-glx amd64 13.0.6-1+b2 [167 kB]
Get:8 http://deb.debian.org/debian stretch-backports/main amd64 openjdk-11-jre-headless amd64 11.0.6+10-1~bpo9+1 [37.4 MB]
Get:9 http://deb.debian.org/debian stretch-backports/main amd64 openjdk-11-jre amd64 11.0.6+10-1~bpo9+1 [34.4 kB]
Get:10 http://deb.debian.org/debian stretch-backports/main amd64 openjdk-11-jdk-headless amd64 11.0.6+10-1~bpo9+1 [192 MB]
Get:11 http://deb.debian.org/debian stretch-backports/main amd64 openjdk-11-jdk amd64 11.0.6+10-1~bpo9+1 [13.5 kB]
Fetched 230 MB in 2s (90.4 MB/s)
Selecting previously unselected package libasound2-data.
(Reading database ... 64892 files and directories currently installed.)
Preparing to unpack .../00-libasound2-data_1.1.3-5_all.deb ...
Unpacking libasound2-data (1.1.3-5) ...
Selecting previously unselected package libasound2:amd64.
Preparing to unpack .../01-libasound2_1.1.3-5_amd64.deb ...
Unpacking libasound2:amd64 (1.1.3-5) ...
Selecting previously unselected package libgif7:amd64.
Preparing to unpack .../02-libgif7_5.1.4-0.4_amd64.deb ...
Unpacking libgif7:amd64 (5.1.4-0.4) ...
Selecting previously unselected package libglapi-mesa:amd64.
Preparing to unpack .../03-libglapi-mesa_13.0.6-1+b2_amd64.deb ...
Unpacking libglapi-mesa:amd64 (13.0.6-1+b2) ...
Selecting previously unselected package libxcb-glx0:amd64.
Preparing to unpack .../04-libxcb-glx0_1.12-1_amd64.deb ...
Unpacking libxcb-glx0:amd64 (1.12-1) ...
Selecting previously unselected package libxxf86vm1:amd64.
Preparing to unpack .../05-libxxf86vm1_1%3a1.1.4-1+b2_amd64.deb ...
Unpacking libxxf86vm1:amd64 (1:1.1.4-1+b2) ...
Selecting previously unselected package libgl1-mesa-glx:amd64.
Preparing to unpack .../06-libgl1-mesa-glx_13.0.6-1+b2_amd64.deb ...
Unpacking libgl1-mesa-glx:amd64 (13.0.6-1+b2) ...
Selecting previously unselected package openjdk-11-jre-headless:amd64.
Preparing to unpack .../07-openjdk-11-jre-headless_11.0.6+10-1~bpo9+1_amd64.deb ...
Unpacking openjdk-11-jre-headless:amd64 (11.0.6+10-1~bpo9+1) ...
Selecting previously unselected package openjdk-11-jre:amd64.
Preparing to unpack .../08-openjdk-11-jre_11.0.6+10-1~bpo9+1_amd64.deb ...
Unpacking openjdk-11-jre:amd64 (11.0.6+10-1~bpo9+1) ...
Selecting previously unselected package openjdk-11-jdk-headless:amd64.
Preparing to unpack .../09-openjdk-11-jdk-headless_11.0.6+10-1~bpo9+1_amd64.deb ...
Unpacking openjdk-11-jdk-headless:amd64 (11.0.6+10-1~bpo9+1) ...
Selecting previously unselected package openjdk-11-jdk:amd64.
Preparing to unpack .../10-openjdk-11-jdk_11.0.6+10-1~bpo9+1_amd64.deb ...
Unpacking openjdk-11-jdk:amd64 (11.0.6+10-1~bpo9+1) ...
Setting up libxcb-glx0:amd64 (1.12-1) ...
Processing triggers for mime-support (3.60) ...
Setting up libasound2-data (1.1.3-5) ...
Setting up libgif7:amd64 (5.1.4-0.4) ...
Setting up libglapi-mesa:amd64 (13.0.6-1+b2) ...
Setting up libasound2:amd64 (1.1.3-5) ...
Processing triggers for libc-bin (2.24-11+deb9u4) ...
Setting up libxxf86vm1:amd64 (1:1.1.4-1+b2) ...
Processing triggers for hicolor-icon-theme (0.15-1) ...
Setting up openjdk-11-jre-headless:amd64 (11.0.6+10-1~bpo9+1) ...
Setting up openjdk-11-jdk-headless:amd64 (11.0.6+10-1~bpo9+1) ...
update-alternatives: using /usr/lib/jvm/java-11-openjdk-amd64/bin/jdeprscan to provide /usr/bin/jdeprscan (jdeprscan) in auto mode
update-alternatives: using /usr/lib/jvm/java-11-openjdk-amd64/bin/jimage to provide /usr/bin/jimage (jimage) in auto mode
update-alternatives: using /usr/lib/jvm/java-11-openjdk-amd64/bin/jlink to provide /usr/bin/jlink (jlink) in auto mode
update-alternatives: using /usr/lib/jvm/java-11-openjdk-amd64/bin/jmod to provide /usr/bin/jmod (jmod) in auto mode
update-alternatives: using /usr/lib/jvm/java-11-openjdk-amd64/bin/jshell to provide /usr/bin/jshell (jshell) in auto mode
update-alternatives: using /usr/lib/jvm/java-11-openjdk-amd64/bin/jaotc to provide /usr/bin/jaotc (jaotc) in auto mode
update-alternatives: using /usr/lib/jvm/java-11-openjdk-amd64/bin/jhsdb to provide /usr/bin/jhsdb (jhsdb) in auto mode
Setting up libgl1-mesa-glx:amd64 (13.0.6-1+b2) ...
Setting up openjdk-11-jre:amd64 (11.0.6+10-1~bpo9+1) ...
Setting up openjdk-11-jdk:amd64 (11.0.6+10-1~bpo9+1) ...
update-alternatives: using /usr/lib/jvm/java-11-openjdk-amd64/bin/jconsole to provide /usr/bin/jconsole (jconsole) in auto mode
Processing triggers for libc-bin (2.24-11+deb9u4) ...
+ update-alternatives --auto java
update-alternatives: using /usr/lib/jvm/java-11-openjdk-amd64/bin/java to provide /usr/bin/java (java) in auto mode
2021-07-20 15:50:14,913 DEBUG: > sudo passwd --lock root
passwd: password expiry information changed.
2021-07-20 15:50:15,423 DEBUG: > sudo SUDO_FORCE_REMOVE=yes dpkg --purge sudo
(Reading database ... 65615 files and directories currently installed.)
Removing sudo (1.8.19p1-2.1+deb9u3) ...
Purging configuration files for sudo (1.8.19p1-2.1+deb9u3) ...
Processing triggers for systemd (232-25+deb9u12) ...
2021-07-20 15:50:20,530 INFO: Getting source for revision 6e15c8fdfae635ee1cec56d3bd76c23a5c2a2d40
2021-07-20 15:50:20,530 DEBUG: Directory: build/com.mirfatif.permissionmanagerx
2021-07-20 15:50:20,530 DEBUG: > git rev-parse --show-toplevel
2021-07-20 15:50:20,734 DEBUG: Directory: build/com.mirfatif.permissionmanagerx
2021-07-20 15:50:20,734 DEBUG: > git submodule foreach --recursive git reset --hard
2021-07-20 15:50:20,838 DEBUG: Directory: build/com.mirfatif.permissionmanagerx
2021-07-20 15:50:20,838 DEBUG: > git reset --hard
2021-07-20 15:50:21,044 DEBUG: Directory: build/com.mirfatif.permissionmanagerx
2021-07-20 15:50:21,044 DEBUG: > git submodule foreach --recursive git clean -dffx
2021-07-20 15:50:21,148 DEBUG: Directory: build/com.mirfatif.permissionmanagerx
2021-07-20 15:50:21,149 DEBUG: > git clean -dffx
2021-07-20 15:50:21,331 DEBUG: Directory: build/com.mirfatif.permissionmanagerx
2021-07-20 15:50:21,331 DEBUG: > git -c core.askpass=/bin/true -c core.sshCommand=/bin/false -c url.https://.insteadOf=ssh:// -c url.https://u:p@bitbucket.org/.insteadOf=git@bitbucket.org: -c url.https://u:p@bitbucket.org.insteadOf=git://bitbucket.org -c url.https://u:p@bitbucket.org.insteadOf=https://bitbucket.org -c url.https://u:p@github.com/.insteadOf=git@github.com: -c url.https://u:p@github.com.insteadOf=git://github.com -c url.https://u:p@github.com.insteadOf=https://github.com -c url.https://u:p@gitlab.com/.insteadOf=git@gitlab.com: -c url.https://u:p@gitlab.com.insteadOf=git://gitlab.com -c url.https://u:p@gitlab.com.insteadOf=https://gitlab.com fetch origin
2021-07-20 15:50:22,331 DEBUG: Directory: build/com.mirfatif.permissionmanagerx
2021-07-20 15:50:22,331 DEBUG: > git -c core.askpass=/bin/true -c core.sshCommand=/bin/false -c url.https://.insteadOf=ssh:// -c url.https://u:p@bitbucket.org/.insteadOf=git@bitbucket.org: -c url.https://u:p@bitbucket.org.insteadOf=git://bitbucket.org -c url.https://u:p@bitbucket.org.insteadOf=https://bitbucket.org -c url.https://u:p@github.com/.insteadOf=git@github.com: -c url.https://u:p@github.com.insteadOf=git://github.com -c url.https://u:p@github.com.insteadOf=https://github.com -c url.https://u:p@gitlab.com/.insteadOf=git@gitlab.com: -c url.https://u:p@gitlab.com.insteadOf=git://gitlab.com -c url.https://u:p@gitlab.com.insteadOf=https://gitlab.com fetch --prune --tags --force origin
2021-07-20 15:50:22,648 DEBUG: Directory: build/com.mirfatif.permissionmanagerx
2021-07-20 15:50:22,649 DEBUG: > git remote set-head origin --auto
2021-07-20 15:50:23,093 DEBUG: Directory: build/com.mirfatif.permissionmanagerx
2021-07-20 15:50:23,094 DEBUG: > git checkout -f 6e15c8fdfae635ee1cec56d3bd76c23a5c2a2d40
2021-07-20 15:50:23,299 DEBUG: Directory: build/com.mirfatif.permissionmanagerx
2021-07-20 15:50:23,299 DEBUG: > git clean -dffx
2021-07-20 15:50:23,404 INFO: Initialising submodules
2021-07-20 15:50:23,404 DEBUG: Directory: build/com.mirfatif.permissionmanagerx
2021-07-20 15:50:23,404 DEBUG: > git rev-parse --show-toplevel
2021-07-20 15:50:23,611 DEBUG: Directory: build/com.mirfatif.permissionmanagerx
2021-07-20 15:50:23,611 DEBUG: > git submodule sync
2021-07-20 15:50:23,720 DEBUG: Directory: build/com.mirfatif.permissionmanagerx
2021-07-20 15:50:23,720 DEBUG: > git -c core.askpass=/bin/true -c core.sshCommand=/bin/false -c url.https://.insteadOf=ssh:// -c url.https://u:p@bitbucket.org/.insteadOf=git@bitbucket.org: -c url.https://u:p@bitbucket.org.insteadOf=git://bitbucket.org -c url.https://u:p@bitbucket.org.insteadOf=https://bitbucket.org -c url.https://u:p@github.com/.insteadOf=git@github.com: -c url.https://u:p@github.com.insteadOf=git://github.com -c url.https://u:p@github.com.insteadOf=https://github.com -c url.https://u:p@gitlab.com/.insteadOf=git@gitlab.com: -c url.https://u:p@gitlab.com.insteadOf=git://gitlab.com -c url.https://u:p@gitlab.com.insteadOf=https://gitlab.com submodule update --init --force --recursive
Submodule 'AdbLib' (https://github.com/mirfatif/AdbLib) registered for path 'AdbLib'
Submodule 'native/libcap' (https://android.googlesource.com/platform/external/libcap) registered for path 'native/libcap'
Cloning into '/home/vagrant/build/com.mirfatif.permissionmanagerx/AdbLib'...
Cloning into '/home/vagrant/build/com.mirfatif.permissionmanagerx/native/libcap'...
Submodule path 'AdbLib': checked out '46b5ac931c4ac07b87d97ceef2daa56cad93670e'
Submodule path 'native/libcap': checked out 'fea65344f49c95ef282ec5b7ff17f2449e6af53f'
2021-07-20 15:50:24,839 INFO: Creating local.properties file at build/com.mirfatif.permissionmanagerx/local.properties
2021-07-20 15:50:24,839 INFO: Creating local.properties file at build/com.mirfatif.permissionmanagerx/app/local.properties
2021-07-20 15:50:24,839 DEBUG: Removing debuggable flags from build/com.mirfatif.permissionmanagerx/app
2021-07-20 15:50:24,854 INFO: Running 'prebuild' commands in build/com.mirfatif.permissionmanagerx/app
2021-07-20 15:50:24,854 DEBUG: Directory: build/com.mirfatif.permissionmanagerx/app
2021-07-20 15:50:24,855 DEBUG: > bash -x -c -- sed -i -e 's/priv_daemon-release/priv_daemon-release-unsigned/' build.gradle && sed -i -e 's/pref_settings_check_for_updates_default">true/pref_settings_check_for_updates_default">false/' src/main/res/values/preference_keys.xml && sed -i -e 's#new File(sdkDir, "ndk/" + ndkVer).getAbsolutePath()#"/opt/android-sdk/ndk/22.1.7171670"#' build.gradle
+ sed -i -e s/priv_daemon-release/priv_daemon-release-unsigned/ build.gradle
+ sed -i -e 's/pref_settings_check_for_updates_default">true/pref_settings_check_for_updates_default">false/' src/main/res/values/preference_keys.xml
+ sed -i -e 's#new File(sdkDir, "ndk/" + ndkVer).getAbsolutePath()#"/opt/android-sdk/ndk/22.1.7171670"#' build.gradle
2021-07-20 15:50:25,067 INFO: Cleaning Gradle project...
2021-07-20 15:50:25,068 DEBUG: Directory: build/com.mirfatif.permissionmanagerx/app
2021-07-20 15:50:25,069 DEBUG: > /home/vagrant/fdroidserver/gradlew-fdroid clean
Found 6.8.3 via distributionUrl
Downloading missing gradle version 6.8.3
cachedir /home/vagrant/.cache/fdroidserver
/home/vagrant/.cache/fdroidserver/gradle-6.8.3-bin.zip: OK
Running /opt/gradle/versions/6.8.3/bin/gradle clean

Welcome to Gradle 6.8.3!

Here are the highlights of this release:
 - Faster Kotlin DSL script compilation
 - Vendor selection for Java toolchains
 - Convenient execution of tasks in composite builds
 - Consistent dependency resolution

For more details see https://docs.gradle.org/6.8.3/release-notes.html

To honour the JVM settings for this build a single-use Daemon process will be forked. See https://docs.gradle.org/6.8.3/userguide/gradle_daemon.html#sec:disabling_the_daemon.
Daemon will be stopped at the end of the build 
> Task :app:clean UP-TO-DATE

BUILD SUCCESSFUL in 36s
1 actionable task: 1 up-to-date
2021-07-20 15:51:04,448 INFO: Scanning source for common problems...
2021-07-20 15:51:04,462 INFO: Removing gradle-wrapper.jar at gradle/wrapper/gradle-wrapper.jar
2021-07-20 15:51:04,483 INFO: Creating source tarball...
2021-07-20 15:51:04,746 INFO: Building Gradle project...
2021-07-20 15:51:04,746 DEBUG: Directory: build/com.mirfatif.permissionmanagerx/app
2021-07-20 15:51:04,746 DEBUG: > /home/vagrant/fdroidserver/gradlew-fdroid assembleRelease
Found 6.8.3 via distributionUrl
Running /opt/gradle/versions/6.8.3/bin/gradle assembleRelease
To honour the JVM settings for this build a single-use Daemon process will be forked. See https://docs.gradle.org/6.8.3/userguide/gradle_daemon.html#sec:disabling_the_daemon.
Daemon will be stopped at the end of the build 
File /home/vagrant/.android/repositories.cfg could not be loaded.
Checking the license for package Android SDK Build-Tools 30.0.3 in /opt/android-sdk/licenses
License for package Android SDK Build-Tools 30.0.3 accepted.
Preparing "Install Android SDK Build-Tools 30.0.3 (revision: 30.0.3)".
"Install Android SDK Build-Tools 30.0.3 (revision: 30.0.3)" ready.
Installing Android SDK Build-Tools 30.0.3 in /opt/android-sdk/build-tools/30.0.3
"Install Android SDK Build-Tools 30.0.3 (revision: 30.0.3)" complete.
"Install Android SDK Build-Tools 30.0.3 (revision: 30.0.3)" finished.
Checking the license for package Android SDK Platform 30 in /opt/android-sdk/licenses
License for package Android SDK Platform 30 accepted.
Preparing "Install Android SDK Platform 30 (revision: 3)".
"Install Android SDK Platform 30 (revision: 3)" ready.
Installing Android SDK Platform 30 in /opt/android-sdk/platforms/android-30
"Install Android SDK Platform 30 (revision: 3)" complete.
"Install Android SDK Platform 30 (revision: 3)" finished.
> Task :AdbLib:verifyGoogleJavaFormat
> Task :AdbLib:preBuild
> Task :AdbLib:extractProguardFiles
> Task :AdbLib:preReleaseBuild
> Task :AdbLib:compileReleaseAidl NO-SOURCE
> Task :AdbLib:compileReleaseRenderscript NO-SOURCE
> Task :AdbLib:generateReleaseResValues
> Task :AdbLib:generateReleaseResources
> Task :AdbLib:packageReleaseResources
> Task :AdbLib:javaPreCompileRelease
> Task :AdbLib:parseReleaseLocalResources
> Task :AdbLib:processReleaseManifest
> Task :priv_daemon:verifyGoogleJavaFormat
> Task :priv_daemon:preBuild
> Task :priv_daemon:extractProguardFiles
> Task :priv_daemon:preReleaseBuild
> Task :AdbLib:generateReleaseRFile
> Task :hidden_apis:verifyGoogleJavaFormat
> Task :hidden_apis:preBuild
> Task :hidden_apis:preReleaseBuild
> Task :hidden_apis:compileReleaseAidl NO-SOURCE
> Task :hidden_apis:mergeReleaseJniLibFolders
> Task :hidden_apis:mergeReleaseNativeLibs NO-SOURCE
> Task :hidden_apis:stripReleaseDebugSymbols NO-SOURCE
> Task :hidden_apis:compileReleaseRenderscript NO-SOURCE
> Task :hidden_apis:copyReleaseJniLibsProjectAndLocalJars
> Task :hidden_apis:generateReleaseResValues
> Task :hidden_apis:generateReleaseResources
> Task :hidden_apis:packageReleaseResources
> Task :hidden_apis:parseReleaseLocalResources
> Task :hidden_apis:javaPreCompileRelease
> Task :hidden_apis:processReleaseManifest
> Task :hidden_apis:mergeReleaseShaders
> Task :hidden_apis:compileReleaseShaders NO-SOURCE
> Task :hidden_apis:generateReleaseAssets UP-TO-DATE
> Task :hidden_apis:packageReleaseAssets
> Task :hidden_apis:packageReleaseRenderscript NO-SOURCE
> Task :hidden_apis:generateReleaseRFile
> Task :hidden_apis:prepareLintJarForPublish
> Task :AdbLib:compileReleaseJavaWithJavac
> Task :hidden_apis:processReleaseJavaRes NO-SOURCE
> Task :AdbLib:bundleLibCompileToJarRelease
> Task :hidden_apis:mergeReleaseJavaResource
> Task :hidden_apis:compileReleaseJavaWithJavac
> Task :hidden_apis:extractReleaseAnnotations
> Task :hidden_apis:mergeReleaseGeneratedProguardFiles
> Task :hidden_apis:mergeReleaseConsumerProguardFiles
> Task :hidden_apis:syncReleaseLibJars
> Task :hidden_apis:compileReleaseSources
> Task :hidden_apis:writeReleaseAarMetadata
> Task :hidden_apis:mergeReleaseResources
> Task :hidden_apis:bundleReleaseAar
> Task :hidden_apis:verifyReleaseResources
> Task :priv_library:verifyGoogleJavaFormat
> Task :hidden_apis:assembleRelease
> Task :priv_library:buildHiddenApis
> Task :priv_library:preBuild
> Task :priv_library:preReleaseBuild
> Task :priv_library:compileReleaseAidl NO-SOURCE
> Task :priv_daemon:compileReleaseAidl NO-SOURCE
> Task :priv_library:packageReleaseRenderscript NO-SOURCE
> Task :priv_daemon:compileReleaseRenderscript NO-SOURCE
> Task :priv_daemon:javaPreCompileRelease
> Task :priv_daemon:writeReleaseApplicationId
> Task :priv_daemon:analyticsRecordingRelease
> Task :priv_library:writeReleaseAarMetadata
> Task :priv_daemon:generateReleaseResValues
> Task :priv_daemon:generateReleaseResources
> Task :priv_library:compileReleaseRenderscript NO-SOURCE
> Task :priv_library:generateReleaseResValues
> Task :priv_library:generateReleaseResources
> Task :priv_library:packageReleaseResources
> Task :priv_daemon:mergeReleaseResources
> Task :priv_daemon:createReleaseCompatibleScreenManifests
> Task :priv_daemon:extractDeepLinksRelease
> Task :priv_library:extractDeepLinksRelease
> Task :priv_library:processReleaseManifest
> Task :priv_daemon:checkReleaseAarMetadata
> Task :priv_daemon:processReleaseMainManifest
> Task :priv_daemon:processReleaseManifest
> Task :priv_library:parseReleaseLocalResources
> Task :hidden_apis:bundleLibCompileToJarRelease
> Task :priv_library:javaPreCompileRelease
> Task :priv_daemon:processReleaseManifestForPackage
> Task :priv_library:prepareLintJarForPublish
> Task :priv_library:generateReleaseRFile
> Task :priv_daemon:mergeReleaseJniLibFolders
> Task :priv_library:processReleaseJavaRes NO-SOURCE
> Task :priv_library:bundleLibResRelease NO-SOURCE
> Task :priv_library:mergeReleaseJniLibFolders
> Task :priv_library:mergeReleaseNativeLibs NO-SOURCE
> Task :priv_library:stripReleaseDebugSymbols NO-SOURCE
> Task :priv_library:copyReleaseJniLibsProjectOnly
> Task :priv_daemon:mergeReleaseShaders
> Task :priv_daemon:compileReleaseShaders NO-SOURCE
> Task :priv_daemon:generateReleaseAssets UP-TO-DATE
> Task :priv_library:mergeReleaseShaders
> Task :priv_library:compileReleaseShaders NO-SOURCE
> Task :priv_library:generateReleaseAssets UP-TO-DATE
> Task :priv_library:packageReleaseAssets
> Task :priv_daemon:mergeReleaseAssets
> Task :priv_daemon:compressReleaseAssets
> Task :priv_daemon:checkReleaseDuplicateClasses
> Task :priv_daemon:processReleaseJavaRes NO-SOURCE
> Task :priv_daemon:writeReleaseAppMetadata
> Task :priv_daemon:mergeReleaseJavaResource
> Task :priv_daemon:mergeReleaseNativeLibs
> Task :priv_daemon:processReleaseResources
> Task :priv_library:compileReleaseJavaWithJavac
> Task :priv_daemon:stripReleaseDebugSymbols NO-SOURCE
> Task :priv_library:bundleLibCompileToJarRelease
> Task :priv_daemon:extractReleaseNativeSymbolTables NO-SOURCE
> Task :priv_daemon:mergeReleaseNativeDebugMetadata NO-SOURCE
> Task :priv_library:mergeReleaseGeneratedProguardFiles
> Task :priv_library:exportReleaseConsumerProguardFiles
> Task :priv_daemon:compileReleaseJavaWithJavac
> Task :priv_daemon:compileReleaseSources
> Task :priv_daemon:mergeReleaseGeneratedProguardFiles
> Task :priv_daemon:writeReleaseSigningConfigVersions
> Task :priv_library:bundleLibRuntimeToJarRelease

> Task :app:buildNative
+ build_libcap /opt/android-sdk/ndk/22.1.7171670/toolchains/llvm/prebuilt/linux-x86_64/bin/armv7a-linux-androideabi24-clang
+ CC=/opt/android-sdk/ndk/22.1.7171670/toolchains/llvm/prebuilt/linux-x86_64/bin/armv7a-linux-androideabi24-clang
+ cd /home/vagrant/build/com.mirfatif.permissionmanagerx/native/libcap/libcap
+ make --debug=b clean cap_names.h
GNU Make 4.1
Built for x86_64-pc-linux-gnu
Copyright (C) 1988-2014 Free Software Foundation, Inc.
License GPLv3+: GNU GPL version 3 or later <http://gnu.org/licenses/gpl.html>
This is free software: you are free to change and redistribute it.
There is NO WARRANTY, to the extent permitted by law.
Reading makefiles...
Updating goal targets....
 File 'clean' does not exist.
Must remake target 'clean'.
rm -f *~ core
rm -f cap_alloc.o cap_proc.o cap_extint.o cap_flag.o cap_text.o cap_file.o libcap.so* libcap.a libcap.pc
rm -f ../psx/psx.o libpsx.so* libpsx.a libpsx.pc
rm -f cap_names.h cap_names.list.h _makenames _caps_output.gperf cap_test
rm -f include/sys/psx_syscall.h
cd include/sys && rm -f *~ core
Successfully remade target file 'clean'.
 File 'cap_names.h' does not exist.
   File '_makenames' does not exist.
     File 'cap_names.list.h' does not exist.
    Must remake target 'cap_names.list.h'.
=> making cap_names.list.h from /home/vagrant/build/com.mirfatif.permissionmanagerx/native/libcap/libcap/../libcap/include/uapi/linux/capability.h
perl -e 'while ($l=<>) { if ($l =~ /^\#define[ \t](CAP[_A-Z]+)[ \t]+([0-9]+)\s+$/) { $tok=$1; $val=$2; $tok =~ tr/A-Z/a-z/; print "{\"$tok\",$val},\n"; } }' /home/vagrant/build/com.mirfatif.permissionmanagerx/native/libcap/libcap/../libcap/include/uapi/linux/capability.h | fgrep -v 0x > cap_names.list.h
    Successfully remade target file 'cap_names.list.h'.
  Must remake target '_makenames'.
gcc -O2 -D_LARGEFILE64_SOURCE -D_FILE_OFFSET_BITS=64 -fPIC -I/home/vagrant/build/com.mirfatif.permissionmanagerx/native/libcap/libcap/../libcap/include/uapi -I/home/vagrant/build/com.mirfatif.permissionmanagerx/native/libcap/libcap/../libcap/include _makenames.c -o _makenames
  Successfully remade target file '_makenames'.
Must remake target 'cap_names.h'.
./_makenames > cap_names.h
Successfully remade target file 'cap_names.h'.
+ LIBCAP_MAKE_OPTS=
	    -Oz 		-Wall 	    -D_LARGEFILE64_SOURCE -D_FILE_OFFSET_BITS=64 -Dlinux 	    -fPIC 	    -I /home/vagrant/build/com.mirfatif.permissionmanagerx/native/libcap/libcap/include -I /home/vagrant/build/com.mirfatif.permissionmanagerx/native/libcap/libcap/include/uapi
+ set -ex
+ /opt/android-sdk/ndk/22.1.7171670/toolchains/llvm/prebuilt/linux-x86_64/bin/armv7a-linux-androideabi24-clang -Oz -Wall -D_LARGEFILE64_SOURCE -D_FILE_OFFSET_BITS=64 -Dlinux -fPIC -I /home/vagrant/build/com.mirfatif.permissionmanagerx/native/libcap/libcap/include -I /home/vagrant/build/com.mirfatif.permissionmanagerx/native/libcap/libcap/include/uapi -c cap_alloc.c cap_proc.c cap_extint.c cap_flag.c cap_text.c cap_file.c
+ /opt/android-sdk/ndk/22.1.7171670/toolchains/llvm/prebuilt/linux-x86_64/bin/llvm-ar rcs libcap.a cap_alloc.o cap_proc.o cap_extint.o cap_flag.o cap_text.o cap_file.o
+ /opt/android-sdk/ndk/22.1.7171670/toolchains/llvm/prebuilt/linux-x86_64/bin/armv7a-linux-androideabi24-clang -pie -o ../app/src/main/jniLibs/armeabi-v7a/libpmxe.so -Oz -Wl,--gc-sections -ffunction-sections -fdata-sections -Wl,-x -Wl,-X -fno-exceptions -fno-rtti -Wl,-z,norelro -Wl,--hash-style=gnu -D ANDROID -Wall pmx.c -I /home/vagrant/build/com.mirfatif.permissionmanagerx/native/libcap/libcap/include -Wl,-Bstatic -L /home/vagrant/build/com.mirfatif.permissionmanagerx/native/libcap/libcap -lcap -Wl,-Bdynamic -llog
+ /opt/android-sdk/ndk/22.1.7171670/toolchains/llvm/prebuilt/linux-x86_64/bin/llvm-strip ../app/src/main/jniLibs/armeabi-v7a/libpmxe.so -s -S --strip-unneeded -R=.eh_frame -R=.eh_frame_ptr -R .note.android.ident -R .comment -R .note -R .note.gnu.gold-version -R .note.gnu.build-id -R .note.gnu.property -R .note.ABI-tag
+ cd /home/vagrant/build/com.mirfatif.permissionmanagerx/native/libcap/libcap
+ make --debug=b clean
GNU Make 4.1
Built for x86_64-pc-linux-gnu
Copyright (C) 1988-2014 Free Software Foundation, Inc.
License GPLv3+: GNU GPL version 3 or later <http://gnu.org/licenses/gpl.html>
This is free software: you are free to change and redistribute it.
There is NO WARRANTY, to the extent permitted by law.
Reading makefiles...
Updating goal targets....
 File 'clean' does not exist.
Must remake target 'clean'.
rm -f *~ core
rm -f cap_alloc.o cap_proc.o cap_extint.o cap_flag.o cap_text.o cap_file.o libcap.so* libcap.a libcap.pc
rm -f ../psx/psx.o libpsx.so* libpsx.a libpsx.pc
rm -f cap_names.h cap_names.list.h _makenames _caps_output.gperf cap_test
rm -f include/sys/psx_syscall.h
cd include/sys && rm -f *~ core
Successfully remade target file 'clean'.
+ build_libcap /opt/android-sdk/ndk/22.1.7171670/toolchains/llvm/prebuilt/linux-x86_64/bin/aarch64-linux-android24-clang
+ CC=/opt/android-sdk/ndk/22.1.7171670/toolchains/llvm/prebuilt/linux-x86_64/bin/aarch64-linux-android24-clang
+ cd /home/vagrant/build/com.mirfatif.permissionmanagerx/native/libcap/libcap
+ make --debug=b clean cap_names.h
GNU Make 4.1
Built for x86_64-pc-linux-gnu
Copyright (C) 1988-2014 Free Software Foundation, Inc.
License GPLv3+: GNU GPL version 3 or later <http://gnu.org/licenses/gpl.html>
This is free software: you are free to change and redistribute it.
There is NO WARRANTY, to the extent permitted by law.
Reading makefiles...
Updating goal targets....
 File 'clean' does not exist.
Must remake target 'clean'.
rm -f *~ core
rm -f cap_alloc.o cap_proc.o cap_extint.o cap_flag.o cap_text.o cap_file.o libcap.so* libcap.a libcap.pc
rm -f ../psx/psx.o libpsx.so* libpsx.a libpsx.pc
rm -f cap_names.h cap_names.list.h _makenames _caps_output.gperf cap_test
rm -f include/sys/psx_syscall.h
cd include/sys && rm -f *~ core
Successfully remade target file 'clean'.
 File 'cap_names.h' does not exist.
   File '_makenames' does not exist.
     File 'cap_names.list.h' does not exist.
    Must remake target 'cap_names.list.h'.
=> making cap_names.list.h from /home/vagrant/build/com.mirfatif.permissionmanagerx/native/libcap/libcap/../libcap/include/uapi/linux/capability.h
perl -e 'while ($l=<>) { if ($l =~ /^\#define[ \t](CAP[_A-Z]+)[ \t]+([0-9]+)\s+$/) { $tok=$1; $val=$2; $tok =~ tr/A-Z/a-z/; print "{\"$tok\",$val},\n"; } }' /home/vagrant/build/com.mirfatif.permissionmanagerx/native/libcap/libcap/../libcap/include/uapi/linux/capability.h | fgrep -v 0x > cap_names.list.h
    Successfully remade target file 'cap_names.list.h'.
  Must remake target '_makenames'.
gcc -O2 -D_LARGEFILE64_SOURCE -D_FILE_OFFSET_BITS=64 -fPIC -I/home/vagrant/build/com.mirfatif.permissionmanagerx/native/libcap/libcap/../libcap/include/uapi -I/home/vagrant/build/com.mirfatif.permissionmanagerx/native/libcap/libcap/../libcap/include _makenames.c -o _makenames
  Successfully remade target file '_makenames'.
Must remake target 'cap_names.h'.
./_makenames > cap_names.h
Successfully remade target file 'cap_names.h'.
+ LIBCAP_MAKE_OPTS=
	    -Oz 		-Wall 	    -D_LARGEFILE64_SOURCE -D_FILE_OFFSET_BITS=64 -Dlinux 	    -fPIC 	    -I /home/vagrant/build/com.mirfatif.permissionmanagerx/native/libcap/libcap/include -I /home/vagrant/build/com.mirfatif.permissionmanagerx/native/libcap/libcap/include/uapi
+ set -ex
+ /opt/android-sdk/ndk/22.1.7171670/toolchains/llvm/prebuilt/linux-x86_64/bin/aarch64-linux-android24-clang -Oz -Wall -D_LARGEFILE64_SOURCE -D_FILE_OFFSET_BITS=64 -Dlinux -fPIC -I /home/vagrant/build/com.mirfatif.permissionmanagerx/native/libcap/libcap/include -I /home/vagrant/build/com.mirfatif.permissionmanagerx/native/libcap/libcap/include/uapi -c cap_alloc.c cap_proc.c cap_extint.c cap_flag.c cap_text.c cap_file.c
+ /opt/android-sdk/ndk/22.1.7171670/toolchains/llvm/prebuilt/linux-x86_64/bin/llvm-ar rcs libcap.a cap_alloc.o cap_proc.o cap_extint.o cap_flag.o cap_text.o cap_file.o
+ /opt/android-sdk/ndk/22.1.7171670/toolchains/llvm/prebuilt/linux-x86_64/bin/aarch64-linux-android24-clang -pie -o ../app/src/main/jniLibs/arm64-v8a/libpmxe.so -Oz -Wl,--gc-sections -ffunction-sections -fdata-sections -Wl,-x -Wl,-X -fno-exceptions -fno-rtti -Wl,-z,norelro -Wl,--hash-style=gnu -D ANDROID -Wall pmx.c -I /home/vagrant/build/com.mirfatif.permissionmanagerx/native/libcap/libcap/include -Wl,-Bstatic -L /home/vagrant/build/com.mirfatif.permissionmanagerx/native/libcap/libcap -lcap -Wl,-Bdynamic -llog
+ /opt/android-sdk/ndk/22.1.7171670/toolchains/llvm/prebuilt/linux-x86_64/bin/llvm-strip ../app/src/main/jniLibs/arm64-v8a/libpmxe.so -s -S --strip-unneeded -R=.eh_frame -R=.eh_frame_ptr -R .note.android.ident -R .comment -R .note -R .note.gnu.gold-version -R .note.gnu.build-id -R .note.gnu.property -R .note.ABI-tag
+ cd /home/vagrant/build/com.mirfatif.permissionmanagerx/native/libcap/libcap
+ make --debug=b clean
GNU Make 4.1
Built for x86_64-pc-linux-gnu
Copyright (C) 1988-2014 Free Software Foundation, Inc.
License GPLv3+: GNU GPL version 3 or later <http://gnu.org/licenses/gpl.html>
This is free software: you are free to change and redistribute it.
There is NO WARRANTY, to the extent permitted by law.
Reading makefiles...
Updating goal targets....
 File 'clean' does not exist.
Must remake target 'clean'.
rm -f *~ core
rm -f cap_alloc.o cap_proc.o cap_extint.o cap_flag.o cap_text.o cap_file.o libcap.so* libcap.a libcap.pc
rm -f ../psx/psx.o libpsx.so* libpsx.a libpsx.pc
rm -f cap_names.h cap_names.list.h _makenames _caps_output.gperf cap_test
rm -f include/sys/psx_syscall.h
cd include/sys && rm -f *~ core
Successfully remade target file 'clean'.
+ build_libcap /opt/android-sdk/ndk/22.1.7171670/toolchains/llvm/prebuilt/linux-x86_64/bin/i686-linux-android24-clang
+ CC=/opt/android-sdk/ndk/22.1.7171670/toolchains/llvm/prebuilt/linux-x86_64/bin/i686-linux-android24-clang
+ cd /home/vagrant/build/com.mirfatif.permissionmanagerx/native/libcap/libcap
+ make --debug=b clean cap_names.h
GNU Make 4.1
Built for x86_64-pc-linux-gnu
Copyright (C) 1988-2014 Free Software Foundation, Inc.
License GPLv3+: GNU GPL version 3 or later <http://gnu.org/licenses/gpl.html>
This is free software: you are free to change and redistribute it.
There is NO WARRANTY, to the extent permitted by law.
Reading makefiles...
Updating goal targets....
 File 'clean' does not exist.
Must remake target 'clean'.
rm -f *~ core
rm -f cap_alloc.o cap_proc.o cap_extint.o cap_flag.o cap_text.o cap_file.o libcap.so* libcap.a libcap.pc
rm -f ../psx/psx.o libpsx.so* libpsx.a libpsx.pc
rm -f cap_names.h cap_names.list.h _makenames _caps_output.gperf cap_test
rm -f include/sys/psx_syscall.h
cd include/sys && rm -f *~ core
Successfully remade target file 'clean'.
 File 'cap_names.h' does not exist.
   File '_makenames' does not exist.
     File 'cap_names.list.h' does not exist.
    Must remake target 'cap_names.list.h'.
=> making cap_names.list.h from /home/vagrant/build/com.mirfatif.permissionmanagerx/native/libcap/libcap/../libcap/include/uapi/linux/capability.h
perl -e 'while ($l=<>) { if ($l =~ /^\#define[ \t](CAP[_A-Z]+)[ \t]+([0-9]+)\s+$/) { $tok=$1; $val=$2; $tok =~ tr/A-Z/a-z/; print "{\"$tok\",$val},\n"; } }' /home/vagrant/build/com.mirfatif.permissionmanagerx/native/libcap/libcap/../libcap/include/uapi/linux/capability.h | fgrep -v 0x > cap_names.list.h
    Successfully remade target file 'cap_names.list.h'.
  Must remake target '_makenames'.
gcc -O2 -D_LARGEFILE64_SOURCE -D_FILE_OFFSET_BITS=64 -fPIC -I/home/vagrant/build/com.mirfatif.permissionmanagerx/native/libcap/libcap/../libcap/include/uapi -I/home/vagrant/build/com.mirfatif.permissionmanagerx/native/libcap/libcap/../libcap/include _makenames.c -o _makenames
  Successfully remade target file '_makenames'.
Must remake target 'cap_names.h'.
./_makenames > cap_names.h
Successfully remade target file 'cap_names.h'.
+ LIBCAP_MAKE_OPTS=
	    -Oz 		-Wall 	    -D_LARGEFILE64_SOURCE -D_FILE_OFFSET_BITS=64 -Dlinux 	    -fPIC 	    -I /home/vagrant/build/com.mirfatif.permissionmanagerx/native/libcap/libcap/include -I /home/vagrant/build/com.mirfatif.permissionmanagerx/native/libcap/libcap/include/uapi
+ set -ex
+ /opt/android-sdk/ndk/22.1.7171670/toolchains/llvm/prebuilt/linux-x86_64/bin/i686-linux-android24-clang -Oz -Wall -D_LARGEFILE64_SOURCE -D_FILE_OFFSET_BITS=64 -Dlinux -fPIC -I /home/vagrant/build/com.mirfatif.permissionmanagerx/native/libcap/libcap/include -I /home/vagrant/build/com.mirfatif.permissionmanagerx/native/libcap/libcap/include/uapi -c cap_alloc.c cap_proc.c cap_extint.c cap_flag.c cap_text.c cap_file.c
+ /opt/android-sdk/ndk/22.1.7171670/toolchains/llvm/prebuilt/linux-x86_64/bin/llvm-ar rcs libcap.a cap_alloc.o cap_proc.o cap_extint.o cap_flag.o cap_text.o cap_file.o
+ /opt/android-sdk/ndk/22.1.7171670/toolchains/llvm/prebuilt/linux-x86_64/bin/i686-linux-android24-clang -pie -o ../app/src/main/jniLibs/x86/libpmxe.so -Oz -Wl,--gc-sections -ffunction-sections -fdata-sections -Wl,-x -Wl,-X -fno-exceptions -fno-rtti -Wl,-z,norelro -Wl,--hash-style=gnu -D ANDROID -Wall pmx.c -I /home/vagrant/build/com.mirfatif.permissionmanagerx/native/libcap/libcap/include -Wl,-Bstatic -L /home/vagrant/build/com.mirfatif.permissionmanagerx/native/libcap/libcap -lcap -Wl,-Bdynamic -llog
+ /opt/android-sdk/ndk/22.1.7171670/toolchains/llvm/prebuilt/linux-x86_64/bin/llvm-strip ../app/src/main/jniLibs/x86/libpmxe.so -s -S --strip-unneeded -R=.eh_frame -R=.eh_frame_ptr -R .note.android.ident -R .comment -R .note -R .note.gnu.gold-version -R .note.gnu.build-id -R .note.gnu.property -R .note.ABI-tag
+ cd /home/vagrant/build/com.mirfatif.permissionmanagerx/native/libcap/libcap
+ make --debug=b clean
GNU Make 4.1
Built for x86_64-pc-linux-gnu
Copyright (C) 1988-2014 Free Software Foundation, Inc.
License GPLv3+: GNU GPL version 3 or later <http://gnu.org/licenses/gpl.html>
This is free software: you are free to change and redistribute it.
There is NO WARRANTY, to the extent permitted by law.
Reading makefiles...
Updating goal targets....
 File 'clean' does not exist.
Must remake target 'clean'.
rm -f *~ core
rm -f cap_alloc.o cap_proc.o cap_extint.o cap_flag.o cap_text.o cap_file.o libcap.so* libcap.a libcap.pc
rm -f ../psx/psx.o libpsx.so* libpsx.a libpsx.pc
rm -f cap_names.h cap_names.list.h _makenames _caps_output.gperf cap_test
rm -f include/sys/psx_syscall.h
cd include/sys && rm -f *~ core
Successfully remade target file 'clean'.
+ build_libcap /opt/android-sdk/ndk/22.1.7171670/toolchains/llvm/prebuilt/linux-x86_64/bin/x86_64-linux-android24-clang
+ CC=/opt/android-sdk/ndk/22.1.7171670/toolchains/llvm/prebuilt/linux-x86_64/bin/x86_64-linux-android24-clang
+ cd /home/vagrant/build/com.mirfatif.permissionmanagerx/native/libcap/libcap
+ make --debug=b clean cap_names.h
GNU Make 4.1
Built for x86_64-pc-linux-gnu
Copyright (C) 1988-2014 Free Software Foundation, Inc.
License GPLv3+: GNU GPL version 3 or later <http://gnu.org/licenses/gpl.html>
This is free software: you are free to change and redistribute it.
There is NO WARRANTY, to the extent permitted by law.
Reading makefiles...
Updating goal targets....
 File 'clean' does not exist.
Must remake target 'clean'.
rm -f *~ core
rm -f cap_alloc.o cap_proc.o cap_extint.o cap_flag.o cap_text.o cap_file.o libcap.so* libcap.a libcap.pc
rm -f ../psx/psx.o libpsx.so* libpsx.a libpsx.pc
rm -f cap_names.h cap_names.list.h _makenames _caps_output.gperf cap_test
rm -f include/sys/psx_syscall.h
cd include/sys && rm -f *~ core
Successfully remade target file 'clean'.
 File 'cap_names.h' does not exist.
   File '_makenames' does not exist.
     File 'cap_names.list.h' does not exist.
    Must remake target 'cap_names.list.h'.
=> making cap_names.list.h from /home/vagrant/build/com.mirfatif.permissionmanagerx/native/libcap/libcap/../libcap/include/uapi/linux/capability.h
perl -e 'while ($l=<>) { if ($l =~ /^\#define[ \t](CAP[_A-Z]+)[ \t]+([0-9]+)\s+$/) { $tok=$1; $val=$2; $tok =~ tr/A-Z/a-z/; print "{\"$tok\",$val},\n"; } }' /home/vagrant/build/com.mirfatif.permissionmanagerx/native/libcap/libcap/../libcap/include/uapi/linux/capability.h | fgrep -v 0x > cap_names.list.h
    Successfully remade target file 'cap_names.list.h'.
  Must remake target '_makenames'.
gcc -O2 -D_LARGEFILE64_SOURCE -D_FILE_OFFSET_BITS=64 -fPIC -I/home/vagrant/build/com.mirfatif.permissionmanagerx/native/libcap/libcap/../libcap/include/uapi -I/home/vagrant/build/com.mirfatif.permissionmanagerx/native/libcap/libcap/../libcap/include _makenames.c -o _makenames
  Successfully remade target file '_makenames'.
Must remake target 'cap_names.h'.
./_makenames > cap_names.h
Successfully remade target file 'cap_names.h'.
+ LIBCAP_MAKE_OPTS=
	    -Oz 		-Wall 	    -D_LARGEFILE64_SOURCE -D_FILE_OFFSET_BITS=64 -Dlinux 	    -fPIC 	    -I /home/vagrant/build/com.mirfatif.permissionmanagerx/native/libcap/libcap/include -I /home/vagrant/build/com.mirfatif.permissionmanagerx/native/libcap/libcap/include/uapi
+ set -ex
+ /opt/android-sdk/ndk/22.1.7171670/toolchains/llvm/prebuilt/linux-x86_64/bin/x86_64-linux-android24-clang -Oz -Wall -D_LARGEFILE64_SOURCE -D_FILE_OFFSET_BITS=64 -Dlinux -fPIC -I /home/vagrant/build/com.mirfatif.permissionmanagerx/native/libcap/libcap/include -I /home/vagrant/build/com.mirfatif.permissionmanagerx/native/libcap/libcap/include/uapi -c cap_alloc.c cap_proc.c cap_extint.c cap_flag.c cap_text.c cap_file.c
+ /opt/android-sdk/ndk/22.1.7171670/toolchains/llvm/prebuilt/linux-x86_64/bin/llvm-ar rcs libcap.a cap_alloc.o cap_proc.o cap_extint.o cap_flag.o cap_text.o cap_file.o
+ /opt/android-sdk/ndk/22.1.7171670/toolchains/llvm/prebuilt/linux-x86_64/bin/x86_64-linux-android24-clang -pie -o ../app/src/main/jniLibs/x86_64/libpmxe.so -Oz -Wl,--gc-sections -ffunction-sections -fdata-sections -Wl,-x -Wl,-X -fno-exceptions -fno-rtti -Wl,-z,norelro -Wl,--hash-style=gnu -D ANDROID -Wall pmx.c -I /home/vagrant/build/com.mirfatif.permissionmanagerx/native/libcap/libcap/include -Wl,-Bstatic -L /home/vagrant/build/com.mirfatif.permissionmanagerx/native/libcap/libcap -lcap -Wl,-Bdynamic -llog
+ /opt/android-sdk/ndk/22.1.7171670/toolchains/llvm/prebuilt/linux-x86_64/bin/llvm-strip ../app/src/main/jniLibs/x86_64/libpmxe.so -s -S --strip-unneeded -R=.eh_frame -R=.eh_frame_ptr -R .note.android.ident -R .comment -R .note -R .note.gnu.gold-version -R .note.gnu.build-id -R .note.gnu.property -R .note.ABI-tag
+ cd /home/vagrant/build/com.mirfatif.permissionmanagerx/native/libcap/libcap
+ make --debug=b clean
GNU Make 4.1
Built for x86_64-pc-linux-gnu
Copyright (C) 1988-2014 Free Software Foundation, Inc.
License GPLv3+: GNU GPL version 3 or later <http://gnu.org/licenses/gpl.html>
This is free software: you are free to change and redistribute it.
There is NO WARRANTY, to the extent permitted by law.
Reading makefiles...
Updating goal targets....
 File 'clean' does not exist.
Must remake target 'clean'.
rm -f *~ core
rm -f cap_alloc.o cap_proc.o cap_extint.o cap_flag.o cap_text.o cap_file.o libcap.so* libcap.a libcap.pc
rm -f ../psx/psx.o libpsx.so* libpsx.a libpsx.pc
rm -f cap_names.h cap_names.list.h _makenames _caps_output.gperf cap_test
rm -f include/sys/psx_syscall.h
cd include/sys && rm -f *~ core
Successfully remade target file 'clean'.

> Task :app:verifyGoogleJavaFormat
> Task :AdbLib:packageReleaseRenderscript NO-SOURCE
> Task :AdbLib:writeReleaseAarMetadata
> Task :AdbLib:extractDeepLinksRelease
> Task :AdbLib:prepareLintJarForPublish
> Task :AdbLib:processReleaseJavaRes NO-SOURCE
> Task :AdbLib:bundleLibResRelease NO-SOURCE
> Task :AdbLib:mergeReleaseJniLibFolders
> Task :AdbLib:mergeReleaseNativeLibs NO-SOURCE
> Task :AdbLib:stripReleaseDebugSymbols NO-SOURCE
> Task :AdbLib:copyReleaseJniLibsProjectOnly
> Task :priv_daemon:lintVitalRelease
> Task :AdbLib:mergeReleaseShaders
> Task :AdbLib:compileReleaseShaders NO-SOURCE
> Task :AdbLib:generateReleaseAssets UP-TO-DATE
> Task :AdbLib:packageReleaseAssets
> Task :AdbLib:mergeReleaseGeneratedProguardFiles
> Task :AdbLib:exportReleaseConsumerProguardFiles
> Task :priv_daemon:minifyReleaseWithR8
> Task :AdbLib:bundleLibRuntimeToJarRelease
> Task :priv_daemon:shrinkReleaseRes
> Task :priv_daemon:optimizeReleaseResources
> Task :priv_daemon:packageRelease
> Task :priv_daemon:assembleRelease
> Task :app:buildDaemon
> Task :app:preBuild
> Task :app:extractProguardFiles
> Task :app:preReleaseBuild
> Task :app:compileReleaseAidl NO-SOURCE
> Task :app:compileReleaseRenderscript NO-SOURCE
> Task :app:dataBindingMergeDependencyArtifactsRelease
> Task :app:dataBindingMergeGenClassesRelease
> Task :app:generateReleaseResValues
> Task :app:generateReleaseResources
> Task :app:generateReleaseBuildConfig
> Task :app:mergeReleaseResources
> Task :app:javaPreCompileRelease
> Task :app:dataBindingGenBaseClassesRelease
> Task :app:writeReleaseApplicationId
> Task :app:analyticsRecordingRelease
> Task :app:checkReleaseAarMetadata
> Task :app:createReleaseCompatibleScreenManifests
> Task :app:extractDeepLinksRelease
> Task :app:processReleaseMainManifest
> Task :app:processReleaseManifest
> Task :app:mergeReleaseJniLibFolders
> Task :app:mergeReleaseShaders
> Task :app:compileReleaseShaders NO-SOURCE
> Task :app:generateReleaseAssets UP-TO-DATE
> Task :app:mergeReleaseAssets
> Task :app:compressReleaseAssets
> Task :app:mergeReleaseNativeLibs
> Task :app:checkReleaseDuplicateClasses

> Task :app:stripReleaseDebugSymbols
WARNING:: NDK was located by using ndk.dir property. This method is deprecated and will be removed in a future release. Please delete ndk.dir from local.properties and set android.ndkVersion to [22.1.7171670] in all native modules in the project. https://developer.android.com/r/studio-ui/ndk-dir
NDK was located by using ndk.dir property. This method is deprecated and will be removed in a future release. Please delete ndk.dir from local.properties and set android.ndkVersion to [22.1.7171670] in all native modules in the project. https://developer.android.com/r/studio-ui/ndk-dir

> Task :app:processReleaseJavaRes NO-SOURCE
> Task :app:writeReleaseAppMetadata
> Task :app:writeReleaseSigningConfigVersions
> Task :app:processReleaseManifestForPackage

> Task :app:extractReleaseNativeSymbolTables
WARNING:: NDK was located by using ndk.dir property. This method is deprecated and will be removed in a future release. Please delete ndk.dir from local.properties and set android.ndkVersion to [22.1.7171670] in all native modules in the project. https://developer.android.com/r/studio-ui/ndk-dir
NDK was located by using ndk.dir property. This method is deprecated and will be removed in a future release. Please delete ndk.dir from local.properties and set android.ndkVersion to [22.1.7171670] in all native modules in the project. https://developer.android.com/r/studio-ui/ndk-dir

> Task :app:mergeReleaseNativeDebugMetadata NO-SOURCE
> Task :app:processReleaseResources

> Task :app:compileReleaseJavaWithJavac
/home/vagrant/build/com.mirfatif.permissionmanagerx/app/src/main/java/com/mirfatif/permissionmanagerx/parser/PackageParser.java:734: warning: [deprecation] protectionLevel in PermissionInfo has been deprecated
      int protectionLevel = permissionInfo.protectionLevel & PermissionInfo.PROTECTION_MASK_BASE;
                                          ^
/home/vagrant/build/com.mirfatif.permissionmanagerx/app/src/main/java/com/mirfatif/permissionmanagerx/parser/PackageParser.java:734: warning: [deprecation] PROTECTION_MASK_BASE in PermissionInfo has been deprecated
      int protectionLevel = permissionInfo.protectionLevel & PermissionInfo.PROTECTION_MASK_BASE;
                                                                           ^
/home/vagrant/build/com.mirfatif.permissionmanagerx/app/src/main/java/com/mirfatif/permissionmanagerx/parser/PackageParser.java:735: warning: [deprecation] protectionLevel in PermissionInfo has been deprecated
      int protectionFlags = permissionInfo.protectionLevel & ~PermissionInfo.PROTECTION_MASK_BASE;
                                          ^
/home/vagrant/build/com.mirfatif.permissionmanagerx/app/src/main/java/com/mirfatif/permissionmanagerx/parser/PackageParser.java:735: warning: [deprecation] PROTECTION_MASK_BASE in PermissionInfo has been deprecated
      int protectionFlags = permissionInfo.protectionLevel & ~PermissionInfo.PROTECTION_MASK_BASE;
                                                                            ^
/home/vagrant/build/com.mirfatif.permissionmanagerx/app/src/main/java/com/mirfatif/permissionmanagerx/parser/PackageParser.java:1062: warning: [deprecation] GET_SIGNATURES in PackageManager has been deprecated
  static final int PM_GET_SIGNATURES = PackageManager.GET_SIGNATURES;
                                                     ^
/home/vagrant/build/com.mirfatif.permissionmanagerx/app/src/main/java/com/mirfatif/permissionmanagerx/parser/PackageParser.java:1065: warning: [deprecation] signatures in PackageInfo has been deprecated
    return packageInfo.signatures;
                      ^
/home/vagrant/build/com.mirfatif.permissionmanagerx/app/src/main/java/com/mirfatif/permissionmanagerx/util/Utils.java:552: error: cannot find symbol
      if (!string.substring(start, end).equals("LINK")) {
                 ^
  symbol:   method substring(int,int)
  location: variable string of type SpannableStringBuilder
1 error
6 warnings

> Task :app:compileReleaseJavaWithJavac FAILED

FAILURE: Build failed with an exception.

* What went wrong:
Execution failed for task ':app:compileReleaseJavaWithJavac'.
> Compilation failed; see the compiler error output for details.

* Try:
Run with --stacktrace option to get the stack trace. Run with --info or --debug option to get more log output. Run with --scan to get full insights.

* Get more help at https://help.gradle.org

BUILD FAILED in 55s
124 actionable tasks: 124 executed
2021-07-20 15:52:00,833 DEBUG: Popen(['git', 'cat-file', '--batch-check'], cwd=/home/vagrant/build/com.mirfatif.permissionmanagerx, universal_newlines=False, shell=None)
2021-07-20 15:52:00,841 ERROR: Could not build app com.mirfatif.permissionmanagerx: Build failed for com.mirfatif.permissionmanagerx:v1.07@6e15c8fdfae635ee1cec56d3bd76c23a5c2a2d40
==== detail begin ====
Found 6.8.3 via distributionUrl
Running /opt/gradle/versions/6.8.3/bin/gradle assembleRelease
To honour the JVM settings for this build a single-use Daemon process will be forked. See https://docs.gradle.org/6.8.3/userguide/gradle_daemon.html#sec:disabling_the_daemon.
Daemon will be stopped at the end of the build 
File /home/vagrant/.android/repositories.cfg could not be loaded.
Checking the license for package Android SDK Build-Tools 30.0.3 in /opt/android-sdk/licenses
License for package Android SDK Build-Tools 30.0.3 accepted.
Preparing "Install Android SDK Build-Tools 30.0.3 (revision: 30.0.3)".
"Install Android SDK Build-Tools 30.0.3 (revision: 30.0.3)" ready.
Installing Android SDK Build-Tools 30.0.3 in /opt/android-sdk/build-tools/30.0.3
"Install Android SDK Build-Tools 30.0.3 (revision: 30.0.3)" complete.
"Install Android SDK Build-Tools 30.0.3 (revision: 30.0.3)" finished.
Checking the license for package Android SDK Platform 30 in /opt/android-sdk/licenses
License for package Android SDK Platform 30 accepted.
Preparing "Install Android SDK Platform 30 (revision: 3)".
"Install Android SDK Platform 30 (revision: 3)" ready.
Installing Android SDK Platform 30 in /opt/android-sdk/platforms/android-30
"Install Android SDK Platform 30 (revision: 3)" complete.
"Install Android SDK Platform 30 (revision: 3)" finished.
> Task :AdbLib:verifyGoogleJavaFormat
> Task :AdbLib:preBuild
> Task :AdbLib:extractProguardFiles
> Task :AdbLib:preReleaseBuild
> Task :AdbLib:compileReleaseAidl NO-SOURCE
> Task :AdbLib:compileReleaseRenderscript NO-SOURCE
> Task :AdbLib:generateReleaseResValues
> Task :AdbLib:generateReleaseResources
> Task :AdbLib:packageReleaseResources
> Task :AdbLib:javaPreCompileRelease
> Task :AdbLib:parseReleaseLocalResources
> Task :AdbLib:processReleaseManifest
> Task :priv_daemon:verifyGoogleJavaFormat
> Task :priv_daemon:preBuild
> Task :priv_daemon:extractProguardFiles
> Task :priv_daemon:preReleaseBuild
> Task :AdbLib:generateReleaseRFile
> Task :hidden_apis:verifyGoogleJavaFormat
> Task :hidden_apis:preBuild
> Task :hidden_apis:preReleaseBuild
> Task :hidden_apis:compileReleaseAidl NO-SOURCE
> Task :hidden_apis:mergeReleaseJniLibFolders
> Task :hidden_apis:mergeReleaseNativeLibs NO-SOURCE
> Task :hidden_apis:stripReleaseDebugSymbols NO-SOURCE
> Task :hidden_apis:compileReleaseRenderscript NO-SOURCE
> Task :hidden_apis:copyReleaseJniLibsProjectAndLocalJars
> Task :hidden_apis:generateReleaseResValues
> Task :hidden_apis:generateReleaseResources
> Task :hidden_apis:packageReleaseResources
> Task :hidden_apis:parseReleaseLocalResources
> Task :hidden_apis:javaPreCompileRelease
> Task :hidden_apis:processReleaseManifest
> Task :hidden_apis:mergeReleaseShaders
> Task :hidden_apis:compileReleaseShaders NO-SOURCE
> Task :hidden_apis:generateReleaseAssets UP-TO-DATE
> Task :hidden_apis:packageReleaseAssets
> Task :hidden_apis:packageReleaseRenderscript NO-SOURCE
> Task :hidden_apis:generateReleaseRFile
> Task :hidden_apis:prepareLintJarForPublish
> Task :AdbLib:compileReleaseJavaWithJavac
> Task :hidden_apis:processReleaseJavaRes NO-SOURCE
> Task :AdbLib:bundleLibCompileToJarRelease
> Task :hidden_apis:mergeReleaseJavaResource
> Task :hidden_apis:compileReleaseJavaWithJavac
> Task :hidden_apis:extractReleaseAnnotations
> Task :hidden_apis:mergeReleaseGeneratedProguardFiles
> Task :hidden_apis:mergeReleaseConsumerProguardFiles
> Task :hidden_apis:syncReleaseLibJars
> Task :hidden_apis:compileReleaseSources
> Task :hidden_apis:writeReleaseAarMetadata
> Task :hidden_apis:mergeReleaseResources
> Task :hidden_apis:bundleReleaseAar
> Task :hidden_apis:verifyReleaseResources
> Task :priv_library:verifyGoogleJavaFormat
> Task :hidden_apis:assembleRelease
> Task :priv_library:buildHiddenApis
> Task :priv_library:preBuild
> Task :priv_library:preReleaseBuild
> Task :priv_library:compileReleaseAidl NO-SOURCE
> Task :priv_daemon:compileReleaseAidl NO-SOURCE
> Task :priv_library:packageReleaseRenderscript NO-SOURCE
> Task :priv_daemon:compileReleaseRenderscript NO-SOURCE
> Task :priv_daemon:javaPreCompileRelease
> Task :priv_daemon:writeReleaseApplicationId
> Task :priv_daemon:analyticsRecordingRelease
> Task :priv_library:writeReleaseAarMetadata
> Task :priv_daemon:generateReleaseResValues
> Task :priv_daemon:generateReleaseResources
> Task :priv_library:compileReleaseRenderscript NO-SOURCE
> Task :priv_library:generateReleaseResValues
> Task :priv_library:generateReleaseResources
> Task :priv_library:packageReleaseResources
> Task :priv_daemon:mergeReleaseResources
> Task :priv_daemon:createReleaseCompatibleScreenManifests
> Task :priv_daemon:extractDeepLinksRelease
> Task :priv_library:extractDeepLinksRelease
> Task :priv_library:processReleaseManifest
> Task :priv_daemon:checkReleaseAarMetadata
> Task :priv_daemon:processReleaseMainManifest
> Task :priv_daemon:processReleaseManifest
> Task :priv_library:parseReleaseLocalResources
> Task :hidden_apis:bundleLibCompileToJarRelease
> Task :priv_library:javaPreCompileRelease
> Task :priv_daemon:processReleaseManifestForPackage
> Task :priv_library:prepareLintJarForPublish
> Task :priv_library:generateReleaseRFile
> Task :priv_daemon:mergeReleaseJniLibFolders
> Task :priv_library:processReleaseJavaRes NO-SOURCE
> Task :priv_library:bundleLibResRelease NO-SOURCE
> Task :priv_library:mergeReleaseJniLibFolders
> Task :priv_library:mergeReleaseNativeLibs NO-SOURCE
> Task :priv_library:stripReleaseDebugSymbols NO-SOURCE
> Task :priv_library:copyReleaseJniLibsProjectOnly
> Task :priv_daemon:mergeReleaseShaders
> Task :priv_daemon:compileReleaseShaders NO-SOURCE
> Task :priv_daemon:generateReleaseAssets UP-TO-DATE
> Task :priv_library:mergeReleaseShaders
> Task :priv_library:compileReleaseShaders NO-SOURCE
> Task :priv_library:generateReleaseAssets UP-TO-DATE
> Task :priv_library:packageReleaseAssets
> Task :priv_daemon:mergeReleaseAssets
> Task :priv_daemon:compressReleaseAssets
> Task :priv_daemon:checkReleaseDuplicateClasses
> Task :priv_daemon:processReleaseJavaRes NO-SOURCE
> Task :priv_daemon:writeReleaseAppMetadata
> Task :priv_daemon:mergeReleaseJavaResource
> Task :priv_daemon:mergeReleaseNativeLibs
> Task :priv_daemon:processReleaseResources
> Task :priv_library:compileReleaseJavaWithJavac
> Task :priv_daemon:stripReleaseDebugSymbols NO-SOURCE
> Task :priv_library:bundleLibCompileToJarRelease
> Task :priv_daemon:extractReleaseNativeSymbolTables NO-SOURCE
> Task :priv_daemon:mergeReleaseNativeDebugMetadata NO-SOURCE
> Task :priv_library:mergeReleaseGeneratedProguardFiles
> Task :priv_library:exportReleaseConsumerProguardFiles
> Task :priv_daemon:compileReleaseJavaWithJavac
> Task :priv_daemon:compileReleaseSources
> Task :priv_daemon:mergeReleaseGeneratedProguardFiles
> Task :priv_daemon:writeReleaseSigningConfigVersions
> Task :priv_library:bundleLibRuntimeToJarRelease

> Task :app:buildNative
+ build_libcap /opt/android-sdk/ndk/22.1.7171670/toolchains/llvm/prebuilt/linux-x86_64/bin/armv7a-linux-androideabi24-clang
+ CC=/opt/android-sdk/ndk/22.1.7171670/toolchains/llvm/prebuilt/linux-x86_64/bin/armv7a-linux-androideabi24-clang
+ cd /home/vagrant/build/com.mirfatif.permissionmanagerx/native/libcap/libcap
+ make --debug=b clean cap_names.h
GNU Make 4.1
Built for x86_64-pc-linux-gnu
Copyright (C) 1988-2014 Free Software Foundation, Inc.
License GPLv3+: GNU GPL version 3 or later <http://gnu.org/licenses/gpl.html>
This is free software: you are free to change and redistribute it.
There is NO WARRANTY, to the extent permitted by law.
Reading makefiles...
Updating goal targets....
 File 'clean' does not exist.
Must remake target 'clean'.
rm -f *~ core
rm -f cap_alloc.o cap_proc.o cap_extint.o cap_flag.o cap_text.o cap_file.o libcap.so* libcap.a libcap.pc
rm -f ../psx/psx.o libpsx.so* libpsx.a libpsx.pc
rm -f cap_names.h cap_names.list.h _makenames _caps_output.gperf cap_test
rm -f include/sys/psx_syscall.h
cd include/sys && rm -f *~ core
Successfully remade target file 'clean'.
 File 'cap_names.h' does not exist.
   File '_makenames' does not exist.
     File 'cap_names.list.h' does not exist.
    Must remake target 'cap_names.list.h'.
=> making cap_names.list.h from /home/vagrant/build/com.mirfatif.permissionmanagerx/native/libcap/libcap/../libcap/include/uapi/linux/capability.h
perl -e 'while ($l=<>) { if ($l =~ /^\#define[ \t](CAP[_A-Z]+)[ \t]+([0-9]+)\s+$/) { $tok=$1; $val=$2; $tok =~ tr/A-Z/a-z/; print "{\"$tok\",$val},\n"; } }' /home/vagrant/build/com.mirfatif.permissionmanagerx/native/libcap/libcap/../libcap/include/uapi/linux/capability.h | fgrep -v 0x > cap_names.list.h
    Successfully remade target file 'cap_names.list.h'.
  Must remake target '_makenames'.
gcc -O2 -D_LARGEFILE64_SOURCE -D_FILE_OFFSET_BITS=64 -fPIC -I/home/vagrant/build/com.mirfatif.permissionmanagerx/native/libcap/libcap/../libcap/include/uapi -I/home/vagrant/build/com.mirfatif.permissionmanagerx/native/libcap/libcap/../libcap/include _makenames.c -o _makenames
  Successfully remade target file '_makenames'.
Must remake target 'cap_names.h'.
./_makenames > cap_names.h
Successfully remade target file 'cap_names.h'.
+ LIBCAP_MAKE_OPTS=
	    -Oz 		-Wall 	    -D_LARGEFILE64_SOURCE -D_FILE_OFFSET_BITS=64 -Dlinux 	    -fPIC 	    -I /home/vagrant/build/com.mirfatif.permissionmanagerx/native/libcap/libcap/include -I /home/vagrant/build/com.mirfatif.permissionmanagerx/native/libcap/libcap/include/uapi
+ set -ex
+ /opt/android-sdk/ndk/22.1.7171670/toolchains/llvm/prebuilt/linux-x86_64/bin/armv7a-linux-androideabi24-clang -Oz -Wall -D_LARGEFILE64_SOURCE -D_FILE_OFFSET_BITS=64 -Dlinux -fPIC -I /home/vagrant/build/com.mirfatif.permissionmanagerx/native/libcap/libcap/include -I /home/vagrant/build/com.mirfatif.permissionmanagerx/native/libcap/libcap/include/uapi -c cap_alloc.c cap_proc.c cap_extint.c cap_flag.c cap_text.c cap_file.c
+ /opt/android-sdk/ndk/22.1.7171670/toolchains/llvm/prebuilt/linux-x86_64/bin/llvm-ar rcs libcap.a cap_alloc.o cap_proc.o cap_extint.o cap_flag.o cap_text.o cap_file.o
+ /opt/android-sdk/ndk/22.1.7171670/toolchains/llvm/prebuilt/linux-x86_64/bin/armv7a-linux-androideabi24-clang -pie -o ../app/src/main/jniLibs/armeabi-v7a/libpmxe.so -Oz -Wl,--gc-sections -ffunction-sections -fdata-sections -Wl,-x -Wl,-X -fno-exceptions -fno-rtti -Wl,-z,norelro -Wl,--hash-style=gnu -D ANDROID -Wall pmx.c -I /home/vagrant/build/com.mirfatif.permissionmanagerx/native/libcap/libcap/include -Wl,-Bstatic -L /home/vagrant/build/com.mirfatif.permissionmanagerx/native/libcap/libcap -lcap -Wl,-Bdynamic -llog
+ /opt/android-sdk/ndk/22.1.7171670/toolchains/llvm/prebuilt/linux-x86_64/bin/llvm-strip ../app/src/main/jniLibs/armeabi-v7a/libpmxe.so -s -S --strip-unneeded -R=.eh_frame -R=.eh_frame_ptr -R .note.android.ident -R .comment -R .note -R .note.gnu.gold-version -R .note.gnu.build-id -R .note.gnu.property -R .note.ABI-tag
+ cd /home/vagrant/build/com.mirfatif.permissionmanagerx/native/libcap/libcap
+ make --debug=b clean
GNU Make 4.1
Built for x86_64-pc-linux-gnu
Copyright (C) 1988-2014 Free Software Foundation, Inc.
License GPLv3+: GNU GPL version 3 or later <http://gnu.org/licenses/gpl.html>
This is free software: you are free to change and redistribute it.
There is NO WARRANTY, to the extent permitted by law.
Reading makefiles...
Updating goal targets....
 File 'clean' does not exist.
Must remake target 'clean'.
rm -f *~ core
rm -f cap_alloc.o cap_proc.o cap_extint.o cap_flag.o cap_text.o cap_file.o libcap.so* libcap.a libcap.pc
rm -f ../psx/psx.o libpsx.so* libpsx.a libpsx.pc
rm -f cap_names.h cap_names.list.h _makenames _caps_output.gperf cap_test
rm -f include/sys/psx_syscall.h
cd include/sys && rm -f *~ core
Successfully remade target file 'clean'.
+ build_libcap /opt/android-sdk/ndk/22.1.7171670/toolchains/llvm/prebuilt/linux-x86_64/bin/aarch64-linux-android24-clang
+ CC=/opt/android-sdk/ndk/22.1.7171670/toolchains/llvm/prebuilt/linux-x86_64/bin/aarch64-linux-android24-clang
+ cd /home/vagrant/build/com.mirfatif.permissionmanagerx/native/libcap/libcap
+ make --debug=b clean cap_names.h
GNU Make 4.1
Built for x86_64-pc-linux-gnu
Copyright (C) 1988-2014 Free Software Foundation, Inc.
License GPLv3+: GNU GPL version 3 or later <http://gnu.org/licenses/gpl.html>
This is free software: you are free to change and redistribute it.
There is NO WARRANTY, to the extent permitted by law.
Reading makefiles...
Updating goal targets....
 File 'clean' does not exist.
Must remake target 'clean'.
rm -f *~ core
rm -f cap_alloc.o cap_proc.o cap_extint.o cap_flag.o cap_text.o cap_file.o libcap.so* libcap.a libcap.pc
rm -f ../psx/psx.o libpsx.so* libpsx.a libpsx.pc
rm -f cap_names.h cap_names.list.h _makenames _caps_output.gperf cap_test
rm -f include/sys/psx_syscall.h
cd include/sys && rm -f *~ core
Successfully remade target file 'clean'.
 File 'cap_names.h' does not exist.
   File '_makenames' does not exist.
     File 'cap_names.list.h' does not exist.
    Must remake target 'cap_names.list.h'.
=> making cap_names.list.h from /home/vagrant/build/com.mirfatif.permissionmanagerx/native/libcap/libcap/../libcap/include/uapi/linux/capability.h
perl -e 'while ($l=<>) { if ($l =~ /^\#define[ \t](CAP[_A-Z]+)[ \t]+([0-9]+)\s+$/) { $tok=$1; $val=$2; $tok =~ tr/A-Z/a-z/; print "{\"$tok\",$val},\n"; } }' /home/vagrant/build/com.mirfatif.permissionmanagerx/native/libcap/libcap/../libcap/include/uapi/linux/capability.h | fgrep -v 0x > cap_names.list.h
    Successfully remade target file 'cap_names.list.h'.
  Must remake target '_makenames'.
gcc -O2 -D_LARGEFILE64_SOURCE -D_FILE_OFFSET_BITS=64 -fPIC -I/home/vagrant/build/com.mirfatif.permissionmanagerx/native/libcap/libcap/../libcap/include/uapi -I/home/vagrant/build/com.mirfatif.permissionmanagerx/native/libcap/libcap/../libcap/include _makenames.c -o _makenames
  Successfully remade target file '_makenames'.
Must remake target 'cap_names.h'.
./_makenames > cap_names.h
Successfully remade target file 'cap_names.h'.
+ LIBCAP_MAKE_OPTS=
	    -Oz 		-Wall 	    -D_LARGEFILE64_SOURCE -D_FILE_OFFSET_BITS=64 -Dlinux 	    -fPIC 	    -I /home/vagrant/build/com.mirfatif.permissionmanagerx/native/libcap/libcap/include -I /home/vagrant/build/com.mirfatif.permissionmanagerx/native/libcap/libcap/include/uapi
+ set -ex
+ /opt/android-sdk/ndk/22.1.7171670/toolchains/llvm/prebuilt/linux-x86_64/bin/aarch64-linux-android24-clang -Oz -Wall -D_LARGEFILE64_SOURCE -D_FILE_OFFSET_BITS=64 -Dlinux -fPIC -I /home/vagrant/build/com.mirfatif.permissionmanagerx/native/libcap/libcap/include -I /home/vagrant/build/com.mirfatif.permissionmanagerx/native/libcap/libcap/include/uapi -c cap_alloc.c cap_proc.c cap_extint.c cap_flag.c cap_text.c cap_file.c
+ /opt/android-sdk/ndk/22.1.7171670/toolchains/llvm/prebuilt/linux-x86_64/bin/llvm-ar rcs libcap.a cap_alloc.o cap_proc.o cap_extint.o cap_flag.o cap_text.o cap_file.o
+ /opt/android-sdk/ndk/22.1.7171670/toolchains/llvm/prebuilt/linux-x86_64/bin/aarch64-linux-android24-clang -pie -o ../app/src/main/jniLibs/arm64-v8a/libpmxe.so -Oz -Wl,--gc-sections -ffunction-sections -fdata-sections -Wl,-x -Wl,-X -fno-exceptions -fno-rtti -Wl,-z,norelro -Wl,--hash-style=gnu -D ANDROID -Wall pmx.c -I /home/vagrant/build/com.mirfatif.permissionmanagerx/native/libcap/libcap/include -Wl,-Bstatic -L /home/vagrant/build/com.mirfatif.permissionmanagerx/native/libcap/libcap -lcap -Wl,-Bdynamic -llog
+ /opt/android-sdk/ndk/22.1.7171670/toolchains/llvm/prebuilt/linux-x86_64/bin/llvm-strip ../app/src/main/jniLibs/arm64-v8a/libpmxe.so -s -S --strip-unneeded -R=.eh_frame -R=.eh_frame_ptr -R .note.android.ident -R .comment -R .note -R .note.gnu.gold-version -R .note.gnu.build-id -R .note.gnu.property -R .note.ABI-tag
+ cd /home/vagrant/build/com.mirfatif.permissionmanagerx/native/libcap/libcap
+ make --debug=b clean
GNU Make 4.1
Built for x86_64-pc-linux-gnu
Copyright (C) 1988-2014 Free Software Foundation, Inc.
License GPLv3+: GNU GPL version 3 or later <http://gnu.org/licenses/gpl.html>
This is free software: you are free to change and redistribute it.
There is NO WARRANTY, to the extent permitted by law.
Reading makefiles...
Updating goal targets....
 File 'clean' does not exist.
Must remake target 'clean'.
rm -f *~ core
rm -f cap_alloc.o cap_proc.o cap_extint.o cap_flag.o cap_text.o cap_file.o libcap.so* libcap.a libcap.pc
rm -f ../psx/psx.o libpsx.so* libpsx.a libpsx.pc
rm -f cap_names.h cap_names.list.h _makenames _caps_output.gperf cap_test
rm -f include/sys/psx_syscall.h
cd include/sys && rm -f *~ core
Successfully remade target file 'clean'.
+ build_libcap /opt/android-sdk/ndk/22.1.7171670/toolchains/llvm/prebuilt/linux-x86_64/bin/i686-linux-android24-clang
+ CC=/opt/android-sdk/ndk/22.1.7171670/toolchains/llvm/prebuilt/linux-x86_64/bin/i686-linux-android24-clang
+ cd /home/vagrant/build/com.mirfatif.permissionmanagerx/native/libcap/libcap
+ make --debug=b clean cap_names.h
GNU Make 4.1
Built for x86_64-pc-linux-gnu
Copyright (C) 1988-2014 Free Software Foundation, Inc.
License GPLv3+: GNU GPL version 3 or later <http://gnu.org/licenses/gpl.html>
This is free software: you are free to change and redistribute it.
There is NO WARRANTY, to the extent permitted by law.
Reading makefiles...
Updating goal targets....
 File 'clean' does not exist.
Must remake target 'clean'.
rm -f *~ core
rm -f cap_alloc.o cap_proc.o cap_extint.o cap_flag.o cap_text.o cap_file.o libcap.so* libcap.a libcap.pc
rm -f ../psx/psx.o libpsx.so* libpsx.a libpsx.pc
rm -f cap_names.h cap_names.list.h _makenames _caps_output.gperf cap_test
rm -f include/sys/psx_syscall.h
cd include/sys && rm -f *~ core
Successfully remade target file 'clean'.
 File 'cap_names.h' does not exist.
   File '_makenames' does not exist.
     File 'cap_names.list.h' does not exist.
    Must remake target 'cap_names.list.h'.
=> making cap_names.list.h from /home/vagrant/build/com.mirfatif.permissionmanagerx/native/libcap/libcap/../libcap/include/uapi/linux/capability.h
perl -e 'while ($l=<>) { if ($l =~ /^\#define[ \t](CAP[_A-Z]+)[ \t]+([0-9]+)\s+$/) { $tok=$1; $val=$2; $tok =~ tr/A-Z/a-z/; print "{\"$tok\",$val},\n"; } }' /home/vagrant/build/com.mirfatif.permissionmanagerx/native/libcap/libcap/../libcap/include/uapi/linux/capability.h | fgrep -v 0x > cap_names.list.h
    Successfully remade target file 'cap_names.list.h'.
  Must remake target '_makenames'.
gcc -O2 -D_LARGEFILE64_SOURCE -D_FILE_OFFSET_BITS=64 -fPIC -I/home/vagrant/build/com.mirfatif.permissionmanagerx/native/libcap/libcap/../libcap/include/uapi -I/home/vagrant/build/com.mirfatif.permissionmanagerx/native/libcap/libcap/../libcap/include _makenames.c -o _makenames
  Successfully remade target file '_makenames'.
Must remake target 'cap_names.h'.
./_makenames > cap_names.h
Successfully remade target file 'cap_names.h'.
+ LIBCAP_MAKE_OPTS=
	    -Oz 		-Wall 	    -D_LARGEFILE64_SOURCE -D_FILE_OFFSET_BITS=64 -Dlinux 	    -fPIC 	    -I /home/vagrant/build/com.mirfatif.permissionmanagerx/native/libcap/libcap/include -I /home/vagrant/build/com.mirfatif.permissionmanagerx/native/libcap/libcap/include/uapi
+ set -ex
+ /opt/android-sdk/ndk/22.1.7171670/toolchains/llvm/prebuilt/linux-x86_64/bin/i686-linux-android24-clang -Oz -Wall -D_LARGEFILE64_SOURCE -D_FILE_OFFSET_BITS=64 -Dlinux -fPIC -I /home/vagrant/build/com.mirfatif.permissionmanagerx/native/libcap/libcap/include -I /home/vagrant/build/com.mirfatif.permissionmanagerx/native/libcap/libcap/include/uapi -c cap_alloc.c cap_proc.c cap_extint.c cap_flag.c cap_text.c cap_file.c
+ /opt/android-sdk/ndk/22.1.7171670/toolchains/llvm/prebuilt/linux-x86_64/bin/llvm-ar rcs libcap.a cap_alloc.o cap_proc.o cap_extint.o cap_flag.o cap_text.o cap_file.o
+ /opt/android-sdk/ndk/22.1.7171670/toolchains/llvm/prebuilt/linux-x86_64/bin/i686-linux-android24-clang -pie -o ../app/src/main/jniLibs/x86/libpmxe.so -Oz -Wl,--gc-sections -ffunction-sections -fdata-sections -Wl,-x -Wl,-X -fno-exceptions -fno-rtti -Wl,-z,norelro -Wl,--hash-style=gnu -D ANDROID -Wall pmx.c -I /home/vagrant/build/com.mirfatif.permissionmanagerx/native/libcap/libcap/include -Wl,-Bstatic -L /home/vagrant/build/com.mirfatif.permissionmanagerx/native/libcap/libcap -lcap -Wl,-Bdynamic -llog
+ /opt/android-sdk/ndk/22.1.7171670/toolchains/llvm/prebuilt/linux-x86_64/bin/llvm-strip ../app/src/main/jniLibs/x86/libpmxe.so -s -S --strip-unneeded -R=.eh_frame -R=.eh_frame_ptr -R .note.android.ident -R .comment -R .note -R .note.gnu.gold-version -R .note.gnu.build-id -R .note.gnu.property -R .note.ABI-tag
+ cd /home/vagrant/build/com.mirfatif.permissionmanagerx/native/libcap/libcap
+ make --debug=b clean
GNU Make 4.1
Built for x86_64-pc-linux-gnu
Copyright (C) 1988-2014 Free Software Foundation, Inc.
License GPLv3+: GNU GPL version 3 or later <http://gnu.org/licenses/gpl.html>
This is free software: you are free to change and redistribute it.
There is NO WARRANTY, to the extent permitted by law.
Reading makefiles...
Updating goal targets....
 File 'clean' does not exist.
Must remake target 'clean'.
rm -f *~ core
rm -f cap_alloc.o cap_proc.o cap_extint.o cap_flag.o cap_text.o cap_file.o libcap.so* libcap.a libcap.pc
rm -f ../psx/psx.o libpsx.so* libpsx.a libpsx.pc
rm -f cap_names.h cap_names.list.h _makenames _caps_output.gperf cap_test
rm -f include/sys/psx_syscall.h
cd include/sys && rm -f *~ core
Successfully remade target file 'clean'.
+ build_libcap /opt/android-sdk/ndk/22.1.7171670/toolchains/llvm/prebuilt/linux-x86_64/bin/x86_64-linux-android24-clang
+ CC=/opt/android-sdk/ndk/22.1.7171670/toolchains/llvm/prebuilt/linux-x86_64/bin/x86_64-linux-android24-clang
+ cd /home/vagrant/build/com.mirfatif.permissionmanagerx/native/libcap/libcap
+ make --debug=b clean cap_names.h
GNU Make 4.1
Built for x86_64-pc-linux-gnu
Copyright (C) 1988-2014 Free Software Foundation, Inc.
License GPLv3+: GNU GPL version 3 or later <http://gnu.org/licenses/gpl.html>
This is free software: you are free to change and redistribute it.
There is NO WARRANTY, to the extent permitted by law.
Reading makefiles...
Updating goal targets....
 File 'clean' does not exist.
Must remake target 'clean'.
rm -f *~ core
rm -f cap_alloc.o cap_proc.o cap_extint.o cap_flag.o cap_text.o cap_file.o libcap.so* libcap.a libcap.pc
rm -f ../psx/psx.o libpsx.so* libpsx.a libpsx.pc
rm -f cap_names.h cap_names.list.h _makenames _caps_output.gperf cap_test
rm -f include/sys/psx_syscall.h
cd include/sys && rm -f *~ core
Successfully remade target file 'clean'.
 File 'cap_names.h' does not exist.
   File '_makenames' does not exist.
     File 'cap_names.list.h' does not exist.
    Must remake target 'cap_names.list.h'.
=> making cap_names.list.h from /home/vagrant/build/com.mirfatif.permissionmanagerx/native/libcap/libcap/../libcap/include/uapi/linux/capability.h
perl -e 'while ($l=<>) { if ($l =~ /^\#define[ \t](CAP[_A-Z]+)[ \t]+([0-9]+)\s+$/) { $tok=$1; $val=$2; $tok =~ tr/A-Z/a-z/; print "{\"$tok\",$val},\n"; } }' /home/vagrant/build/com.mirfatif.permissionmanagerx/native/libcap/libcap/../libcap/include/uapi/linux/capability.h | fgrep -v 0x > cap_names.list.h
    Successfully remade target file 'cap_names.list.h'.
  Must remake target '_makenames'.
gcc -O2 -D_LARGEFILE64_SOURCE -D_FILE_OFFSET_BITS=64 -fPIC -I/home/vagrant/build/com.mirfatif.permissionmanagerx/native/libcap/libcap/../libcap/include/uapi -I/home/vagrant/build/com.mirfatif.permissionmanagerx/native/libcap/libcap/../libcap/include _makenames.c -o _makenames
  Successfully remade target file '_makenames'.
Must remake target 'cap_names.h'.
./_makenames > cap_names.h
Successfully remade target file 'cap_names.h'.
+ LIBCAP_MAKE_OPTS=
	    -Oz 		-Wall 	    -D_LARGEFILE64_SOURCE -D_FILE_OFFSET_BITS=64 -Dlinux 	    -fPIC 	    -I /home/vagrant/build/com.mirfatif.permissionmanagerx/native/libcap/libcap/include -I /home/vagrant/build/com.mirfatif.permissionmanagerx/native/libcap/libcap/include/uapi
+ set -ex
+ /opt/android-sdk/ndk/22.1.7171670/toolchains/llvm/prebuilt/linux-x86_64/bin/x86_64-linux-android24-clang -Oz -Wall -D_LARGEFILE64_SOURCE -D_FILE_OFFSET_BITS=64 -Dlinux -fPIC -I /home/vagrant/build/com.mirfatif.permissionmanagerx/native/libcap/libcap/include -I /home/vagrant/build/com.mirfatif.permissionmanagerx/native/libcap/libcap/include/uapi -c cap_alloc.c cap_proc.c cap_extint.c cap_flag.c cap_text.c cap_file.c
+ /opt/android-sdk/ndk/22.1.7171670/toolchains/llvm/prebuilt/linux-x86_64/bin/llvm-ar rcs libcap.a cap_alloc.o cap_proc.o cap_extint.o cap_flag.o cap_text.o cap_file.o
+ /opt/android-sdk/ndk/22.1.7171670/toolchains/llvm/prebuilt/linux-x86_64/bin/x86_64-linux-android24-clang -pie -o ../app/src/main/jniLibs/x86_64/libpmxe.so -Oz -Wl,--gc-sections -ffunction-sections -fdata-sections -Wl,-x -Wl,-X -fno-exceptions -fno-rtti -Wl,-z,norelro -Wl,--hash-style=gnu -D ANDROID -Wall pmx.c -I /home/vagrant/build/com.mirfatif.permissionmanagerx/native/libcap/libcap/include -Wl,-Bstatic -L /home/vagrant/build/com.mirfatif.permissionmanagerx/native/libcap/libcap -lcap -Wl,-Bdynamic -llog
+ /opt/android-sdk/ndk/22.1.7171670/toolchains/llvm/prebuilt/linux-x86_64/bin/llvm-strip ../app/src/main/jniLibs/x86_64/libpmxe.so -s -S --strip-unneeded -R=.eh_frame -R=.eh_frame_ptr -R .note.android.ident -R .comment -R .note -R .note.gnu.gold-version -R .note.gnu.build-id -R .note.gnu.property -R .note.ABI-tag
+ cd /home/vagrant/build/com.mirfatif.permissionmanagerx/native/libcap/libcap
+ make --debug=b clean
GNU Make 4.1
Built for x86_64-pc-linux-gnu
Copyright (C) 1988-2014 Free Software Foundation, Inc.
License GPLv3+: GNU GPL version 3 or later <http://gnu.org/licenses/gpl.html>
This is free software: you are free to change and redistribute it.
There is NO WARRANTY, to the extent permitted by law.
Reading makefiles...
Updating goal targets....
 File 'clean' does not exist.
Must remake target 'clean'.
rm -f *~ core
rm -f cap_alloc.o cap_proc.o cap_extint.o cap_flag.o cap_text.o cap_file.o libcap.so* libcap.a libcap.pc
rm -f ../psx/psx.o libpsx.so* libpsx.a libpsx.pc
rm -f cap_names.h cap_names.list.h _makenames _caps_output.gperf cap_test
rm -f include/sys/psx_syscall.h
cd include/sys && rm -f *~ core
Successfully remade target file 'clean'.

> Task :app:verifyGoogleJavaFormat
> Task :AdbLib:packageReleaseRenderscript NO-SOURCE
> Task :AdbLib:writeReleaseAarMetadata
> Task :AdbLib:extractDeepLinksRelease
> Task :AdbLib:prepareLintJarForPublish
> Task :AdbLib:processReleaseJavaRes NO-SOURCE
> Task :AdbLib:bundleLibResRelease NO-SOURCE
> Task :AdbLib:mergeReleaseJniLibFolders
> Task :AdbLib:mergeReleaseNativeLibs NO-SOURCE
> Task :AdbLib:stripReleaseDebugSymbols NO-SOURCE
> Task :AdbLib:copyReleaseJniLibsProjectOnly
> Task :priv_daemon:lintVitalRelease
> Task :AdbLib:mergeReleaseShaders
> Task :AdbLib:compileReleaseShaders NO-SOURCE
> Task :AdbLib:generateReleaseAssets UP-TO-DATE
> Task :AdbLib:packageReleaseAssets
> Task :AdbLib:mergeReleaseGeneratedProguardFiles
> Task :AdbLib:exportReleaseConsumerProguardFiles
> Task :priv_daemon:minifyReleaseWithR8
> Task :AdbLib:bundleLibRuntimeToJarRelease
> Task :priv_daemon:shrinkReleaseRes
> Task :priv_daemon:optimizeReleaseResources
> Task :priv_daemon:packageRelease
> Task :priv_daemon:assembleRelease
> Task :app:buildDaemon
> Task :app:preBuild
> Task :app:extractProguardFiles
> Task :app:preReleaseBuild
> Task :app:compileReleaseAidl NO-SOURCE
> Task :app:compileReleaseRenderscript NO-SOURCE
> Task :app:dataBindingMergeDependencyArtifactsRelease
> Task :app:dataBindingMergeGenClassesRelease
> Task :app:generateReleaseResValues
> Task :app:generateReleaseResources
> Task :app:generateReleaseBuildConfig
> Task :app:mergeReleaseResources
> Task :app:javaPreCompileRelease
> Task :app:dataBindingGenBaseClassesRelease
> Task :app:writeReleaseApplicationId
> Task :app:analyticsRecordingRelease
> Task :app:checkReleaseAarMetadata
> Task :app:createReleaseCompatibleScreenManifests
> Task :app:extractDeepLinksRelease
> Task :app:processReleaseMainManifest
> Task :app:processReleaseManifest
> Task :app:mergeReleaseJniLibFolders
> Task :app:mergeReleaseShaders
> Task :app:compileReleaseShaders NO-SOURCE
> Task :app:generateReleaseAssets UP-TO-DATE
> Task :app:mergeReleaseAssets
> Task :app:compressReleaseAssets
> Task :app:mergeReleaseNativeLibs
> Task :app:checkReleaseDuplicateClasses

> Task :app:stripReleaseDebugSymbols
WARNING:: NDK was located by using ndk.dir property. This method is deprecated and will be removed in a future release. Please delete ndk.dir from local.properties and set android.ndkVersion to [22.1.7171670] in all native modules in the project. https://developer.android.com/r/studio-ui/ndk-dir
NDK was located by using ndk.dir property. This method is deprecated and will be removed in a future release. Please delete ndk.dir from local.properties and set android.ndkVersion to [22.1.7171670] in all native modules in the project. https://developer.android.com/r/studio-ui/ndk-dir

> Task :app:processReleaseJavaRes NO-SOURCE
> Task :app:writeReleaseAppMetadata
> Task :app:writeReleaseSigningConfigVersions
> Task :app:processReleaseManifestForPackage

> Task :app:extractReleaseNativeSymbolTables
WARNING:: NDK was located by using ndk.dir property. This method is deprecated and will be removed in a future release. Please delete ndk.dir from local.properties and set android.ndkVersion to [22.1.7171670] in all native modules in the project. https://developer.android.com/r/studio-ui/ndk-dir
NDK was located by using ndk.dir property. This method is deprecated and will be removed in a future release. Please delete ndk.dir from local.properties and set android.ndkVersion to [22.1.7171670] in all native modules in the project. https://developer.android.com/r/studio-ui/ndk-dir

> Task :app:mergeReleaseNativeDebugMetadata NO-SOURCE
> Task :app:processReleaseResources

> Task :app:compileReleaseJavaWithJavac
/home/vagrant/build/com.mirfatif.permissionmanagerx/app/src/main/java/com/mirfatif/permissionmanagerx/parser/PackageParser.java:734: warning: [deprecation] protectionLevel in PermissionInfo has been deprecated
      int protectionLevel = permissionInfo.protectionLevel & PermissionInfo.PROTECTION_MASK_BASE;
                                          ^
/home/vagrant/build/com.mirfatif.permissionmanagerx/app/src/main/java/com/mirfatif/permissionmanagerx/parser/PackageParser.java:734: warning: [deprecation] PROTECTION_MASK_BASE in PermissionInfo has been deprecated
      int protectionLevel = permissionInfo.protectionLevel & PermissionInfo.PROTECTION_MASK_BASE;
                                                                           ^
/home/vagrant/build/com.mirfatif.permissionmanagerx/app/src/main/java/com/mirfatif/permissionmanagerx/parser/PackageParser.java:735: warning: [deprecation] protectionLevel in PermissionInfo has been deprecated
      int protectionFlags = permissionInfo.protectionLevel & ~PermissionInfo.PROTECTION_MASK_BASE;
                                          ^
/home/vagrant/build/com.mirfatif.permissionmanagerx/app/src/main/java/com/mirfatif/permissionmanagerx/parser/PackageParser.java:735: warning: [deprecation] PROTECTION_MASK_BASE in PermissionInfo has been deprecated
      int protectionFlags = permissionInfo.protectionLevel & ~PermissionInfo.PROTECTION_MASK_BASE;
                                                                            ^
/home/vagrant/build/com.mirfatif.permissionmanagerx/app/src/main/java/com/mirfatif/permissionmanagerx/parser/PackageParser.java:1062: warning: [deprecation] GET_SIGNATURES in PackageManager has been deprecated
  static final int PM_GET_SIGNATURES = PackageManager.GET_SIGNATURES;
                                                     ^
/home/vagrant/build/com.mirfatif.permissionmanagerx/app/src/main/java/com/mirfatif/permissionmanagerx/parser/PackageParser.java:1065: warning: [deprecation] signatures in PackageInfo has been deprecated
    return packageInfo.signatures;
                      ^
/home/vagrant/build/com.mirfatif.permissionmanagerx/app/src/main/java/com/mirfatif/permissionmanagerx/util/Utils.java:552: error: cannot find symbol
      if (!string.substring(start, end).equals("LINK")) {
                 ^
  symbol:   method substring(int,int)
  location: variable string of type SpannableStringBuilder
1 error
6 warnings

> Task :app:compileReleaseJavaWithJavac FAILED

FAILURE: Build failed with an exception.

* What went wrong:
Execution failed for task ':app:compileReleaseJavaWithJavac'.
> Compilation failed; see the compiler error output for details.

* Try:
Run with --stacktrace option to get the stack trace. Run with --info or --debug option to get more log output. Run with --scan to get full insights.

* Get more help at https://help.gradle.org

BUILD FAILED in 55s
124 actionable tasks: 124 executed
==== detail end ====
2021-07-20 15:52:00,844 DEBUG: Error encoutered, stopping by user request.