log for com.roguetemple.hyperroid:12010

== Installed Android Tools ==

2021-06-09 04:59:54,995 DEBUG: Reading 'config.yml'
2021-06-09 04:59:55,004 INFO: Using /opt/android-sdk/build-tools/29.0.3/apksigner 
2021-06-09 04:59:55,006 INFO: Creating log directory
2021-06-09 04:59:55,006 INFO: Creating temporary directory
2021-06-09 04:59:55,007 INFO: Creating output directory
2021-06-09 04:59:55,010 DEBUG: Getting git vcs interface for https://github.com/zenorogue/hyperrogue.git
2021-06-09 04:59:55,011 DEBUG: > git --version
git version 2.11.0
2021-06-09 04:59:55,221 INFO: Using git version 2.11.0
2021-06-09 04:59:55,221 DEBUG: Checking 12.0a
2021-06-09 04:59:55,221 INFO: Building version 12.0a (12010) of com.roguetemple.hyperroid
2021-06-09 04:59:55,222 WARNING: Android NDK version 'r17c' could not be found!
2021-06-09 04:59:55,222 WARNING: Configured versions:
2021-06-09 04:59:55,222 WARNING:   r22b: /opt/android-sdk/ndk/22.1.7171670
2021-06-09 04:59:55,222 WARNING:   r21e: /opt/android-sdk/ndk/21.4.7075529
2021-06-09 04:59:55,223 INFO: Downloading https://dl.google.com/android/repository/android-ndk-r17c-linux-x86_64.zip
2021-06-09 04:59:55,248 DEBUG: Starting new HTTPS connection (1): dl.google.com
2021-06-09 04:59:55,341 DEBUG: https://dl.google.com:443 "GET /android/repository/android-ndk-r17c-linux-x86_64.zip HTTP/1.1" 200 709387703
2021-06-09 05:00:21,755 INFO: Unzipping to /opt/android-sdk/ndk
2021-06-09 05:00:38,522 INFO: Set NDK r17c (17.2.4988734) up
2021-06-09 05:00:38,530 INFO: Running 'sudo' commands in /home/vagrant
2021-06-09 05:00:38,530 DEBUG: > sudo DEBIAN_FRONTEND=noninteractive bash -x -c apt-get update || apt-get update && apt-get install -y g++
+ apt-get update
Hit:1 http://security.debian.org/debian-security stretch/updates InRelease
Ign:2 http://deb.debian.org/debian stretch InRelease
Get:3 http://deb.debian.org/debian stretch-updates InRelease [93.6 kB]
Get:4 http://deb.debian.org/debian stretch-backports-sloppy InRelease [46.7 kB]
Get:5 http://deb.debian.org/debian stretch-backports InRelease [91.8 kB]
Get:6 http://deb.debian.org/debian testing InRelease [150 kB]
Hit:7 http://deb.debian.org/debian stretch Release
Get:8 http://deb.debian.org/debian testing/main amd64 Packages.diff/Index [63.6 kB]
Get:10 http://deb.debian.org/debian testing/main i386 Packages.diff/Index [63.6 kB]
Get:11 http://deb.debian.org/debian testing/main amd64 Packages T-2021-06-09-0201.24-F-2021-06-08-0211.27.pdiff [7,459 B]
Get:11 http://deb.debian.org/debian testing/main amd64 Packages T-2021-06-09-0201.24-F-2021-06-08-0211.27.pdiff [7,459 B]
Get:12 http://deb.debian.org/debian testing/main i386 Packages T-2021-06-09-0201.24-F-2021-06-08-0211.27.pdiff [7,456 B]
Get:12 http://deb.debian.org/debian testing/main i386 Packages T-2021-06-09-0201.24-F-2021-06-08-0211.27.pdiff [7,456 B]
Fetched 524 kB in 8s (63.2 kB/s)
Reading package lists...
+ apt-get install -y g++
Reading package lists...
Building dependency tree...
Reading state information...
The following additional packages will be installed:
  g++-6 libstdc++-6-dev
Suggested packages:
  g++-multilib g++-6-multilib gcc-6-doc libstdc++6-6-dbg libstdc++-6-doc
The following NEW packages will be installed:
  g++ g++-6 libstdc++-6-dev
0 upgraded, 3 newly installed, 0 to remove and 2 not upgraded.
Need to get 8,516 kB of archives.
After this operation, 39.8 MB of additional disk space will be used.
Get:1 http://deb.debian.org/debian stretch/main amd64 libstdc++-6-dev amd64 6.3.0-18+deb9u1 [1,420 kB]
Get:2 http://deb.debian.org/debian stretch/main amd64 g++-6 amd64 6.3.0-18+deb9u1 [7,094 kB]
Get:3 http://deb.debian.org/debian stretch/main amd64 g++ amd64 4:6.3.0-4 [1,546 B]
Fetched 8,516 kB in 0s (55.0 MB/s)
Selecting previously unselected package libstdc++-6-dev:amd64.
(Reading database ... 64892 files and directories currently installed.)
Preparing to unpack .../libstdc++-6-dev_6.3.0-18+deb9u1_amd64.deb ...
Unpacking libstdc++-6-dev:amd64 (6.3.0-18+deb9u1) ...
Selecting previously unselected package g++-6.
Preparing to unpack .../g++-6_6.3.0-18+deb9u1_amd64.deb ...
Unpacking g++-6 (6.3.0-18+deb9u1) ...
Selecting previously unselected package g++.
Preparing to unpack .../g++_4%3a6.3.0-4_amd64.deb ...
Unpacking g++ (4:6.3.0-4) ...
Setting up libstdc++-6-dev:amd64 (6.3.0-18+deb9u1) ...
Setting up g++-6 (6.3.0-18+deb9u1) ...
Setting up g++ (4:6.3.0-4) ...
update-alternatives: using /usr/bin/g++ to provide /usr/bin/c++ (c++) in auto mode
2021-06-09 05:00:57,316 DEBUG: > sudo passwd --lock root
passwd: password expiry information changed.
2021-06-09 05:00:57,524 DEBUG: > sudo SUDO_FORCE_REMOVE=yes dpkg --purge sudo
(Reading database ... 65708 files and directories currently installed.)
Removing sudo (1.8.19p1-2.1+deb9u3) ...
Purging configuration files for sudo (1.8.19p1-2.1+deb9u3) ...
Processing triggers for systemd (232-25+deb9u12) ...
2021-06-09 05:01:02,940 INFO: Getting source for revision v12.0a
2021-06-09 05:01:02,940 DEBUG: Directory: build/com.roguetemple.hyperroid
2021-06-09 05:01:02,941 DEBUG: > git rev-parse --show-toplevel
2021-06-09 05:01:03,144 DEBUG: Directory: build/com.roguetemple.hyperroid
2021-06-09 05:01:03,144 DEBUG: > git submodule foreach --recursive git reset --hard
2021-06-09 05:01:03,551 DEBUG: Directory: build/com.roguetemple.hyperroid
2021-06-09 05:01:03,551 DEBUG: > git submodule foreach --recursive git clean -dffx
2021-06-09 05:01:03,656 DEBUG: Directory: build/com.roguetemple.hyperroid
2021-06-09 05:01:03,657 DEBUG: > git -c core.askpass=/bin/true -c core.sshCommand=/bin/false -c url.https://.insteadOf=ssh:// -c url.https://u:p@bitbucket.org/.insteadOf=git@bitbucket.org: -c url.https://u:p@bitbucket.org.insteadOf=git://bitbucket.org -c url.https://u:p@bitbucket.org.insteadOf=https://bitbucket.org -c url.https://u:p@github.com/.insteadOf=git@github.com: -c url.https://u:p@github.com.insteadOf=git://github.com -c url.https://u:p@github.com.insteadOf=https://github.com -c url.https://u:p@gitlab.com/.insteadOf=git@gitlab.com: -c url.https://u:p@gitlab.com.insteadOf=git://gitlab.com -c url.https://u:p@gitlab.com.insteadOf=https://gitlab.com fetch origin
2021-06-09 05:01:05,175 DEBUG: Directory: build/com.roguetemple.hyperroid
2021-06-09 05:01:05,175 DEBUG: > git -c core.askpass=/bin/true -c core.sshCommand=/bin/false -c url.https://.insteadOf=ssh:// -c url.https://u:p@bitbucket.org/.insteadOf=git@bitbucket.org: -c url.https://u:p@bitbucket.org.insteadOf=git://bitbucket.org -c url.https://u:p@bitbucket.org.insteadOf=https://bitbucket.org -c url.https://u:p@github.com/.insteadOf=git@github.com: -c url.https://u:p@github.com.insteadOf=git://github.com -c url.https://u:p@github.com.insteadOf=https://github.com -c url.https://u:p@gitlab.com/.insteadOf=git@gitlab.com: -c url.https://u:p@gitlab.com.insteadOf=git://gitlab.com -c url.https://u:p@gitlab.com.insteadOf=https://gitlab.com fetch --prune --tags --force origin
2021-06-09 05:01:05,498 DEBUG: Directory: build/com.roguetemple.hyperroid
2021-06-09 05:01:05,498 DEBUG: > git remote set-head origin --auto
2021-06-09 05:01:05,932 DEBUG: Directory: build/com.roguetemple.hyperroid
2021-06-09 05:01:05,932 DEBUG: > git checkout -f v12.0a
2021-06-09 05:01:06,541 DEBUG: Directory: build/com.roguetemple.hyperroid
2021-06-09 05:01:06,542 DEBUG: > git clean -dffx
2021-06-09 05:01:06,646 INFO: Creating local.properties file at build/com.roguetemple.hyperroid/local.properties
2021-06-09 05:01:06,646 INFO: Creating local.properties file at build/com.roguetemple.hyperroid/hyperroid/local.properties
2021-06-09 05:01:06,646 INFO: Creating local.properties file at build/com.roguetemple.hyperroid/hyperroid/app/local.properties
2021-06-09 05:01:06,646 DEBUG: Removing debuggable flags from build/com.roguetemple.hyperroid/hyperroid/app
2021-06-09 05:01:06,658 INFO: Cleaned build.gradle of keysigning configs at build/com.roguetemple.hyperroid/hyperroid/app/build.gradle
2021-06-09 05:01:06,659 INFO: Running 'prebuild' commands in build/com.roguetemple.hyperroid/hyperroid/app
2021-06-09 05:01:06,659 DEBUG: Directory: build/com.roguetemple.hyperroid/hyperroid/app
2021-06-09 05:01:06,659 DEBUG: > bash -x -c -- sed -i -e "s/abiFilters .*/abiFilters 'x86', 'x86_64', 'armeabi-v7a', 'arm64-v8a'/" build.gradle
+ sed -i -e 's/abiFilters .*/abiFilters '\''x86'\'', '\''x86_64'\'', '\''armeabi-v7a'\'', '\''arm64-v8a'\''/' build.gradle
2021-06-09 05:01:06,863 INFO: Cleaning Gradle project...
2021-06-09 05:01:06,864 DEBUG: Directory: build/com.roguetemple.hyperroid/hyperroid/app
2021-06-09 05:01:06,864 DEBUG: > /home/vagrant/fdroidserver/gradlew-fdroid clean
Found 4.9 via distributionUrl
Downloading missing gradle version 4.9
cachedir /home/vagrant/.cache/fdroidserver
/home/vagrant/.cache/fdroidserver/gradle-4.9-bin.zip: OK
Running /opt/gradle/versions/4.9/bin/gradle clean

Welcome to Gradle 4.9!

Here are the highlights of this release:
 - Experimental APIs for creating and configuring tasks lazily
 - Pass arguments to JavaExec via CLI
 - Auxiliary publication dependency support for multi-project builds
 - Improved dependency insight report

For more details see https://docs.gradle.org/4.9/release-notes.html

Download https://maven.google.com/com/android/tools/build/gradle/3.2.0/gradle-3.2.0.pom
Download https://jcenter.bintray.com/org/jetbrains/kotlin/kotlin-stdlib-jre8/1.2.0/kotlin-stdlib-jre8-1.2.0.pom
Download https://jcenter.bintray.com/com/android/tools/build/transform-api/2.0.0-deprecated-use-gradle-api/transform-api-2.0.0-deprecated-use-gradle-api.pom
Download https://jcenter.bintray.com/org/ow2/asm/asm/6.0/asm-6.0.pom
Download https://jcenter.bintray.com/org/ow2/asm/asm-parent/6.0/asm-parent-6.0.pom
Download https://jcenter.bintray.com/org/ow2/ow2/1.3/ow2-1.3.pom
Download https://jcenter.bintray.com/org/ow2/asm/asm-analysis/6.0/asm-analysis-6.0.pom
Download https://jcenter.bintray.com/org/ow2/asm/asm-commons/6.0/asm-commons-6.0.pom
Download https://jcenter.bintray.com/org/ow2/asm/asm-util/6.0/asm-util-6.0.pom
Download https://jcenter.bintray.com/net/sf/jopt-simple/jopt-simple/4.9/jopt-simple-4.9.pom
Download https://jcenter.bintray.com/org/sonatype/oss/oss-parent/7/oss-parent-7.pom
Download https://jcenter.bintray.com/net/sf/proguard/proguard-gradle/6.0.3/proguard-gradle-6.0.3.pom
Download https://jcenter.bintray.com/net/sf/proguard/proguard-parent/6.0.3/proguard-parent-6.0.3.pom
Download https://maven.google.com/com/android/tools/lint/lint-gradle-api/26.2.0/lint-gradle-api-26.2.0.pom
Download https://maven.google.com/androidx/databinding/databinding-compiler-common/3.2.0/databinding-compiler-common-3.2.0.pom
Download https://maven.google.com/com/android/tools/build/builder/3.2.0/builder-3.2.0.pom
Download https://maven.google.com/com/android/tools/analytics-library/shared/26.2.0/shared-26.2.0.pom
Download https://maven.google.com/com/android/tools/build/gradle-api/3.2.0/gradle-api-3.2.0.pom
Download https://maven.google.com/com/android/tools/build/bundletool/0.5.0/bundletool-0.5.0.pom
Download https://maven.google.com/com/android/tools/build/jetifier/jetifier-core/1.0.0-alpha10/jetifier-core-1.0.0-alpha10.pom
Download https://maven.google.com/com/android/tools/build/jetifier/jetifier-processor/1.0.0-alpha10/jetifier-processor-1.0.0-alpha10.pom
Download https://maven.google.com/com/android/tools/analytics-library/crash/26.2.0/crash-26.2.0.pom
Download https://maven.google.com/com/android/tools/build/builder-model/3.2.0/builder-model-3.2.0.pom
Download https://maven.google.com/com/android/tools/common/26.2.0/common-26.2.0.pom
Download https://maven.google.com/com/android/tools/sdklib/26.2.0/sdklib-26.2.0.pom
Download https://maven.google.com/com/android/tools/sdk-common/26.2.0/sdk-common-26.2.0.pom
Download https://maven.google.com/com/android/tools/build/builder-test-api/3.2.0/builder-test-api-3.2.0.pom
Download https://maven.google.com/com/android/tools/build/manifest-merger/26.2.0/manifest-merger-26.2.0.pom
Download https://jcenter.bintray.com/com/squareup/javawriter/2.5.0/javawriter-2.5.0.pom
Download https://jcenter.bintray.com/org/bouncycastle/bcpkix-jdk15on/1.56/bcpkix-jdk15on-1.56.pom
Download https://jcenter.bintray.com/org/ow2/asm/asm-tree/6.0/asm-tree-6.0.pom
Download https://jcenter.bintray.com/org/bouncycastle/bcprov-jdk15on/1.56/bcprov-jdk15on-1.56.pom
Download https://jcenter.bintray.com/it/unimi/dsi/fastutil/7.2.0/fastutil-7.2.0.pom
Download https://jcenter.bintray.com/com/googlecode/json-simple/json-simple/1.1/json-simple-1.1.pom
Download https://maven.google.com/com/android/tools/analytics-library/protos/26.2.0/protos-26.2.0.pom
Download https://maven.google.com/com/android/tools/analytics-library/tracker/26.2.0/tracker-26.2.0.pom
Download https://maven.google.com/com/android/tools/build/apksig/3.2.0/apksig-3.2.0.pom
Download https://maven.google.com/com/android/tools/build/apkzlib/3.2.0/apkzlib-3.2.0.pom
Download https://maven.google.com/com/android/tools/ddms/ddmlib/26.2.0/ddmlib-26.2.0.pom
Download https://jcenter.bintray.com/com/google/code/gson/gson/2.8.0/gson-2.8.0.pom
Download https://jcenter.bintray.com/com/google/guava/guava/23.0/guava-23.0.pom
Download https://jcenter.bintray.com/com/google/guava/guava-parent/23.0/guava-parent-23.0.pom
Download https://jcenter.bintray.com/com/google/code/gson/gson-parent/2.8.0/gson-parent-2.8.0.pom
Download https://maven.google.com/com/android/tools/annotations/26.2.0/annotations-26.2.0.pom
Download https://jcenter.bintray.com/org/apache/httpcomponents/httpclient/4.5.2/httpclient-4.5.2.pom
Download https://jcenter.bintray.com/org/apache/httpcomponents/httpmime/4.5.2/httpmime-4.5.2.pom
Download https://jcenter.bintray.com/org/apache/httpcomponents/httpcore/4.4.5/httpcore-4.4.5.pom
Download https://jcenter.bintray.com/org/apache/httpcomponents/httpcomponents-client/4.5.2/httpcomponents-client-4.5.2.pom
Download https://jcenter.bintray.com/org/apache/httpcomponents/httpcomponents-core/4.4.5/httpcomponents-core-4.4.5.pom
Download https://jcenter.bintray.com/org/apache/httpcomponents/project/7/project-7.pom
Download https://jcenter.bintray.com/org/apache/apache/13/apache-13.pom
Download https://jcenter.bintray.com/org/jetbrains/kotlin/kotlin-reflect/1.2.0/kotlin-reflect-1.2.0.pom
Download https://jcenter.bintray.com/com/googlecode/juniversalchardet/juniversalchardet/1.0.3/juniversalchardet-1.0.3.pom
Download https://jcenter.bintray.com/org/antlr/antlr4/4.5.3/antlr4-4.5.3.pom
Download https://jcenter.bintray.com/com/squareup/javapoet/1.8.0/javapoet-1.8.0.pom
Download https://jcenter.bintray.com/commons-io/commons-io/2.4/commons-io-2.4.pom
Download https://jcenter.bintray.com/org/antlr/antlr4-master/4.5.3/antlr4-master-4.5.3.pom
Download https://jcenter.bintray.com/org/sonatype/oss/oss-parent/9/oss-parent-9.pom
Download https://jcenter.bintray.com/org/apache/commons/commons-parent/25/commons-parent-25.pom
Download https://jcenter.bintray.com/org/apache/apache/9/apache-9.pom
Download https://maven.google.com/com/android/databinding/baseLibrary/3.2.0/baseLibrary-3.2.0.pom
Download https://maven.google.com/androidx/databinding/databinding-common/3.2.0/databinding-common-3.2.0.pom
Download https://jcenter.bintray.com/org/jetbrains/kotlin/kotlin-stdlib-jre7/1.2.0/kotlin-stdlib-jre7-1.2.0.pom
Download https://jcenter.bintray.com/org/jetbrains/kotlin/kotlin-stdlib/1.2.0/kotlin-stdlib-1.2.0.pom
Download https://jcenter.bintray.com/net/sf/proguard/proguard-base/6.0.3/proguard-base-6.0.3.pom
Download https://jcenter.bintray.com/com/google/auto/value/auto-value/1.5.2/auto-value-1.5.2.pom
Download https://jcenter.bintray.com/com/google/errorprone/error_prone_annotations/2.2.0/error_prone_annotations-2.2.0.pom
Download https://jcenter.bintray.com/com/google/protobuf/protobuf-java/3.4.0/protobuf-java-3.4.0.pom
Download https://jcenter.bintray.com/com/google/protobuf/protobuf-java-util/3.4.0/protobuf-java-util-3.4.0.pom
Download https://jcenter.bintray.com/com/google/auto/auto-parent/3/auto-parent-3.pom
Download https://jcenter.bintray.com/com/google/errorprone/error_prone_parent/2.2.0/error_prone_parent-2.2.0.pom
Download https://jcenter.bintray.com/com/google/protobuf/protobuf-parent/3.4.0/protobuf-parent-3.4.0.pom
Download https://jcenter.bintray.com/com/google/google/1/google-1.pom
Download https://maven.google.com/com/android/tools/build/aapt2-proto/0.3.1/aapt2-proto-0.3.1.pom
Download https://jcenter.bintray.com/org/jetbrains/kotlin/kotlin-stdlib/1.2.20/kotlin-stdlib-1.2.20.pom
Download https://jcenter.bintray.com/org/jdom/jdom2/2.0.6/jdom2-2.0.6.pom
Download https://jcenter.bintray.com/org/apache/commons/commons-compress/1.12/commons-compress-1.12.pom
Download https://jcenter.bintray.com/org/apache/commons/commons-parent/39/commons-parent-39.pom
Download https://jcenter.bintray.com/org/apache/apache/16/apache-16.pom
Download https://maven.google.com/com/android/tools/dvlib/26.2.0/dvlib-26.2.0.pom
Download https://maven.google.com/com/android/tools/repository/26.2.0/repository-26.2.0.pom
Download https://maven.google.com/com/android/tools/layoutlib/layoutlib-api/26.2.0/layoutlib-api-26.2.0.pom
Download https://jcenter.bintray.com/javax/inject/javax.inject/1/javax.inject-1.pom
Download https://jcenter.bintray.com/net/sf/kxml/kxml2/2.3.0/kxml2-2.3.0.pom
Download https://jcenter.bintray.com/com/google/code/findbugs/jsr305/1.3.9/jsr305-1.3.9.pom
Download https://jcenter.bintray.com/org/codehaus/mojo/animal-sniffer-annotations/1.14/animal-sniffer-annotations-1.14.pom
Download https://jcenter.bintray.com/com/google/j2objc/j2objc-annotations/1.1/j2objc-annotations-1.1.pom
Download https://jcenter.bintray.com/org/codehaus/mojo/animal-sniffer-parent/1.14/animal-sniffer-parent-1.14.pom
Download https://jcenter.bintray.com/org/codehaus/mojo/mojo-parent/34/mojo-parent-34.pom
Download https://jcenter.bintray.com/org/codehaus/codehaus-parent/4/codehaus-parent-4.pom
Download https://jcenter.bintray.com/commons-logging/commons-logging/1.2/commons-logging-1.2.pom
Download https://jcenter.bintray.com/commons-codec/commons-codec/1.9/commons-codec-1.9.pom
Download https://jcenter.bintray.com/org/apache/commons/commons-parent/34/commons-parent-34.pom
Download https://jcenter.bintray.com/org/apache/commons/commons-parent/32/commons-parent-32.pom
Download https://jcenter.bintray.com/org/jetbrains/annotations/13.0/annotations-13.0.pom
Download https://jcenter.bintray.com/com/google/jimfs/jimfs/1.1/jimfs-1.1.pom
Download https://jcenter.bintray.com/org/glassfish/jaxb/jaxb-runtime/2.2.11/jaxb-runtime-2.2.11.pom
Download https://jcenter.bintray.com/com/sun/activation/javax.activation/1.2.0/javax.activation-1.2.0.pom
Download https://jcenter.bintray.com/com/sun/xml/bind/mvn/jaxb-runtime-parent/2.2.11/jaxb-runtime-parent-2.2.11.pom
Download https://jcenter.bintray.com/com/google/jimfs/jimfs-parent/1.1/jimfs-parent-1.1.pom
Download https://jcenter.bintray.com/com/sun/activation/all/1.2.0/all-1.2.0.pom
Download https://jcenter.bintray.com/com/sun/xml/bind/mvn/jaxb-parent/2.2.11/jaxb-parent-2.2.11.pom
Download https://jcenter.bintray.com/net/java/jvnet-parent/1/jvnet-parent-1.pom
Download https://jcenter.bintray.com/com/sun/xml/bind/jaxb-bom-ext/2.2.11/jaxb-bom-ext-2.2.11.pom
Download https://jcenter.bintray.com/org/glassfish/jaxb/jaxb-bom/2.2.11/jaxb-bom-2.2.11.pom
Download https://jcenter.bintray.com/net/java/jvnet-parent/4/jvnet-parent-4.pom
Download https://jcenter.bintray.com/com/sun/xml/fastinfoset/FastInfoset/1.2.13/FastInfoset-1.2.13.pom
Download https://jcenter.bintray.com/org/jvnet/staxex/stax-ex/1.7.7/stax-ex-1.7.7.pom
Download https://jcenter.bintray.com/org/glassfish/jaxb/jaxb-core/2.2.11/jaxb-core-2.2.11.pom
Download https://jcenter.bintray.com/com/sun/xml/fastinfoset/fastinfoset-project/1.2.13/fastinfoset-project-1.2.13.pom
Download https://jcenter.bintray.com/net/java/jvnet-parent/3/jvnet-parent-3.pom
Download https://jcenter.bintray.com/com/sun/istack/istack-commons-runtime/2.21/istack-commons-runtime-2.21.pom
Download https://jcenter.bintray.com/org/glassfish/jaxb/txw2/2.2.11/txw2-2.2.11.pom
Download https://jcenter.bintray.com/javax/xml/bind/jaxb-api/2.2.12-b140109.1041/jaxb-api-2.2.12-b140109.1041.pom
Download https://jcenter.bintray.com/com/sun/istack/istack-commons/2.21/istack-commons-2.21.pom
Download https://jcenter.bintray.com/com/sun/xml/bind/mvn/jaxb-txw-parent/2.2.11/jaxb-txw-parent-2.2.11.pom
Download https://maven.google.com/com/android/tools/analytics-library/tracker/26.2.0/tracker-26.2.0.jar
Download https://maven.google.com/com/android/tools/lint/lint-gradle-api/26.2.0/lint-gradle-api-26.2.0.jar
Download https://maven.google.com/com/android/tools/analytics-library/crash/26.2.0/crash-26.2.0.jar
Download https://maven.google.com/com/android/tools/analytics-library/shared/26.2.0/shared-26.2.0.jar
Download https://maven.google.com/com/android/tools/build/builder/3.2.0/builder-3.2.0.jar
Download https://maven.google.com/androidx/databinding/databinding-compiler-common/3.2.0/databinding-compiler-common-3.2.0.jar
Download https://maven.google.com/com/android/tools/build/manifest-merger/26.2.0/manifest-merger-26.2.0.jar
Download https://maven.google.com/com/android/tools/build/gradle/3.2.0/gradle-3.2.0.jar
Download https://maven.google.com/com/android/tools/sdk-common/26.2.0/sdk-common-26.2.0.jar
Download https://maven.google.com/com/android/tools/build/builder-test-api/3.2.0/builder-test-api-3.2.0.jar
Download https://maven.google.com/com/android/tools/ddms/ddmlib/26.2.0/ddmlib-26.2.0.jar
Download https://maven.google.com/com/android/tools/sdklib/26.2.0/sdklib-26.2.0.jar
Download https://maven.google.com/com/android/tools/layoutlib/layoutlib-api/26.2.0/layoutlib-api-26.2.0.jar
Download https://maven.google.com/com/android/tools/dvlib/26.2.0/dvlib-26.2.0.jar
Download https://jcenter.bintray.com/org/jetbrains/kotlin/kotlin-stdlib-jre8/1.2.0/kotlin-stdlib-jre8-1.2.0.jar
Download https://maven.google.com/com/android/tools/repository/26.2.0/repository-26.2.0.jar
Download https://jcenter.bintray.com/com/android/tools/build/transform-api/2.0.0-deprecated-use-gradle-api/transform-api-2.0.0-deprecated-use-gradle-api.jar
Download https://maven.google.com/com/android/tools/common/26.2.0/common-26.2.0.jar
Download https://jcenter.bintray.com/org/ow2/asm/asm-analysis/6.0/asm-analysis-6.0.jar
Download https://maven.google.com/com/android/tools/build/jetifier/jetifier-processor/1.0.0-alpha10/jetifier-processor-1.0.0-alpha10.jar
Download https://jcenter.bintray.com/org/ow2/asm/asm-util/6.0/asm-util-6.0.jar
Download https://jcenter.bintray.com/org/ow2/asm/asm-commons/6.0/asm-commons-6.0.jar
Download https://jcenter.bintray.com/org/ow2/asm/asm-tree/6.0/asm-tree-6.0.jar
Download https://jcenter.bintray.com/org/ow2/asm/asm/6.0/asm-6.0.jar
Download https://jcenter.bintray.com/net/sf/proguard/proguard-gradle/6.0.3/proguard-gradle-6.0.3.jar
Download https://jcenter.bintray.com/net/sf/jopt-simple/jopt-simple/4.9/jopt-simple-4.9.jar
Download https://maven.google.com/com/android/tools/build/builder-model/3.2.0/builder-model-3.2.0.jar
Download https://maven.google.com/com/android/tools/build/jetifier/jetifier-core/1.0.0-alpha10/jetifier-core-1.0.0-alpha10.jar
Download https://maven.google.com/com/android/tools/build/bundletool/0.5.0/bundletool-0.5.0.jar
Download https://maven.google.com/com/android/tools/build/apkzlib/3.2.0/apkzlib-3.2.0.jar
Download https://maven.google.com/com/android/tools/analytics-library/protos/26.2.0/protos-26.2.0.jar
Download https://jcenter.bintray.com/com/squareup/javawriter/2.5.0/javawriter-2.5.0.jar
Download https://maven.google.com/com/android/tools/build/apksig/3.2.0/apksig-3.2.0.jar
Download https://jcenter.bintray.com/org/bouncycastle/bcpkix-jdk15on/1.56/bcpkix-jdk15on-1.56.jar
Download https://jcenter.bintray.com/org/bouncycastle/bcprov-jdk15on/1.56/bcprov-jdk15on-1.56.jar
Download https://jcenter.bintray.com/it/unimi/dsi/fastutil/7.2.0/fastutil-7.2.0.jar
Download https://jcenter.bintray.com/com/googlecode/json-simple/json-simple/1.1/json-simple-1.1.jar
Download https://jcenter.bintray.com/com/google/protobuf/protobuf-java-util/3.4.0/protobuf-java-util-3.4.0.jar
Download https://jcenter.bintray.com/com/google/jimfs/jimfs/1.1/jimfs-1.1.jar
Download https://jcenter.bintray.com/com/google/guava/guava/23.0/guava-23.0.jar
Download https://maven.google.com/com/android/tools/annotations/26.2.0/annotations-26.2.0.jar
Download https://jcenter.bintray.com/com/google/code/gson/gson/2.8.0/gson-2.8.0.jar
Download https://jcenter.bintray.com/org/apache/httpcomponents/httpmime/4.5.2/httpmime-4.5.2.jar
Download https://jcenter.bintray.com/org/apache/httpcomponents/httpcore/4.4.5/httpcore-4.4.5.jar
Download https://jcenter.bintray.com/org/apache/httpcomponents/httpclient/4.5.2/httpclient-4.5.2.jar
Download https://jcenter.bintray.com/org/jetbrains/kotlin/kotlin-reflect/1.2.0/kotlin-reflect-1.2.0.jar
Download https://maven.google.com/androidx/databinding/databinding-common/3.2.0/databinding-common-3.2.0.jar
Download https://jcenter.bintray.com/org/antlr/antlr4/4.5.3/antlr4-4.5.3.jar
Download https://maven.google.com/com/android/databinding/baseLibrary/3.2.0/baseLibrary-3.2.0.jar
Download https://jcenter.bintray.com/commons-io/commons-io/2.4/commons-io-2.4.jar
Download https://jcenter.bintray.com/com/googlecode/juniversalchardet/juniversalchardet/1.0.3/juniversalchardet-1.0.3.jar
Download https://jcenter.bintray.com/com/squareup/javapoet/1.8.0/javapoet-1.8.0.jar
Download https://jcenter.bintray.com/net/sf/proguard/proguard-base/6.0.3/proguard-base-6.0.3.jar
Download https://jcenter.bintray.com/org/jetbrains/kotlin/kotlin-stdlib/1.2.20/kotlin-stdlib-1.2.20.jar
Download https://jcenter.bintray.com/org/jetbrains/kotlin/kotlin-stdlib-jre7/1.2.0/kotlin-stdlib-jre7-1.2.0.jar
Download https://jcenter.bintray.com/com/google/auto/value/auto-value/1.5.2/auto-value-1.5.2.jar
Download https://jcenter.bintray.com/com/google/errorprone/error_prone_annotations/2.2.0/error_prone_annotations-2.2.0.jar
Download https://maven.google.com/com/android/tools/build/aapt2-proto/0.3.1/aapt2-proto-0.3.1.jar
Download https://jcenter.bintray.com/org/jdom/jdom2/2.0.6/jdom2-2.0.6.jar
Download https://jcenter.bintray.com/com/google/protobuf/protobuf-java/3.4.0/protobuf-java-3.4.0.jar
Download https://jcenter.bintray.com/org/apache/commons/commons-compress/1.12/commons-compress-1.12.jar
Download https://jcenter.bintray.com/com/google/code/findbugs/jsr305/1.3.9/jsr305-1.3.9.jar
Download https://jcenter.bintray.com/net/sf/kxml/kxml2/2.3.0/kxml2-2.3.0.jar
Download https://jcenter.bintray.com/javax/inject/javax.inject/1/javax.inject-1.jar
Download https://jcenter.bintray.com/com/google/j2objc/j2objc-annotations/1.1/j2objc-annotations-1.1.jar
Download https://jcenter.bintray.com/org/codehaus/mojo/animal-sniffer-annotations/1.14/animal-sniffer-annotations-1.14.jar
Download https://jcenter.bintray.com/org/jetbrains/annotations/13.0/annotations-13.0.jar
Download https://jcenter.bintray.com/commons-logging/commons-logging/1.2/commons-logging-1.2.jar
Download https://jcenter.bintray.com/com/sun/activation/javax.activation/1.2.0/javax.activation-1.2.0.jar
Download https://jcenter.bintray.com/commons-codec/commons-codec/1.9/commons-codec-1.9.jar
Download https://jcenter.bintray.com/org/glassfish/jaxb/jaxb-runtime/2.2.11/jaxb-runtime-2.2.11.jar
Download https://jcenter.bintray.com/org/glassfish/jaxb/jaxb-core/2.2.11/jaxb-core-2.2.11.jar
Download https://jcenter.bintray.com/org/jvnet/staxex/stax-ex/1.7.7/stax-ex-1.7.7.jar
Download https://jcenter.bintray.com/com/sun/xml/fastinfoset/FastInfoset/1.2.13/FastInfoset-1.2.13.jar
Download https://jcenter.bintray.com/org/glassfish/jaxb/txw2/2.2.11/txw2-2.2.11.jar
Download https://jcenter.bintray.com/javax/xml/bind/jaxb-api/2.2.12-b140109.1041/jaxb-api-2.2.12-b140109.1041.jar
Download https://jcenter.bintray.com/com/sun/istack/istack-commons-runtime/2.21/istack-commons-runtime-2.21.jar
Download https://maven.google.com/com/android/tools/build/gradle-api/3.2.0/gradle-api-3.2.0.jar

> Configure project :app
File /home/vagrant/.android/repositories.cfg could not be loaded.
Checking the license for package Android SDK Build-Tools 29.0.1 in /opt/android-sdk/licenses
License for package Android SDK Build-Tools 29.0.1 accepted.
Preparing "Install Android SDK Build-Tools 29.0.1 (revision: 29.0.1)".
"Install Android SDK Build-Tools 29.0.1 (revision: 29.0.1)" ready.
Installing Android SDK Build-Tools 29.0.1 in /opt/android-sdk/build-tools/29.0.1
"Install Android SDK Build-Tools 29.0.1 (revision: 29.0.1)" complete.
"Install Android SDK Build-Tools 29.0.1 (revision: 29.0.1)" finished.
Checking the license for package CMake 3.6.4111459 in /opt/android-sdk/licenses
License for package CMake 3.6.4111459 accepted.
Preparing "Install CMake 3.6.4111459 (revision: 3.6.4111459)".
"Install CMake 3.6.4111459 (revision: 3.6.4111459)" ready.
Installing CMake 3.6.4111459 in /opt/android-sdk/cmake/3.6.4111459
"Install CMake 3.6.4111459 (revision: 3.6.4111459)" complete.
"Install CMake 3.6.4111459 (revision: 3.6.4111459)" finished.

> Task :app:externalNativeBuildCleanDebug
> Task :app:externalNativeBuildCleanRelease
> Task :app:clean UP-TO-DATE

BUILD SUCCESSFUL in 44s
3 actionable tasks: 2 executed, 1 up-to-date
2021-06-09 05:02:12,666 INFO: Scanning source for common problems...
2021-06-09 05:02:12,683 INFO: Removing gradle-wrapper.jar at hyperroid/gradle/wrapper/gradle-wrapper.jar
2021-06-09 05:02:12,688 INFO: Creating source tarball...
2021-06-09 05:02:15,861 INFO: Running 'build' commands in build/com.roguetemple.hyperroid/hyperroid/app
2021-06-09 05:02:15,861 DEBUG: Directory: build/com.roguetemple.hyperroid/hyperroid/app
2021-06-09 05:02:15,861 DEBUG: > bash -x -c pushd .. && bash copy.sh && popd
+ pushd ..
~/build/com.roguetemple.hyperroid/hyperroid ~/build/com.roguetemple.hyperroid/hyperroid/app
+ bash copy.sh
cp: cannot stat '../honeycomb-rules-*.txt': No such file or directory
generating autohdr.h...
g++ -O2 makeh.cpp -o makeh
g++ -O0 -std=c++11 -DLINUX -march=native -fPIC -W -Wall -Wextra -Werror -pedantic -Wno-unused-parameter -Wno-implicit-fallthrough -Wno-maybe-uninitialized -DCAP_GLEW=0 -DCAP_PNG=0    langen.cpp    -o langen
./langen > language-data.cpp
./makeh classes.cpp locations.cpp colors.cpp hyperpoint.cpp geometry.cpp goldberg.cpp init.cpp floorshapes.cpp cell.cpp multi.cpp shmup.cpp pattern2.cpp mapeditor.cpp graph.cpp textures.cpp hprint.cpp language.cpp util.cpp complex.cpp *.cpp > autohdr.h
+ popd
~/build/com.roguetemple.hyperroid/hyperroid/app
2021-06-09 05:02:23,748 INFO: Building Gradle project...
2021-06-09 05:02:23,748 DEBUG: Directory: build/com.roguetemple.hyperroid/hyperroid/app
2021-06-09 05:02:23,749 DEBUG: > /home/vagrant/fdroidserver/gradlew-fdroid assembleRelease
Found 4.9 via distributionUrl
Running /opt/gradle/versions/4.9/bin/gradle assembleRelease
Download https://maven.google.com/com/android/support/support-v4/28.0.0/support-v4-28.0.0.pom
Download https://maven.google.com/com/android/support/support-core-utils/28.0.0/support-core-utils-28.0.0.pom
Download https://maven.google.com/com/android/support/support-fragment/28.0.0/support-fragment-28.0.0.pom
Download https://maven.google.com/com/android/support/support-compat/28.0.0/support-compat-28.0.0.pom
Download https://maven.google.com/com/android/support/support-media-compat/28.0.0/support-media-compat-28.0.0.pom
Download https://maven.google.com/com/android/support/support-core-ui/28.0.0/support-core-ui-28.0.0.pom
Download https://maven.google.com/com/android/support/versionedparcelable/28.0.0/versionedparcelable-28.0.0.pom
Download https://maven.google.com/com/android/support/support-annotations/28.0.0/support-annotations-28.0.0.pom
Download https://maven.google.com/android/arch/lifecycle/runtime/1.1.1/runtime-1.1.1.pom
Download https://maven.google.com/com/android/support/collections/28.0.0/collections-28.0.0.pom
Download https://maven.google.com/com/android/support/documentfile/28.0.0/documentfile-28.0.0.pom
Download https://maven.google.com/com/android/support/localbroadcastmanager/28.0.0/localbroadcastmanager-28.0.0.pom
Download https://maven.google.com/com/android/support/loader/28.0.0/loader-28.0.0.pom
Download https://maven.google.com/com/android/support/print/28.0.0/print-28.0.0.pom
Download https://maven.google.com/com/android/support/customview/28.0.0/customview-28.0.0.pom
Download https://maven.google.com/com/android/support/interpolator/28.0.0/interpolator-28.0.0.pom
Download https://maven.google.com/com/android/support/coordinatorlayout/28.0.0/coordinatorlayout-28.0.0.pom
Download https://maven.google.com/com/android/support/slidingpanelayout/28.0.0/slidingpanelayout-28.0.0.pom
Download https://maven.google.com/com/android/support/viewpager/28.0.0/viewpager-28.0.0.pom
Download https://maven.google.com/com/android/support/swiperefreshlayout/28.0.0/swiperefreshlayout-28.0.0.pom
Download https://maven.google.com/com/android/support/asynclayoutinflater/28.0.0/asynclayoutinflater-28.0.0.pom
Download https://maven.google.com/com/android/support/drawerlayout/28.0.0/drawerlayout-28.0.0.pom
Download https://maven.google.com/com/android/support/cursoradapter/28.0.0/cursoradapter-28.0.0.pom
Download https://maven.google.com/android/arch/lifecycle/viewmodel/1.1.1/viewmodel-1.1.1.pom
Download https://maven.google.com/android/arch/core/common/1.1.1/common-1.1.1.pom
Download https://maven.google.com/android/arch/lifecycle/common/1.1.1/common-1.1.1.pom
Download https://maven.google.com/android/arch/lifecycle/livedata/1.1.1/livedata-1.1.1.pom
Download https://maven.google.com/android/arch/core/runtime/1.1.1/runtime-1.1.1.pom
Download https://maven.google.com/android/arch/lifecycle/livedata-core/1.1.1/livedata-core-1.1.1.pom
Download https://maven.google.com/com/android/support/support-v4/28.0.0/support-v4-28.0.0.aar
Download https://maven.google.com/com/android/support/support-media-compat/28.0.0/support-media-compat-28.0.0.aar
Download https://maven.google.com/com/android/support/support-fragment/28.0.0/support-fragment-28.0.0.aar
Download https://maven.google.com/com/android/support/support-core-ui/28.0.0/support-core-ui-28.0.0.aar
Download https://maven.google.com/com/android/support/support-core-utils/28.0.0/support-core-utils-28.0.0.aar
Download https://maven.google.com/com/android/support/loader/28.0.0/loader-28.0.0.aar
Download https://maven.google.com/com/android/support/coordinatorlayout/28.0.0/coordinatorlayout-28.0.0.aar
Download https://maven.google.com/com/android/support/viewpager/28.0.0/viewpager-28.0.0.aar
Download https://maven.google.com/com/android/support/drawerlayout/28.0.0/drawerlayout-28.0.0.aar
Download https://maven.google.com/com/android/support/slidingpanelayout/28.0.0/slidingpanelayout-28.0.0.aar
Download https://maven.google.com/com/android/support/customview/28.0.0/customview-28.0.0.aar
Download https://maven.google.com/com/android/support/swiperefreshlayout/28.0.0/swiperefreshlayout-28.0.0.aar
Download https://maven.google.com/com/android/support/asynclayoutinflater/28.0.0/asynclayoutinflater-28.0.0.aar
Download https://maven.google.com/com/android/support/support-compat/28.0.0/support-compat-28.0.0.aar
Download https://maven.google.com/android/arch/lifecycle/runtime/1.1.1/runtime-1.1.1.aar
Download https://maven.google.com/com/android/support/collections/28.0.0/collections-28.0.0.jar
Download https://maven.google.com/com/android/support/versionedparcelable/28.0.0/versionedparcelable-28.0.0.aar
Download https://maven.google.com/com/android/support/localbroadcastmanager/28.0.0/localbroadcastmanager-28.0.0.aar
Download https://maven.google.com/com/android/support/documentfile/28.0.0/documentfile-28.0.0.aar
Download https://maven.google.com/com/android/support/interpolator/28.0.0/interpolator-28.0.0.aar
Download https://maven.google.com/com/android/support/print/28.0.0/print-28.0.0.aar
Download https://maven.google.com/com/android/support/cursoradapter/28.0.0/cursoradapter-28.0.0.aar
Download https://maven.google.com/android/arch/lifecycle/viewmodel/1.1.1/viewmodel-1.1.1.aar
Download https://maven.google.com/android/arch/lifecycle/livedata/1.1.1/livedata-1.1.1.aar
Download https://maven.google.com/android/arch/core/runtime/1.1.1/runtime-1.1.1.aar
Download https://maven.google.com/android/arch/lifecycle/livedata-core/1.1.1/livedata-core-1.1.1.aar
Download https://maven.google.com/android/arch/lifecycle/common/1.1.1/common-1.1.1.jar
Download https://maven.google.com/android/arch/core/common/1.1.1/common-1.1.1.jar
Download https://maven.google.com/com/android/support/support-annotations/28.0.0/support-annotations-28.0.0.jar
> Task :app:checkReleaseClasspath
> Task :app:preBuild UP-TO-DATE
> Task :app:preReleaseBuild
> Task :app:compileReleaseAidl NO-SOURCE
> Task :app:compileReleaseRenderscript
> Task :app:checkReleaseManifest
> Task :app:generateReleaseBuildConfig
> Task :app:prepareLintJar
> Task :app:mainApkListPersistenceRelease
> Task :app:generateReleaseResValues
> Task :app:generateReleaseResources
Download https://maven.google.com/com/android/tools/build/aapt2/3.2.0-4818971/aapt2-3.2.0-4818971.pom
Download https://maven.google.com/com/android/tools/build/aapt2/3.2.0-4818971/aapt2-3.2.0-4818971-linux.jar
> Task :app:mergeReleaseResources
> Task :app:createReleaseCompatibleScreenManifests
> Task :app:processReleaseManifest
> Task :app:splitsDiscoveryTaskRelease
> Task :app:processReleaseResources
> Task :app:generateReleaseSources
> Task :app:javaPreCompileRelease

> Task :app:compileReleaseJavaWithJavac
/home/vagrant/build/com.roguetemple.hyperroid/hyperroid/app/src/main/java/com/roguetemple/hyperroid/HyperRogue.java:565: error: cannot find symbol
  if(curland == 61) id = R.raw.mountain; // Lost Mountain
                              ^
  symbol:   variable mountain
  location: class raw
/home/vagrant/build/com.roguetemple.hyperroid/hyperroid/app/src/main/java/com/roguetemple/hyperroid/HyperRogue.java:578: error: cannot find symbol
  if(curland == 74) id = R.raw.hunting; // Hunting Ground
                              ^
  symbol:   variable hunting
  location: class raw
/home/vagrant/build/com.roguetemple.hyperroid/hyperroid/app/src/main/java/com/roguetemple/hyperroid/HyperRogue.java:579: error: cannot find symbol
  if(curland == 75) id = R.raw.hunting; // Terracotta Army
                              ^
  symbol:   variable hunting
  location: class raw
/home/vagrant/build/com.roguetemple.hyperroid/hyperroid/app/src/main/java/com/roguetemple/hyperroid/HyperRogue.java:580: error: cannot find symbol
  if(curland == 76) id = R.raw.hunting; // Terracotta Army
                              ^
  symbol:   variable hunting
  location: class raw
/home/vagrant/build/com.roguetemple.hyperroid/hyperroid/app/src/main/java/com/roguetemple/hyperroid/HyperRogue.java:584: error: cannot find symbol
  if(curland == 80) id = R.raw.mountain; // Ruined City
                              ^
  symbol:   variable mountain
  location: class raw
/home/vagrant/build/com.roguetemple.hyperroid/hyperroid/app/src/main/java/com/roguetemple/hyperroid/HyperRogue.java:591: error: cannot find symbol
  if(curland == 88) id = R.raw.hunting; // Wetland
                              ^
  symbol:   variable hunting
  location: class raw
/home/vagrant/build/com.roguetemple.hyperroid/hyperroid/app/src/main/java/com/roguetemple/hyperroid/HyperRogue.java:593: error: cannot find symbol
  if(curland == 90) id = R.raw.mountain; // Eclectic City
                              ^
  symbol:   variable mountain
  location: class raw
Note: Some input files use or override a deprecated API.
Note: Recompile with -Xlint:deprecation for details.
7 errors

> Task :app:compileReleaseJavaWithJavac FAILED

FAILURE: Build failed with an exception.

* What went wrong:
Execution failed for task ':app:compileReleaseJavaWithJavac'.
> Compilation failed; see the compiler error output for details.

* Try:
Run with --stacktrace option to get the stack trace. Run with --info or --debug option to get more log output. Run with --scan to get full insights.

* Get more help at https://help.gradle.org

BUILD FAILED in 37s
15 actionable tasks: 15 executed
2021-06-09 05:03:01,623 DEBUG: Popen(['git', 'cat-file', '--batch-check'], cwd=/home/vagrant/build/com.roguetemple.hyperroid, universal_newlines=False, shell=None)
2021-06-09 05:03:01,632 ERROR: Could not build app com.roguetemple.hyperroid: Build failed for com.roguetemple.hyperroid:12.0a@7777c7b41553bcd1a8e6745c20a9d0542068069b
==== detail begin ====
Found 4.9 via distributionUrl
Running /opt/gradle/versions/4.9/bin/gradle assembleRelease
Download https://maven.google.com/com/android/support/support-v4/28.0.0/support-v4-28.0.0.pom
Download https://maven.google.com/com/android/support/support-core-utils/28.0.0/support-core-utils-28.0.0.pom
Download https://maven.google.com/com/android/support/support-fragment/28.0.0/support-fragment-28.0.0.pom
Download https://maven.google.com/com/android/support/support-compat/28.0.0/support-compat-28.0.0.pom
Download https://maven.google.com/com/android/support/support-media-compat/28.0.0/support-media-compat-28.0.0.pom
Download https://maven.google.com/com/android/support/support-core-ui/28.0.0/support-core-ui-28.0.0.pom
Download https://maven.google.com/com/android/support/versionedparcelable/28.0.0/versionedparcelable-28.0.0.pom
Download https://maven.google.com/com/android/support/support-annotations/28.0.0/support-annotations-28.0.0.pom
Download https://maven.google.com/android/arch/lifecycle/runtime/1.1.1/runtime-1.1.1.pom
Download https://maven.google.com/com/android/support/collections/28.0.0/collections-28.0.0.pom
Download https://maven.google.com/com/android/support/documentfile/28.0.0/documentfile-28.0.0.pom
Download https://maven.google.com/com/android/support/localbroadcastmanager/28.0.0/localbroadcastmanager-28.0.0.pom
Download https://maven.google.com/com/android/support/loader/28.0.0/loader-28.0.0.pom
Download https://maven.google.com/com/android/support/print/28.0.0/print-28.0.0.pom
Download https://maven.google.com/com/android/support/customview/28.0.0/customview-28.0.0.pom
Download https://maven.google.com/com/android/support/interpolator/28.0.0/interpolator-28.0.0.pom
Download https://maven.google.com/com/android/support/coordinatorlayout/28.0.0/coordinatorlayout-28.0.0.pom
Download https://maven.google.com/com/android/support/slidingpanelayout/28.0.0/slidingpanelayout-28.0.0.pom
Download https://maven.google.com/com/android/support/viewpager/28.0.0/viewpager-28.0.0.pom
Download https://maven.google.com/com/android/support/swiperefreshlayout/28.0.0/swiperefreshlayout-28.0.0.pom
Download https://maven.google.com/com/android/support/asynclayoutinflater/28.0.0/asynclayoutinflater-28.0.0.pom
Download https://maven.google.com/com/android/support/drawerlayout/28.0.0/drawerlayout-28.0.0.pom
Download https://maven.google.com/com/android/support/cursoradapter/28.0.0/cursoradapter-28.0.0.pom
Download https://maven.google.com/android/arch/lifecycle/viewmodel/1.1.1/viewmodel-1.1.1.pom
Download https://maven.google.com/android/arch/core/common/1.1.1/common-1.1.1.pom
Download https://maven.google.com/android/arch/lifecycle/common/1.1.1/common-1.1.1.pom
Download https://maven.google.com/android/arch/lifecycle/livedata/1.1.1/livedata-1.1.1.pom
Download https://maven.google.com/android/arch/core/runtime/1.1.1/runtime-1.1.1.pom
Download https://maven.google.com/android/arch/lifecycle/livedata-core/1.1.1/livedata-core-1.1.1.pom
Download https://maven.google.com/com/android/support/support-v4/28.0.0/support-v4-28.0.0.aar
Download https://maven.google.com/com/android/support/support-media-compat/28.0.0/support-media-compat-28.0.0.aar
Download https://maven.google.com/com/android/support/support-fragment/28.0.0/support-fragment-28.0.0.aar
Download https://maven.google.com/com/android/support/support-core-ui/28.0.0/support-core-ui-28.0.0.aar
Download https://maven.google.com/com/android/support/support-core-utils/28.0.0/support-core-utils-28.0.0.aar
Download https://maven.google.com/com/android/support/loader/28.0.0/loader-28.0.0.aar
Download https://maven.google.com/com/android/support/coordinatorlayout/28.0.0/coordinatorlayout-28.0.0.aar
Download https://maven.google.com/com/android/support/viewpager/28.0.0/viewpager-28.0.0.aar
Download https://maven.google.com/com/android/support/drawerlayout/28.0.0/drawerlayout-28.0.0.aar
Download https://maven.google.com/com/android/support/slidingpanelayout/28.0.0/slidingpanelayout-28.0.0.aar
Download https://maven.google.com/com/android/support/customview/28.0.0/customview-28.0.0.aar
Download https://maven.google.com/com/android/support/swiperefreshlayout/28.0.0/swiperefreshlayout-28.0.0.aar
Download https://maven.google.com/com/android/support/asynclayoutinflater/28.0.0/asynclayoutinflater-28.0.0.aar
Download https://maven.google.com/com/android/support/support-compat/28.0.0/support-compat-28.0.0.aar
Download https://maven.google.com/android/arch/lifecycle/runtime/1.1.1/runtime-1.1.1.aar
Download https://maven.google.com/com/android/support/collections/28.0.0/collections-28.0.0.jar
Download https://maven.google.com/com/android/support/versionedparcelable/28.0.0/versionedparcelable-28.0.0.aar
Download https://maven.google.com/com/android/support/localbroadcastmanager/28.0.0/localbroadcastmanager-28.0.0.aar
Download https://maven.google.com/com/android/support/documentfile/28.0.0/documentfile-28.0.0.aar
Download https://maven.google.com/com/android/support/interpolator/28.0.0/interpolator-28.0.0.aar
Download https://maven.google.com/com/android/support/print/28.0.0/print-28.0.0.aar
Download https://maven.google.com/com/android/support/cursoradapter/28.0.0/cursoradapter-28.0.0.aar
Download https://maven.google.com/android/arch/lifecycle/viewmodel/1.1.1/viewmodel-1.1.1.aar
Download https://maven.google.com/android/arch/lifecycle/livedata/1.1.1/livedata-1.1.1.aar
Download https://maven.google.com/android/arch/core/runtime/1.1.1/runtime-1.1.1.aar
Download https://maven.google.com/android/arch/lifecycle/livedata-core/1.1.1/livedata-core-1.1.1.aar
Download https://maven.google.com/android/arch/lifecycle/common/1.1.1/common-1.1.1.jar
Download https://maven.google.com/android/arch/core/common/1.1.1/common-1.1.1.jar
Download https://maven.google.com/com/android/support/support-annotations/28.0.0/support-annotations-28.0.0.jar
> Task :app:checkReleaseClasspath
> Task :app:preBuild UP-TO-DATE
> Task :app:preReleaseBuild
> Task :app:compileReleaseAidl NO-SOURCE
> Task :app:compileReleaseRenderscript
> Task :app:checkReleaseManifest
> Task :app:generateReleaseBuildConfig
> Task :app:prepareLintJar
> Task :app:mainApkListPersistenceRelease
> Task :app:generateReleaseResValues
> Task :app:generateReleaseResources
Download https://maven.google.com/com/android/tools/build/aapt2/3.2.0-4818971/aapt2-3.2.0-4818971.pom
Download https://maven.google.com/com/android/tools/build/aapt2/3.2.0-4818971/aapt2-3.2.0-4818971-linux.jar
> Task :app:mergeReleaseResources
> Task :app:createReleaseCompatibleScreenManifests
> Task :app:processReleaseManifest
> Task :app:splitsDiscoveryTaskRelease
> Task :app:processReleaseResources
> Task :app:generateReleaseSources
> Task :app:javaPreCompileRelease

> Task :app:compileReleaseJavaWithJavac
/home/vagrant/build/com.roguetemple.hyperroid/hyperroid/app/src/main/java/com/roguetemple/hyperroid/HyperRogue.java:565: error: cannot find symbol
  if(curland == 61) id = R.raw.mountain; // Lost Mountain
                              ^
  symbol:   variable mountain
  location: class raw
/home/vagrant/build/com.roguetemple.hyperroid/hyperroid/app/src/main/java/com/roguetemple/hyperroid/HyperRogue.java:578: error: cannot find symbol
  if(curland == 74) id = R.raw.hunting; // Hunting Ground
                              ^
  symbol:   variable hunting
  location: class raw
/home/vagrant/build/com.roguetemple.hyperroid/hyperroid/app/src/main/java/com/roguetemple/hyperroid/HyperRogue.java:579: error: cannot find symbol
  if(curland == 75) id = R.raw.hunting; // Terracotta Army
                              ^
  symbol:   variable hunting
  location: class raw
/home/vagrant/build/com.roguetemple.hyperroid/hyperroid/app/src/main/java/com/roguetemple/hyperroid/HyperRogue.java:580: error: cannot find symbol
  if(curland == 76) id = R.raw.hunting; // Terracotta Army
                              ^
  symbol:   variable hunting
  location: class raw
/home/vagrant/build/com.roguetemple.hyperroid/hyperroid/app/src/main/java/com/roguetemple/hyperroid/HyperRogue.java:584: error: cannot find symbol
  if(curland == 80) id = R.raw.mountain; // Ruined City
                              ^
  symbol:   variable mountain
  location: class raw
/home/vagrant/build/com.roguetemple.hyperroid/hyperroid/app/src/main/java/com/roguetemple/hyperroid/HyperRogue.java:591: error: cannot find symbol
  if(curland == 88) id = R.raw.hunting; // Wetland
                              ^
  symbol:   variable hunting
  location: class raw
/home/vagrant/build/com.roguetemple.hyperroid/hyperroid/app/src/main/java/com/roguetemple/hyperroid/HyperRogue.java:593: error: cannot find symbol
  if(curland == 90) id = R.raw.mountain; // Eclectic City
                              ^
  symbol:   variable mountain
  location: class raw
Note: Some input files use or override a deprecated API.
Note: Recompile with -Xlint:deprecation for details.
7 errors

> Task :app:compileReleaseJavaWithJavac FAILED

FAILURE: Build failed with an exception.

* What went wrong:
Execution failed for task ':app:compileReleaseJavaWithJavac'.
> Compilation failed; see the compiler error output for details.

* Try:
Run with --stacktrace option to get the stack trace. Run with --info or --debug option to get more log output. Run with --scan to get full insights.

* Get more help at https://help.gradle.org

BUILD FAILED in 37s
15 actionable tasks: 15 executed
==== detail end ====
2021-06-09 05:03:01,641 DEBUG: Error encoutered, stopping by user request.