log for com.vishnuraghav.EnRecipes:1

== Installed Android Tools ==

2021-07-27 01:32:30,306 DEBUG: Reading 'config.yml'
2021-07-27 01:32:30,316 INFO: Using /opt/android-sdk/build-tools/29.0.3/apksigner 
2021-07-27 01:32:30,318 INFO: Creating log directory
2021-07-27 01:32:30,318 INFO: Creating temporary directory
2021-07-27 01:32:30,319 INFO: Creating output directory
2021-07-27 01:32:30,322 DEBUG: Getting git vcs interface for https://github.com/vishnuraghavb/EnRecipes.git
2021-07-27 01:32:30,322 DEBUG: > git --version
git version 2.11.0
2021-07-27 01:32:30,617 INFO: Using git version 2.11.0
2021-07-27 01:32:30,618 DEBUG: Checking 2.0.0
2021-07-27 01:32:30,618 INFO: Building version 2.0.0 (1) of com.vishnuraghav.EnRecipes
2021-07-27 01:32:30,619 WARNING: Android NDK version 'r20b' could not be found!
2021-07-27 01:32:30,619 WARNING: Configured versions:
2021-07-27 01:32:30,619 WARNING:   r22b: /opt/android-sdk/ndk/22.1.7171670
2021-07-27 01:32:30,620 WARNING:   r21e: /opt/android-sdk/ndk/21.4.7075529
2021-07-27 01:32:30,622 INFO: Downloading https://dl.google.com/android/repository/android-ndk-r20b-linux-x86_64.zip
2021-07-27 01:32:30,647 DEBUG: Starting new HTTPS connection (1): dl.google.com
2021-07-27 01:32:30,776 DEBUG: https://dl.google.com:443 "GET /android/repository/android-ndk-r20b-linux-x86_64.zip HTTP/1.1" 200 859780564
2021-07-27 01:32:57,605 INFO: Unzipping to /opt/android-sdk/ndk
2021-07-27 01:33:17,822 INFO: Set NDK r20b (20.1.5948944) up
2021-07-27 01:33:17,828 INFO: Running 'sudo' commands in /home/vagrant
2021-07-27 01:33:17,828 DEBUG: > sudo DEBIAN_FRONTEND=noninteractive bash -x -c rm -rf "$(find /opt/android-sdk/ndk -maxdepth 1 -type d \( ! -name ndk \) \( ! -name 20.1.5948944 \) -print)" && apt-get update || apt-get update && apt-get install -y lib32z1 && curl -Lo node.tar.gz https://nodejs.org/dist/v10.23.1/node-v10.23.1-linux-x64.tar.gz && echo "2a5f9d862468a4c677630923531e52339526cfd075cc6df30da4636782eb7bda node.tar.gz" | sha256sum -c - && tar xzf node.tar.gz && cp -a node-v10.23.1-linux-x64/. /usr/local/ && npm -g install nativescript && sed -i 's/: ".\/gradlew"\;/: "\/home\/vagrant\/fdroidserver\/gradlew-fdroid"\;/' /usr/local/lib/node_modules/nativescript/lib/services/android/gradle-command-service.js
++ find /opt/android-sdk/ndk -maxdepth 1 -type d '(' '!' -name ndk ')' '(' '!' -name 20.1.5948944 ')' -print
+ rm -rf '/opt/android-sdk/ndk/22.1.7171670
/opt/android-sdk/ndk/21.4.7075529'
+ apt-get update
Ign:1 http://deb.debian.org/debian stretch InRelease
Hit:2 http://security.debian.org/debian-security stretch/updates InRelease
Get:3 http://deb.debian.org/debian stretch-updates InRelease [93.6 kB]
Get:4 http://deb.debian.org/debian stretch-backports-sloppy InRelease [46.7 kB]
Get:5 http://deb.debian.org/debian stretch-backports InRelease [91.8 kB]
Get:6 http://deb.debian.org/debian testing InRelease [150 kB]
Hit:7 http://deb.debian.org/debian stretch Release
Get:8 http://deb.debian.org/debian testing/main amd64 Packages.diff/Index [63.6 kB]
Get:10 http://deb.debian.org/debian testing/main i386 Packages.diff/Index [63.6 kB]
Get:11 http://deb.debian.org/debian testing/main amd64 Packages T-2021-07-26-2001.35-F-2021-07-26-2001.35.pdiff [259 B]
Get:11 http://deb.debian.org/debian testing/main amd64 Packages T-2021-07-26-2001.35-F-2021-07-26-2001.35.pdiff [259 B]
Get:12 http://deb.debian.org/debian testing/main i386 Packages T-2021-07-26-2001.35-F-2021-07-26-2001.35.pdiff [256 B]
Get:12 http://deb.debian.org/debian testing/main i386 Packages T-2021-07-26-2001.35-F-2021-07-26-2001.35.pdiff [256 B]
Fetched 510 kB in 4s (126 kB/s)
Reading package lists...
+ apt-get install -y lib32z1
Reading package lists...
Building dependency tree...
Reading state information...
The following additional packages will be installed:
  libc6-i386
The following NEW packages will be installed:
  lib32z1 libc6-i386
0 upgraded, 2 newly installed, 0 to remove and 2 not upgraded.
Need to get 2,685 kB of archives.
After this operation, 11.7 MB of additional disk space will be used.
Get:1 http://deb.debian.org/debian stretch/main amd64 libc6-i386 amd64 2.24-11+deb9u4 [2,597 kB]
Get:2 http://deb.debian.org/debian stretch/main amd64 lib32z1 amd64 1:1.2.8.dfsg-5 [88.6 kB]
Fetched 2,685 kB in 0s (36.3 MB/s)
Selecting previously unselected package libc6-i386.
(Reading database ... 64892 files and directories currently installed.)
Preparing to unpack .../libc6-i386_2.24-11+deb9u4_amd64.deb ...
Unpacking libc6-i386 (2.24-11+deb9u4) ...
Replaced by files in installed package libc6:i386 (2.24-11+deb9u4) ...
Selecting previously unselected package lib32z1.
Preparing to unpack .../lib32z1_1%3a1.2.8.dfsg-5_amd64.deb ...
Unpacking lib32z1 (1:1.2.8.dfsg-5) ...
Setting up libc6-i386 (2.24-11+deb9u4) ...
Processing triggers for libc-bin (2.24-11+deb9u4) ...
Setting up lib32z1 (1:1.2.8.dfsg-5) ...
Processing triggers for libc-bin (2.24-11+deb9u4) ...
+ curl -Lo node.tar.gz https://nodejs.org/dist/v10.23.1/node-v10.23.1-linux-x64.tar.gz
  % Total    % Received % Xferd  Average Speed   Time    Time     Time  Current
                                 Dload  Upload   Total   Spent    Left  Speed

  0     0    0     0    0     0      0      0 --:--:-- --:--:-- --:--:--     0
 66 19.9M   66 13.2M    0     0  52.3M      0 --:--:-- --:--:-- --:--:-- 52.2M
100 19.9M  100 19.9M    0     0  62.1M      0 --:--:-- --:--:-- --:--:-- 61.9M
+ echo '2a5f9d862468a4c677630923531e52339526cfd075cc6df30da4636782eb7bda node.tar.gz'
+ sha256sum -c -
node.tar.gz: OK
+ tar xzf node.tar.gz
+ cp -a node-v10.23.1-linux-x64/. /usr/local/
+ npm -g install nativescript
npm WARN deprecated request@2.88.2: request has been deprecated, see https://github.com/request/request/issues/3142
npm WARN deprecated xmldom@0.3.0: Deprecated due to CVE-2021-21366 resolved in 0.5.0
npm WARN deprecated fsevents@2.1.3: "Please update to latest v2.3 or v2.2"
npm WARN deprecated node-uuid@1.4.7: Use uuid module instead
npm WARN deprecated xmldom@0.1.31: Deprecated due to CVE-2021-21366 resolved in 0.5.0
npm WARN deprecated uuid@3.4.0: Please upgrade  to version 7 or higher.  Older versions may use Math.random() in certain circumstances, which is known to be problematic.  See https://v8.dev/blog/math-random for details.
npm WARN deprecated axios@0.18.0: Critical security vulnerability fixed in v0.21.1. For more information, see https://github.com/axios/axios/pull/3410
npm WARN deprecated socks@1.1.10: If using 2.x branch, please upgrade to at least 2.1.6 to avoid a serious bug with socket data flow and an import issue introduced in 2.1.0
npm WARN deprecated har-validator@5.1.5: this library is no longer supported
/usr/local/bin/tns -> /usr/local/lib/node_modules/nativescript/bin/tns
/usr/local/bin/nativescript -> /usr/local/lib/node_modules/nativescript/bin/tns
/usr/local/bin/nsc -> /usr/local/lib/node_modules/nativescript/bin/tns
/usr/local/bin/ns -> /usr/local/lib/node_modules/nativescript/bin/tns

> nativescript@8.0.2 postinstall /usr/local/lib/node_modules/nativescript
> node postinstall.js

Error: EACCES: permission denied, open '/root/.npmrc'
    at Object.openSync (fs.js:443:3)
    at Object.readFileSync (fs.js:343:35)
    at maybeReadIni (/usr/local/lib/node_modules/nativescript/node_modules/libnpmconfig/index.js:81:14)
    at Object.getNpmConfig [as read] (/usr/local/lib/node_modules/nativescript/node_modules/libnpmconfig/index.js:43:32)
    at NpmConfigService.readConfig (/usr/local/lib/node_modules/nativescript/lib/services/npm-config-service.js:15:32)
    at new NpmConfigService (/usr/local/lib/node_modules/nativescript/lib/services/npm-config-service.js:9:14)
    at Yok.resolveConstructor (/usr/local/lib/node_modules/nativescript/lib/common/yok.js:313:20)
    at Yok.resolveByName (/usr/local/lib/node_modules/nativescript/lib/common/yok.js:343:33)
    at Yok.resolve (/usr/local/lib/node_modules/nativescript/lib/common/yok.js:278:25)
    at ctor.$inject.args.map (/usr/local/lib/node_modules/nativescript/lib/common/yok.js:308:29)
Error while reporting exception: Exception: Unable to create directory /root/.local/share/.nativescript-cli. 
Error is: Error: EACCES: permission denied, mkdir '/root/.local/share/.nativescript-cli'.

You may need to call the command with 'sudo'.
npm WARN optional SKIPPING OPTIONAL DEPENDENCY: fsevents@~2.1.2 (node_modules/nativescript/node_modules/chokidar/node_modules/fsevents):
npm WARN notsup SKIPPING OPTIONAL DEPENDENCY: Unsupported platform for fsevents@2.1.3: wanted {"os":"darwin","arch":"any"} (current: {"os":"linux","arch":"x64"})
npm WARN marked-terminal@3.1.1 requires a peer of marked@^0.4.0 || ^0.5.0 but none is installed. You must install peer dependencies yourself.

+ nativescript@8.0.2
added 622 packages from 442 contributors in 35.073s
+ sed -i 's/: ".\/gradlew"\;/: "\/home\/vagrant\/fdroidserver\/gradlew-fdroid"\;/' /usr/local/lib/node_modules/nativescript/lib/services/android/gradle-command-service.js
2021-07-27 01:34:11,584 DEBUG: > sudo passwd --lock root
passwd: password expiry information changed.
2021-07-27 01:34:11,865 DEBUG: > sudo SUDO_FORCE_REMOVE=yes dpkg --purge sudo
(Reading database ... 65205 files and directories currently installed.)
Removing sudo (1.8.19p1-2.1+deb9u3) ...
Purging configuration files for sudo (1.8.19p1-2.1+deb9u3) ...
Processing triggers for systemd (232-25+deb9u13) ...
2021-07-27 01:34:45,089 INFO: Getting source for revision v2.0.0
2021-07-27 01:34:45,090 DEBUG: Directory: build/com.vishnuraghav.EnRecipes
2021-07-27 01:34:45,090 DEBUG: > git rev-parse --show-toplevel
2021-07-27 01:34:45,295 DEBUG: Directory: build/com.vishnuraghav.EnRecipes
2021-07-27 01:34:45,295 DEBUG: > git submodule foreach --recursive git reset --hard
2021-07-27 01:34:45,502 DEBUG: Directory: build/com.vishnuraghav.EnRecipes
2021-07-27 01:34:45,502 DEBUG: > git reset --hard
2021-07-27 01:34:45,839 DEBUG: Directory: build/com.vishnuraghav.EnRecipes
2021-07-27 01:34:45,839 DEBUG: > git submodule foreach --recursive git clean -dffx
2021-07-27 01:34:45,949 DEBUG: Directory: build/com.vishnuraghav.EnRecipes
2021-07-27 01:34:45,949 DEBUG: > git clean -dffx
2021-07-27 01:34:46,178 DEBUG: Directory: build/com.vishnuraghav.EnRecipes
2021-07-27 01:34:46,178 DEBUG: > git -c core.askpass=/bin/true -c core.sshCommand=/bin/false -c url.https://.insteadOf=ssh:// -c url.https://u:p@bitbucket.org/.insteadOf=git@bitbucket.org: -c url.https://u:p@bitbucket.org.insteadOf=git://bitbucket.org -c url.https://u:p@bitbucket.org.insteadOf=https://bitbucket.org -c url.https://u:p@github.com/.insteadOf=git@github.com: -c url.https://u:p@github.com.insteadOf=git://github.com -c url.https://u:p@github.com.insteadOf=https://github.com -c url.https://u:p@gitlab.com/.insteadOf=git@gitlab.com: -c url.https://u:p@gitlab.com.insteadOf=git://gitlab.com -c url.https://u:p@gitlab.com.insteadOf=https://gitlab.com fetch origin
2021-07-27 01:34:47,106 DEBUG: Directory: build/com.vishnuraghav.EnRecipes
2021-07-27 01:34:47,106 DEBUG: > git -c core.askpass=/bin/true -c core.sshCommand=/bin/false -c url.https://.insteadOf=ssh:// -c url.https://u:p@bitbucket.org/.insteadOf=git@bitbucket.org: -c url.https://u:p@bitbucket.org.insteadOf=git://bitbucket.org -c url.https://u:p@bitbucket.org.insteadOf=https://bitbucket.org -c url.https://u:p@github.com/.insteadOf=git@github.com: -c url.https://u:p@github.com.insteadOf=git://github.com -c url.https://u:p@github.com.insteadOf=https://github.com -c url.https://u:p@gitlab.com/.insteadOf=git@gitlab.com: -c url.https://u:p@gitlab.com.insteadOf=git://gitlab.com -c url.https://u:p@gitlab.com.insteadOf=https://gitlab.com fetch --prune --tags --force origin
2021-07-27 01:34:47,412 DEBUG: Directory: build/com.vishnuraghav.EnRecipes
2021-07-27 01:34:47,412 DEBUG: > git remote set-head origin --auto
2021-07-27 01:34:47,821 DEBUG: Directory: build/com.vishnuraghav.EnRecipes
2021-07-27 01:34:47,821 DEBUG: > git checkout -f v2.0.0
2021-07-27 01:34:48,030 DEBUG: Directory: build/com.vishnuraghav.EnRecipes
2021-07-27 01:34:48,030 DEBUG: > git clean -dffx
2021-07-27 01:34:48,138 INFO: Running 'init' commands in build/com.vishnuraghav.EnRecipes
2021-07-27 01:34:48,139 DEBUG: Directory: build/com.vishnuraghav.EnRecipes
2021-07-27 01:34:48,139 DEBUG: > bash -x -c -- /opt/android-sdk/tools/bin/sdkmanager "platforms;android-30" "build-tools;30.0.3" > /dev/null && npm install --unsafe-perm
+ /opt/android-sdk/tools/bin/sdkmanager 'platforms;android-30' 'build-tools;30.0.3'
Warning: File /home/vagrant/.android/repositories.cfg could not be loaded.
+ npm install --unsafe-perm
npm WARN read-shrinkwrap This version of npm is compatible with lockfileVersion@1, but package-lock.json was generated for lockfileVersion@2. I'll try to do my best with it!

> @nativescript/core@8.0.8 postinstall /home/vagrant/build/com.vishnuraghav.EnRecipes/node_modules/@nativescript/core
> node cli-hooks/postinstall.js


> @nativescript/localize@5.0.4 postinstall /home/vagrant/build/com.vishnuraghav.EnRecipes/node_modules/@nativescript/localize
> node postinstall

npm WARN optional SKIPPING OPTIONAL DEPENDENCY: fsevents@2.3.2 (node_modules/fsevents):
npm WARN notsup SKIPPING OPTIONAL DEPENDENCY: Unsupported platform for fsevents@2.3.2: wanted {"os":"darwin","arch":"any"} (current: {"os":"linux","arch":"x64"})

added 421 packages from 312 contributors and audited 424 packages in 13.912s

39 packages are looking for funding
  run `npm fund` for details

found 0 vulnerabilities

2021-07-27 01:35:23,628 INFO: Collecting source libraries
2021-07-27 01:35:23,656 DEBUG: Removing debuggable flags from build/srclib/NativeScript_android-runtime
2021-07-27 01:35:23,667 DEBUG: Directory: build/srclib/NativeScript_android-runtime
2021-07-27 01:35:23,667 DEBUG: > bash -x -c -- git submodule update --init --recursive
rm -rf test-app/build-tools/android-metadata-generator/jars
rm test-app/build-tools/android-metadata-generator/src/libs/dx.jar

+ git submodule update --init --recursive
Submodule 'test-app/app/src/main/assets/app/shared' (https://github.com/NativeScript/common-runtime-tests-app.git) registered for path 'test-app/app/src/main/assets/app/shared'
Submodule 'test-app/app/src/main/assets/app/tns_modules/tns-core-modules/shared' (https://github.com/NativeScript/common-runtime-tests-modules.git) registered for path 'test-app/app/src/main/assets/app/tns_modules/tns-core-modules/shared'
Submodule 'test-app/build-tools/android-dts-generator' (https://github.com/NativeScript/android-dts-generator.git) registered for path 'test-app/build-tools/android-dts-generator'
Cloning into '/home/vagrant/build/srclib/NativeScript_android-runtime/test-app/app/src/main/assets/app/shared'...
Cloning into '/home/vagrant/build/srclib/NativeScript_android-runtime/test-app/app/src/main/assets/app/tns_modules/tns-core-modules/shared'...
Cloning into '/home/vagrant/build/srclib/NativeScript_android-runtime/test-app/build-tools/android-dts-generator'...
Submodule path 'test-app/app/src/main/assets/app/shared': checked out '79a384c6dd1c34f018ac3d42acfde6d759b7bc66'
Submodule path 'test-app/app/src/main/assets/app/tns_modules/tns-core-modules/shared': checked out '52e6736e080fc93764c1c087840779ffd7f16f49'
Submodule path 'test-app/build-tools/android-dts-generator': checked out '266adcb3e4a11c74d0e94373000acc117f4b9033'
+ rm -rf test-app/build-tools/android-metadata-generator/jars
+ rm test-app/build-tools/android-metadata-generator/src/libs/dx.jar
2021-07-27 01:35:26,319 DEBUG: Removing debuggable flags from build/srclib/NativeScript_NativeScript
2021-07-27 01:35:26,330 DEBUG: Directory: build/srclib/NativeScript_NativeScript
2021-07-27 01:35:26,330 DEBUG: > bash -x -c -- cd packages/ui-mobile-base/android/widgets
rm -rf gradle
sed -i s/\<\</doLast/ build.gradle

+ cd packages/ui-mobile-base/android/widgets
+ rm -rf gradle
+ sed -i 's/<</doLast/' build.gradle
2021-07-27 01:35:26,535 INFO: Creating local.properties file at build/com.vishnuraghav.EnRecipes/local.properties
2021-07-27 01:35:26,536 DEBUG: Removing debuggable flags from build/com.vishnuraghav.EnRecipes
2021-07-27 01:35:26,633 INFO: Cleaned build.gradle of keysigning configs at build/com.vishnuraghav.EnRecipes/node_modules/@nativescript/android/framework/app/build.gradle
2021-07-27 01:35:26,704 INFO: Scanning source for common problems...
2021-07-27 01:35:26,883 WARNING: Found executable binary, possibly code at node_modules/bplist-parser/test/utf16_chinese.plist
2021-07-27 01:35:26,900 INFO: Removing Android AAR library at node_modules/@akylas/nativescript-sqlite/platforms/android/nativescript_akylas_sqlite.aar
2021-07-27 01:35:26,900 INFO: Removing Android AAR library at node_modules/@akylas/nativescript-sqlite/platforms/android/nativescript_sqlite.aar
2021-07-27 01:35:26,901 INFO: Removing Android AAR library at node_modules/@akylas/nativescript-sqlite/platforms/android/nativescript_mtmobile_sqlite.aar
2021-07-27 01:35:26,952 INFO: Removing Android AAR library at node_modules/nativescript-imagecropper/platforms/android/nativescript_imagecropper.aar
2021-07-27 01:35:26,997 INFO: Removing binary at node_modules/@nativescript/core/platforms/ios/TNSWidgets.xcframework/ios-arm64/TNSWidgets.framework/TNSWidgets
2021-07-27 01:35:26,998 INFO: Removing binary at node_modules/@nativescript/core/platforms/ios/TNSWidgets.xcframework/ios-arm64/dSYMs/TNSWidgets.framework.dSYM/Contents/Resources/DWARF/TNSWidgets
2021-07-27 01:35:26,998 INFO: Removing binary at node_modules/@nativescript/core/platforms/ios/TNSWidgets.xcframework/ios-arm64_x86_64-simulator/TNSWidgets.framework/TNSWidgets
2021-07-27 01:35:27,000 INFO: Removing binary at node_modules/@nativescript/core/platforms/ios/TNSWidgets.xcframework/ios-arm64_x86_64-simulator/dSYMs/TNSWidgets.framework.dSYM/Contents/Resources/DWARF/TNSWidgets
2021-07-27 01:35:27,000 INFO: Removing Android AAR library at node_modules/@nativescript/core/platforms/android/widgets-release.aar
2021-07-27 01:35:27,011 INFO: Removing gradle-wrapper.jar at node_modules/@nativescript/android/framework/gradle/wrapper/gradle-wrapper.jar
2021-07-27 01:35:27,020 INFO: Removing Android AAR library at node_modules/@nativescript/android/framework/app/libs/runtime-libs/nativescript-regular.aar
2021-07-27 01:35:27,024 INFO: Removing Android AAR library at node_modules/@nativescript/android/framework/app/libs/runtime-libs/nativescript-optimized.aar
2021-07-27 01:35:27,027 INFO: Removing Android AAR library at node_modules/@nativescript/android/framework/app/libs/runtime-libs/nativescript-optimized-with-inspector.aar
2021-07-27 01:35:27,035 INFO: Removing Java JAR file at node_modules/@nativescript/android/framework/build-tools/static-binding-generator.jar
2021-07-27 01:35:27,037 INFO: Removing Java JAR file at node_modules/@nativescript/android/framework/build-tools/dts-generator.jar
2021-07-27 01:35:27,038 INFO: Removing Java JAR file at node_modules/@nativescript/android/framework/build-tools/android-metadata-generator.jar
2021-07-27 01:35:27,199 INFO: Creating source tarball...
2021-07-27 01:35:41,868 INFO: Running 'build' commands in build/com.vishnuraghav.EnRecipes
2021-07-27 01:35:41,868 DEBUG: Directory: build/com.vishnuraghav.EnRecipes
2021-07-27 01:35:41,869 DEBUG: > bash -x -c pushd /home/vagrant/build/srclib/NativeScript_NativeScript/packages/ui-mobile-base/android/widgets && gradle assembleRelease && popd && mkdir -p node_modules/@nativescript/core/platforms/android && cp /home/vagrant/build/srclib/NativeScript_NativeScript/packages/ui-mobile-base/android/widgets/build/outputs/aar/widgets-release.aar node_modules/@nativescript/core/platforms/android/widgets-release.aar && rm -rf /home/vagrant/build/srclib/NativeScript_NativeScript && pushd /home/vagrant/build/srclib/NativeScript_android-runtime && export JAVA_HOME=$(readlink -f /usr/bin/javac | sed "s:/bin/javac::") && cp /opt/android-sdk/build-tools/30.0.3/lib/dx.jar test-app/build-tools/android-metadata-generator/src/libs/dx.jar && gradle && popd && mkdir -p node_modules/@nativescript/android && rm -rf node_modules/@nativescript/android/framework && cp -r /home/vagrant/build/srclib/NativeScript_android-runtime/dist/framework node_modules/@nativescript/android && rm -rf /home/vagrant/build/srclib/NativeScript_android-runtime && ns prepare android && sed -i 's/\(signingConfig[[:space:]]\)signingConfigs\.release/\1null/' platforms/android/app/build.gradle && ns build android --release --env.uglify --key-store-path /dev/null --key-store-alias NULL --key-store-password NULL --key-store-alias-password NULL || (cd platforms/android/app/build/outputs/apk/release && echo "The following files were found:" && find -maxdepth 1 -type f -name "*.apk")
+ pushd /home/vagrant/build/srclib/NativeScript_NativeScript/packages/ui-mobile-base/android/widgets
~/build/srclib/NativeScript_NativeScript/packages/ui-mobile-base/android/widgets ~/build/com.vishnuraghav.EnRecipes
+ gradle assembleRelease
Found 4.7 via distributionUrl
Downloading missing gradle version 4.7
cachedir
/tmp/tmp.nFHRgAMKLf/gradle-4.7-bin.zip: OK
Running /opt/gradle/versions/4.7/bin/gradle assembleRelease

Welcome to Gradle 4.7!

Here are the highlights of this release:
 - Incremental annotation processing
 - JDK 10 support
 - Grouped non-interactive console logs
 - Failed tests are re-run first for quicker feedback

For more details see https://docs.gradle.org/4.7/release-notes.html

Download https://dl.google.com/dl/android/maven2/com/android/tools/build/gradle/3.2.0/gradle-3.2.0.pom
Download https://dl.google.com/dl/android/maven2/com/android/tools/lint/lint-gradle-api/26.2.0/lint-gradle-api-26.2.0.pom
Download https://dl.google.com/dl/android/maven2/com/android/tools/build/gradle-api/3.2.0/gradle-api-3.2.0.pom
Download https://dl.google.com/dl/android/maven2/com/android/tools/analytics-library/crash/26.2.0/crash-26.2.0.pom
Download https://dl.google.com/dl/android/maven2/com/android/tools/build/builder/3.2.0/builder-3.2.0.pom
Download https://dl.google.com/dl/android/maven2/com/android/tools/analytics-library/shared/26.2.0/shared-26.2.0.pom
Download https://dl.google.com/dl/android/maven2/com/android/tools/build/transform-api/2.0.0-deprecated-use-gradle-api/transform-api-2.0.0-deprecated-use-gradle-api.pom
Download https://dl.google.com/dl/android/maven2/androidx/databinding/databinding-compiler-common/3.2.0/databinding-compiler-common-3.2.0.pom
Download https://jcenter.bintray.com/org/ow2/asm/asm-util/6.0/asm-util-6.0.pom
Download https://jcenter.bintray.com/org/ow2/asm/asm/6.0/asm-6.0.pom
Download https://jcenter.bintray.com/org/ow2/asm/asm-commons/6.0/asm-commons-6.0.pom
Download https://jcenter.bintray.com/org/ow2/asm/asm-analysis/6.0/asm-analysis-6.0.pom
Download https://jcenter.bintray.com/net/sf/jopt-simple/jopt-simple/4.9/jopt-simple-4.9.pom
Download https://jcenter.bintray.com/net/sf/proguard/proguard-gradle/6.0.3/proguard-gradle-6.0.3.pom
Download https://jcenter.bintray.com/org/ow2/asm/asm-parent/6.0/asm-parent-6.0.pom
Download https://jcenter.bintray.com/net/sf/proguard/proguard-parent/6.0.3/proguard-parent-6.0.3.pom
Download https://jcenter.bintray.com/org/sonatype/oss/oss-parent/7/oss-parent-7.pom
Download https://dl.google.com/dl/android/maven2/com/android/tools/build/jetifier/jetifier-core/1.0.0-alpha10/jetifier-core-1.0.0-alpha10.pom
Download https://jcenter.bintray.com/org/ow2/ow2/1.3/ow2-1.3.pom
Download https://dl.google.com/dl/android/maven2/com/android/tools/build/bundletool/0.5.0/bundletool-0.5.0.pom
Download https://dl.google.com/dl/android/maven2/com/android/tools/build/jetifier/jetifier-processor/1.0.0-alpha10/jetifier-processor-1.0.0-alpha10.pom
Download https://jcenter.bintray.com/org/jetbrains/kotlin/kotlin-stdlib-jre8/1.2.0/kotlin-stdlib-jre8-1.2.0.pom
Download https://dl.google.com/dl/android/maven2/com/android/tools/ddms/ddmlib/26.2.0/ddmlib-26.2.0.pom
Download https://dl.google.com/dl/android/maven2/com/android/tools/build/builder-test-api/3.2.0/builder-test-api-3.2.0.pom
Download https://dl.google.com/dl/android/maven2/com/android/tools/build/manifest-merger/26.2.0/manifest-merger-26.2.0.pom
Download https://dl.google.com/dl/android/maven2/com/android/tools/common/26.2.0/common-26.2.0.pom
Download https://dl.google.com/dl/android/maven2/com/android/tools/sdklib/26.2.0/sdklib-26.2.0.pom
Download https://dl.google.com/dl/android/maven2/com/android/tools/build/builder-model/3.2.0/builder-model-3.2.0.pom
Download https://dl.google.com/dl/android/maven2/com/android/tools/build/apksig/3.2.0/apksig-3.2.0.pom
Download https://dl.google.com/dl/android/maven2/com/android/tools/analytics-library/tracker/26.2.0/tracker-26.2.0.pom
Download https://dl.google.com/dl/android/maven2/com/android/tools/build/apkzlib/3.2.0/apkzlib-3.2.0.pom
Download https://dl.google.com/dl/android/maven2/com/android/tools/analytics-library/protos/26.2.0/protos-26.2.0.pom
Download https://jcenter.bintray.com/com/squareup/javawriter/2.5.0/javawriter-2.5.0.pom
Download https://jcenter.bintray.com/org/bouncycastle/bcpkix-jdk15on/1.56/bcpkix-jdk15on-1.56.pom
Download https://jcenter.bintray.com/org/ow2/asm/asm-tree/6.0/asm-tree-6.0.pom
Download https://dl.google.com/dl/android/maven2/com/android/tools/sdk-common/26.2.0/sdk-common-26.2.0.pom
Download https://jcenter.bintray.com/com/googlecode/json-simple/json-simple/1.1/json-simple-1.1.pom
Download https://jcenter.bintray.com/org/bouncycastle/bcprov-jdk15on/1.56/bcprov-jdk15on-1.56.pom
Download https://jcenter.bintray.com/it/unimi/dsi/fastutil/7.2.0/fastutil-7.2.0.pom
Download https://dl.google.com/dl/android/maven2/com/android/tools/annotations/26.2.0/annotations-26.2.0.pom
Download https://jcenter.bintray.com/com/google/code/gson/gson/2.8.0/gson-2.8.0.pom
Download https://jcenter.bintray.com/com/google/guava/guava/23.0/guava-23.0.pom
Download https://jcenter.bintray.com/com/google/code/gson/gson-parent/2.8.0/gson-parent-2.8.0.pom
Download https://jcenter.bintray.com/com/google/guava/guava-parent/23.0/guava-parent-23.0.pom
Download https://jcenter.bintray.com/org/apache/httpcomponents/httpcore/4.4.5/httpcore-4.4.5.pom
Download https://jcenter.bintray.com/org/apache/httpcomponents/httpclient/4.5.2/httpclient-4.5.2.pom
Download https://jcenter.bintray.com/org/apache/httpcomponents/httpmime/4.5.2/httpmime-4.5.2.pom
Download https://jcenter.bintray.com/org/apache/httpcomponents/httpcomponents-core/4.4.5/httpcomponents-core-4.4.5.pom
Download https://jcenter.bintray.com/org/apache/httpcomponents/httpcomponents-client/4.5.2/httpcomponents-client-4.5.2.pom
Download https://jcenter.bintray.com/org/apache/httpcomponents/project/7/project-7.pom
Download https://jcenter.bintray.com/org/apache/apache/13/apache-13.pom
Download https://jcenter.bintray.com/org/jetbrains/kotlin/kotlin-reflect/1.2.0/kotlin-reflect-1.2.0.pom
Download https://dl.google.com/dl/android/maven2/androidx/databinding/databinding-common/3.2.0/databinding-common-3.2.0.pom
Download https://dl.google.com/dl/android/maven2/com/android/databinding/baseLibrary/3.2.0/baseLibrary-3.2.0.pom
Download https://jcenter.bintray.com/com/squareup/javapoet/1.8.0/javapoet-1.8.0.pom
Download https://jcenter.bintray.com/org/antlr/antlr4/4.5.3/antlr4-4.5.3.pom
Download https://jcenter.bintray.com/com/googlecode/juniversalchardet/juniversalchardet/1.0.3/juniversalchardet-1.0.3.pom
Download https://jcenter.bintray.com/commons-io/commons-io/2.4/commons-io-2.4.pom
Download https://jcenter.bintray.com/org/antlr/antlr4-master/4.5.3/antlr4-master-4.5.3.pom
Download https://jcenter.bintray.com/org/apache/commons/commons-parent/25/commons-parent-25.pom
Download https://jcenter.bintray.com/org/sonatype/oss/oss-parent/9/oss-parent-9.pom
Download https://jcenter.bintray.com/org/apache/apache/9/apache-9.pom
Download https://jcenter.bintray.com/org/jetbrains/kotlin/kotlin-stdlib/1.2.0/kotlin-stdlib-1.2.0.pom
Download https://jcenter.bintray.com/org/jetbrains/kotlin/kotlin-stdlib-jre7/1.2.0/kotlin-stdlib-jre7-1.2.0.pom
Download https://jcenter.bintray.com/net/sf/proguard/proguard-base/6.0.3/proguard-base-6.0.3.pom
Download https://dl.google.com/dl/android/maven2/com/android/tools/build/aapt2-proto/0.3.1/aapt2-proto-0.3.1.pom
Download https://jcenter.bintray.com/com/google/errorprone/error_prone_annotations/2.2.0/error_prone_annotations-2.2.0.pom
Download https://jcenter.bintray.com/com/google/protobuf/protobuf-java/3.4.0/protobuf-java-3.4.0.pom
Download https://jcenter.bintray.com/com/google/protobuf/protobuf-java-util/3.4.0/protobuf-java-util-3.4.0.pom
Download https://jcenter.bintray.com/com/google/auto/value/auto-value/1.5.2/auto-value-1.5.2.pom
Download https://jcenter.bintray.com/com/google/protobuf/protobuf-parent/3.4.0/protobuf-parent-3.4.0.pom
Download https://jcenter.bintray.com/com/google/errorprone/error_prone_parent/2.2.0/error_prone_parent-2.2.0.pom
Download https://jcenter.bintray.com/com/google/auto/auto-parent/3/auto-parent-3.pom
Download https://jcenter.bintray.com/com/google/google/1/google-1.pom
Download https://jcenter.bintray.com/org/jetbrains/kotlin/kotlin-stdlib/1.2.20/kotlin-stdlib-1.2.20.pom
Download https://jcenter.bintray.com/org/jdom/jdom2/2.0.6/jdom2-2.0.6.pom
Download https://dl.google.com/dl/android/maven2/com/android/tools/dvlib/26.2.0/dvlib-26.2.0.pom
Download https://dl.google.com/dl/android/maven2/com/android/tools/layoutlib/layoutlib-api/26.2.0/layoutlib-api-26.2.0.pom
Download https://dl.google.com/dl/android/maven2/com/android/tools/repository/26.2.0/repository-26.2.0.pom
Download https://jcenter.bintray.com/org/apache/commons/commons-compress/1.12/commons-compress-1.12.pom
Download https://jcenter.bintray.com/org/apache/commons/commons-parent/39/commons-parent-39.pom
Download https://jcenter.bintray.com/org/apache/apache/16/apache-16.pom
Download https://jcenter.bintray.com/javax/inject/javax.inject/1/javax.inject-1.pom
Download https://jcenter.bintray.com/net/sf/kxml/kxml2/2.3.0/kxml2-2.3.0.pom
Download https://jcenter.bintray.com/com/google/code/findbugs/jsr305/1.3.9/jsr305-1.3.9.pom
Download https://jcenter.bintray.com/com/google/j2objc/j2objc-annotations/1.1/j2objc-annotations-1.1.pom
Download https://jcenter.bintray.com/org/codehaus/mojo/animal-sniffer-annotations/1.14/animal-sniffer-annotations-1.14.pom
Download https://jcenter.bintray.com/org/codehaus/mojo/animal-sniffer-parent/1.14/animal-sniffer-parent-1.14.pom
Download https://jcenter.bintray.com/org/codehaus/mojo/mojo-parent/34/mojo-parent-34.pom
Download https://jcenter.bintray.com/org/codehaus/codehaus-parent/4/codehaus-parent-4.pom
Download https://jcenter.bintray.com/commons-logging/commons-logging/1.2/commons-logging-1.2.pom
Download https://jcenter.bintray.com/commons-codec/commons-codec/1.9/commons-codec-1.9.pom
Download https://jcenter.bintray.com/org/apache/commons/commons-parent/32/commons-parent-32.pom
Download https://jcenter.bintray.com/org/apache/commons/commons-parent/34/commons-parent-34.pom
Download https://jcenter.bintray.com/org/jetbrains/annotations/13.0/annotations-13.0.pom
Download https://jcenter.bintray.com/com/sun/activation/javax.activation/1.2.0/javax.activation-1.2.0.pom
Download https://jcenter.bintray.com/com/google/jimfs/jimfs/1.1/jimfs-1.1.pom
Download https://jcenter.bintray.com/org/glassfish/jaxb/jaxb-runtime/2.2.11/jaxb-runtime-2.2.11.pom
Download https://jcenter.bintray.com/com/google/jimfs/jimfs-parent/1.1/jimfs-parent-1.1.pom
Download https://jcenter.bintray.com/com/sun/activation/all/1.2.0/all-1.2.0.pom
Download https://jcenter.bintray.com/com/sun/xml/bind/mvn/jaxb-runtime-parent/2.2.11/jaxb-runtime-parent-2.2.11.pom
Download https://jcenter.bintray.com/com/sun/xml/bind/mvn/jaxb-parent/2.2.11/jaxb-parent-2.2.11.pom
Download https://jcenter.bintray.com/net/java/jvnet-parent/1/jvnet-parent-1.pom
Download https://jcenter.bintray.com/com/sun/xml/bind/jaxb-bom-ext/2.2.11/jaxb-bom-ext-2.2.11.pom
Download https://jcenter.bintray.com/org/glassfish/jaxb/jaxb-bom/2.2.11/jaxb-bom-2.2.11.pom
Download https://jcenter.bintray.com/net/java/jvnet-parent/4/jvnet-parent-4.pom
Download https://jcenter.bintray.com/com/sun/xml/fastinfoset/FastInfoset/1.2.13/FastInfoset-1.2.13.pom
Download https://jcenter.bintray.com/org/jvnet/staxex/stax-ex/1.7.7/stax-ex-1.7.7.pom
Download https://jcenter.bintray.com/org/glassfish/jaxb/jaxb-core/2.2.11/jaxb-core-2.2.11.pom
Download https://jcenter.bintray.com/com/sun/xml/fastinfoset/fastinfoset-project/1.2.13/fastinfoset-project-1.2.13.pom
Download https://jcenter.bintray.com/net/java/jvnet-parent/3/jvnet-parent-3.pom
Download https://jcenter.bintray.com/com/sun/istack/istack-commons-runtime/2.21/istack-commons-runtime-2.21.pom
Download https://jcenter.bintray.com/javax/xml/bind/jaxb-api/2.2.12-b140109.1041/jaxb-api-2.2.12-b140109.1041.pom
Download https://jcenter.bintray.com/org/glassfish/jaxb/txw2/2.2.11/txw2-2.2.11.pom
Download https://jcenter.bintray.com/com/sun/xml/bind/mvn/jaxb-txw-parent/2.2.11/jaxb-txw-parent-2.2.11.pom
Download https://jcenter.bintray.com/com/sun/istack/istack-commons/2.21/istack-commons-2.21.pom
Download https://dl.google.com/dl/android/maven2/com/android/tools/analytics-library/tracker/26.2.0/tracker-26.2.0.jar
Download https://dl.google.com/dl/android/maven2/com/android/tools/analytics-library/crash/26.2.0/crash-26.2.0.jar
Download https://dl.google.com/dl/android/maven2/com/android/tools/analytics-library/shared/26.2.0/shared-26.2.0.jar
Download https://dl.google.com/dl/android/maven2/com/android/tools/build/builder/3.2.0/builder-3.2.0.jar
Download https://dl.google.com/dl/android/maven2/com/android/tools/build/gradle/3.2.0/gradle-3.2.0.jar
Download https://dl.google.com/dl/android/maven2/com/android/tools/build/gradle-api/3.2.0/gradle-api-3.2.0.jar
Download https://dl.google.com/dl/android/maven2/androidx/databinding/databinding-compiler-common/3.2.0/databinding-compiler-common-3.2.0.jar
Download https://dl.google.com/dl/android/maven2/com/android/tools/build/manifest-merger/26.2.0/manifest-merger-26.2.0.jar
Download https://dl.google.com/dl/android/maven2/com/android/tools/sdk-common/26.2.0/sdk-common-26.2.0.jar
Download https://dl.google.com/dl/android/maven2/com/android/tools/build/builder-test-api/3.2.0/builder-test-api-3.2.0.jar
Download https://dl.google.com/dl/android/maven2/com/android/tools/sdklib/26.2.0/sdklib-26.2.0.jar
Download https://dl.google.com/dl/android/maven2/com/android/tools/ddms/ddmlib/26.2.0/ddmlib-26.2.0.jar
Download https://dl.google.com/dl/android/maven2/com/android/tools/layoutlib/layoutlib-api/26.2.0/layoutlib-api-26.2.0.jar
Download https://dl.google.com/dl/android/maven2/com/android/tools/dvlib/26.2.0/dvlib-26.2.0.jar
Download https://dl.google.com/dl/android/maven2/com/android/tools/repository/26.2.0/repository-26.2.0.jar
Download https://dl.google.com/dl/android/maven2/com/android/tools/common/26.2.0/common-26.2.0.jar
Download https://jcenter.bintray.com/org/jetbrains/kotlin/kotlin-stdlib-jre8/1.2.0/kotlin-stdlib-jre8-1.2.0.jar
Download https://jcenter.bintray.com/org/ow2/asm/asm-analysis/6.0/asm-analysis-6.0.jar
Download https://dl.google.com/dl/android/maven2/com/android/tools/build/jetifier/jetifier-processor/1.0.0-alpha10/jetifier-processor-1.0.0-alpha10.jar
Download https://dl.google.com/dl/android/maven2/com/android/tools/build/transform-api/2.0.0-deprecated-use-gradle-api/transform-api-2.0.0-deprecated-use-gradle-api.jar
Download https://jcenter.bintray.com/org/ow2/asm/asm-commons/6.0/asm-commons-6.0.jar
Download https://jcenter.bintray.com/org/ow2/asm/asm-util/6.0/asm-util-6.0.jar
Download https://jcenter.bintray.com/org/ow2/asm/asm-tree/6.0/asm-tree-6.0.jar
Download https://jcenter.bintray.com/org/ow2/asm/asm/6.0/asm-6.0.jar
Download https://jcenter.bintray.com/net/sf/proguard/proguard-gradle/6.0.3/proguard-gradle-6.0.3.jar
Download https://jcenter.bintray.com/net/sf/jopt-simple/jopt-simple/4.9/jopt-simple-4.9.jar
Download https://dl.google.com/dl/android/maven2/com/android/tools/build/bundletool/0.5.0/bundletool-0.5.0.jar
Download https://dl.google.com/dl/android/maven2/com/android/tools/build/jetifier/jetifier-core/1.0.0-alpha10/jetifier-core-1.0.0-alpha10.jar
Download https://dl.google.com/dl/android/maven2/com/android/tools/build/builder-model/3.2.0/builder-model-3.2.0.jar
Download https://dl.google.com/dl/android/maven2/com/android/tools/analytics-library/protos/26.2.0/protos-26.2.0.jar
Download https://dl.google.com/dl/android/maven2/com/android/tools/build/apkzlib/3.2.0/apkzlib-3.2.0.jar
Download https://dl.google.com/dl/android/maven2/com/android/tools/build/apksig/3.2.0/apksig-3.2.0.jar
Download https://jcenter.bintray.com/com/squareup/javawriter/2.5.0/javawriter-2.5.0.jar
Download https://jcenter.bintray.com/org/bouncycastle/bcpkix-jdk15on/1.56/bcpkix-jdk15on-1.56.jar
Download https://jcenter.bintray.com/org/bouncycastle/bcprov-jdk15on/1.56/bcprov-jdk15on-1.56.jar
Download https://jcenter.bintray.com/it/unimi/dsi/fastutil/7.2.0/fastutil-7.2.0.jar
Download https://jcenter.bintray.com/com/googlecode/json-simple/json-simple/1.1/json-simple-1.1.jar
Download https://jcenter.bintray.com/com/google/jimfs/jimfs/1.1/jimfs-1.1.jar
Download https://jcenter.bintray.com/com/google/protobuf/protobuf-java-util/3.4.0/protobuf-java-util-3.4.0.jar
Download https://dl.google.com/dl/android/maven2/com/android/tools/annotations/26.2.0/annotations-26.2.0.jar
Download https://jcenter.bintray.com/com/google/guava/guava/23.0/guava-23.0.jar
Download https://jcenter.bintray.com/com/google/code/gson/gson/2.8.0/gson-2.8.0.jar
Download https://jcenter.bintray.com/org/apache/httpcomponents/httpmime/4.5.2/httpmime-4.5.2.jar
Download https://jcenter.bintray.com/org/apache/httpcomponents/httpclient/4.5.2/httpclient-4.5.2.jar
Download https://jcenter.bintray.com/org/apache/httpcomponents/httpcore/4.4.5/httpcore-4.4.5.jar
Download https://jcenter.bintray.com/org/jetbrains/kotlin/kotlin-reflect/1.2.0/kotlin-reflect-1.2.0.jar
Download https://dl.google.com/dl/android/maven2/com/android/databinding/baseLibrary/3.2.0/baseLibrary-3.2.0.jar
Download https://jcenter.bintray.com/org/antlr/antlr4/4.5.3/antlr4-4.5.3.jar
Download https://dl.google.com/dl/android/maven2/androidx/databinding/databinding-common/3.2.0/databinding-common-3.2.0.jar
Download https://jcenter.bintray.com/commons-io/commons-io/2.4/commons-io-2.4.jar
Download https://jcenter.bintray.com/com/googlecode/juniversalchardet/juniversalchardet/1.0.3/juniversalchardet-1.0.3.jar
Download https://jcenter.bintray.com/com/squareup/javapoet/1.8.0/javapoet-1.8.0.jar
Download https://jcenter.bintray.com/org/jetbrains/kotlin/kotlin-stdlib-jre7/1.2.0/kotlin-stdlib-jre7-1.2.0.jar
Download https://jcenter.bintray.com/org/jetbrains/kotlin/kotlin-stdlib/1.2.20/kotlin-stdlib-1.2.20.jar
Download https://jcenter.bintray.com/com/google/auto/value/auto-value/1.5.2/auto-value-1.5.2.jar
Download https://jcenter.bintray.com/net/sf/proguard/proguard-base/6.0.3/proguard-base-6.0.3.jar
Download https://dl.google.com/dl/android/maven2/com/android/tools/build/aapt2-proto/0.3.1/aapt2-proto-0.3.1.jar
Download https://jcenter.bintray.com/com/google/errorprone/error_prone_annotations/2.2.0/error_prone_annotations-2.2.0.jar
Download https://jcenter.bintray.com/org/apache/commons/commons-compress/1.12/commons-compress-1.12.jar
Download https://jcenter.bintray.com/com/google/protobuf/protobuf-java/3.4.0/protobuf-java-3.4.0.jar
Download https://jcenter.bintray.com/org/jdom/jdom2/2.0.6/jdom2-2.0.6.jar
Download https://jcenter.bintray.com/javax/inject/javax.inject/1/javax.inject-1.jar
Download https://jcenter.bintray.com/net/sf/kxml/kxml2/2.3.0/kxml2-2.3.0.jar
Download https://jcenter.bintray.com/com/google/j2objc/j2objc-annotations/1.1/j2objc-annotations-1.1.jar
Download https://jcenter.bintray.com/com/google/code/findbugs/jsr305/1.3.9/jsr305-1.3.9.jar
Download https://jcenter.bintray.com/org/codehaus/mojo/animal-sniffer-annotations/1.14/animal-sniffer-annotations-1.14.jar
Download https://jcenter.bintray.com/commons-logging/commons-logging/1.2/commons-logging-1.2.jar
Download https://jcenter.bintray.com/org/jetbrains/annotations/13.0/annotations-13.0.jar
Download https://jcenter.bintray.com/commons-codec/commons-codec/1.9/commons-codec-1.9.jar
Download https://jcenter.bintray.com/com/sun/activation/javax.activation/1.2.0/javax.activation-1.2.0.jar
Download https://jcenter.bintray.com/org/glassfish/jaxb/jaxb-runtime/2.2.11/jaxb-runtime-2.2.11.jar
Download https://jcenter.bintray.com/org/jvnet/staxex/stax-ex/1.7.7/stax-ex-1.7.7.jar
Download https://jcenter.bintray.com/org/glassfish/jaxb/jaxb-core/2.2.11/jaxb-core-2.2.11.jar
Download https://jcenter.bintray.com/com/sun/xml/fastinfoset/FastInfoset/1.2.13/FastInfoset-1.2.13.jar
Download https://jcenter.bintray.com/javax/xml/bind/jaxb-api/2.2.12-b140109.1041/jaxb-api-2.2.12-b140109.1041.jar
Download https://jcenter.bintray.com/org/glassfish/jaxb/txw2/2.2.11/txw2-2.2.11.jar
Download https://jcenter.bintray.com/com/sun/istack/istack-commons-runtime/2.21/istack-commons-runtime-2.21.jar
Download https://dl.google.com/dl/android/maven2/com/android/tools/lint/lint-gradle-api/26.2.0/lint-gradle-api-26.2.0.jar

> Configure project :widgets
Using android X

> Task :widgets:preBuild UP-TO-DATE
> Task :widgets:preReleaseBuild UP-TO-DATE
> Task :widgets:compileReleaseAidl NO-SOURCE
Download https://dl.google.com/dl/android/maven2/androidx/fragment/fragment/1.0.0/fragment-1.0.0.pom
Download https://dl.google.com/dl/android/maven2/androidx/exifinterface/exifinterface/1.3.2/exifinterface-1.3.2.pom
Download https://dl.google.com/dl/android/maven2/androidx/transition/transition/1.0.0/transition-1.0.0.pom
Download https://dl.google.com/dl/android/maven2/androidx/viewpager/viewpager/1.0.0/viewpager-1.0.0.pom
Download https://dl.google.com/dl/android/maven2/androidx/annotation/annotation/1.0.0/annotation-1.0.0.pom
Download https://dl.google.com/dl/android/maven2/androidx/core/core/1.0.0/core-1.0.0.pom
Download https://dl.google.com/dl/android/maven2/androidx/customview/customview/1.0.0/customview-1.0.0.pom
Download https://dl.google.com/dl/android/maven2/androidx/legacy/legacy-support-core-utils/1.0.0/legacy-support-core-utils-1.0.0.pom
Download https://dl.google.com/dl/android/maven2/androidx/legacy/legacy-support-core-ui/1.0.0/legacy-support-core-ui-1.0.0.pom
Download https://dl.google.com/dl/android/maven2/androidx/lifecycle/lifecycle-viewmodel/2.0.0/lifecycle-viewmodel-2.0.0.pom
Download https://dl.google.com/dl/android/maven2/androidx/loader/loader/1.0.0/loader-1.0.0.pom
Download https://dl.google.com/dl/android/maven2/androidx/annotation/annotation/1.1.0/annotation-1.1.0.pom
Download https://dl.google.com/dl/android/maven2/androidx/versionedparcelable/versionedparcelable/1.0.0/versionedparcelable-1.0.0.pom
Download https://dl.google.com/dl/android/maven2/androidx/collection/collection/1.0.0/collection-1.0.0.pom
Download https://dl.google.com/dl/android/maven2/androidx/lifecycle/lifecycle-runtime/2.0.0/lifecycle-runtime-2.0.0.pom
Download https://dl.google.com/dl/android/maven2/androidx/interpolator/interpolator/1.0.0/interpolator-1.0.0.pom
Download https://dl.google.com/dl/android/maven2/androidx/swiperefreshlayout/swiperefreshlayout/1.0.0/swiperefreshlayout-1.0.0.pom
Download https://dl.google.com/dl/android/maven2/androidx/slidingpanelayout/slidingpanelayout/1.0.0/slidingpanelayout-1.0.0.pom
Download https://dl.google.com/dl/android/maven2/androidx/drawerlayout/drawerlayout/1.0.0/drawerlayout-1.0.0.pom
Download https://dl.google.com/dl/android/maven2/androidx/asynclayoutinflater/asynclayoutinflater/1.0.0/asynclayoutinflater-1.0.0.pom
Download https://dl.google.com/dl/android/maven2/androidx/cursoradapter/cursoradapter/1.0.0/cursoradapter-1.0.0.pom
Download https://dl.google.com/dl/android/maven2/androidx/coordinatorlayout/coordinatorlayout/1.0.0/coordinatorlayout-1.0.0.pom
Download https://dl.google.com/dl/android/maven2/androidx/documentfile/documentfile/1.0.0/documentfile-1.0.0.pom
Download https://dl.google.com/dl/android/maven2/androidx/localbroadcastmanager/localbroadcastmanager/1.0.0/localbroadcastmanager-1.0.0.pom
Download https://dl.google.com/dl/android/maven2/androidx/print/print/1.0.0/print-1.0.0.pom
Download https://dl.google.com/dl/android/maven2/androidx/lifecycle/lifecycle-livedata/2.0.0/lifecycle-livedata-2.0.0.pom
Download https://dl.google.com/dl/android/maven2/androidx/arch/core/core-common/2.0.0/core-common-2.0.0.pom
Download https://dl.google.com/dl/android/maven2/androidx/lifecycle/lifecycle-common/2.0.0/lifecycle-common-2.0.0.pom
Download https://dl.google.com/dl/android/maven2/androidx/lifecycle/lifecycle-livedata-core/2.0.0/lifecycle-livedata-core-2.0.0.pom
Download https://dl.google.com/dl/android/maven2/androidx/arch/core/core-runtime/2.0.0/core-runtime-2.0.0.pom
Download https://dl.google.com/dl/android/maven2/androidx/fragment/fragment/1.0.0/fragment-1.0.0.aar
Download https://dl.google.com/dl/android/maven2/androidx/exifinterface/exifinterface/1.3.2/exifinterface-1.3.2.aar
Download https://dl.google.com/dl/android/maven2/androidx/legacy/legacy-support-core-ui/1.0.0/legacy-support-core-ui-1.0.0.aar
Download https://dl.google.com/dl/android/maven2/androidx/viewpager/viewpager/1.0.0/viewpager-1.0.0.aar
Download https://dl.google.com/dl/android/maven2/androidx/transition/transition/1.0.0/transition-1.0.0.aar
Download https://dl.google.com/dl/android/maven2/androidx/drawerlayout/drawerlayout/1.0.0/drawerlayout-1.0.0.aar
Download https://dl.google.com/dl/android/maven2/androidx/customview/customview/1.0.0/customview-1.0.0.aar
Download https://dl.google.com/dl/android/maven2/androidx/slidingpanelayout/slidingpanelayout/1.0.0/slidingpanelayout-1.0.0.aar
Download https://dl.google.com/dl/android/maven2/androidx/loader/loader/1.0.0/loader-1.0.0.aar
Download https://dl.google.com/dl/android/maven2/androidx/swiperefreshlayout/swiperefreshlayout/1.0.0/swiperefreshlayout-1.0.0.aar
Download https://dl.google.com/dl/android/maven2/androidx/asynclayoutinflater/asynclayoutinflater/1.0.0/asynclayoutinflater-1.0.0.aar
Download https://dl.google.com/dl/android/maven2/androidx/legacy/legacy-support-core-utils/1.0.0/legacy-support-core-utils-1.0.0.aar
Download https://dl.google.com/dl/android/maven2/androidx/core/core/1.0.0/core-1.0.0.aar
Download https://dl.google.com/dl/android/maven2/androidx/lifecycle/lifecycle-runtime/2.0.0/lifecycle-runtime-2.0.0.aar
Download https://dl.google.com/dl/android/maven2/androidx/interpolator/interpolator/1.0.0/interpolator-1.0.0.aar
Download https://dl.google.com/dl/android/maven2/androidx/lifecycle/lifecycle-viewmodel/2.0.0/lifecycle-viewmodel-2.0.0.aar
Download https://dl.google.com/dl/android/maven2/androidx/versionedparcelable/versionedparcelable/1.0.0/versionedparcelable-1.0.0.aar
Download https://dl.google.com/dl/android/maven2/androidx/localbroadcastmanager/localbroadcastmanager/1.0.0/localbroadcastmanager-1.0.0.aar
Download https://dl.google.com/dl/android/maven2/androidx/lifecycle/lifecycle-livedata/2.0.0/lifecycle-livedata-2.0.0.aar
Download https://dl.google.com/dl/android/maven2/androidx/cursoradapter/cursoradapter/1.0.0/cursoradapter-1.0.0.aar
Download https://dl.google.com/dl/android/maven2/androidx/lifecycle/lifecycle-livedata-core/2.0.0/lifecycle-livedata-core-2.0.0.aar
Download https://dl.google.com/dl/android/maven2/androidx/print/print/1.0.0/print-1.0.0.aar
Download https://dl.google.com/dl/android/maven2/androidx/documentfile/documentfile/1.0.0/documentfile-1.0.0.aar
Download https://dl.google.com/dl/android/maven2/androidx/arch/core/core-runtime/2.0.0/core-runtime-2.0.0.aar
Download https://dl.google.com/dl/android/maven2/androidx/coordinatorlayout/coordinatorlayout/1.0.0/coordinatorlayout-1.0.0.aar
> Task :widgets:compileReleaseRenderscript
> Task :widgets:checkReleaseManifest
> Task :widgets:generateReleaseBuildConfig
> Task :widgets:generateReleaseResValues
> Task :widgets:generateReleaseResources
Download https://dl.google.com/dl/android/maven2/com/android/tools/build/aapt2/3.2.0-4818971/aapt2-3.2.0-4818971.pom
Download https://dl.google.com/dl/android/maven2/com/android/tools/build/aapt2/3.2.0-4818971/aapt2-3.2.0-4818971-linux.jar
> Task :widgets:packageReleaseResources
> Task :widgets:processReleaseManifest
> Task :widgets:generateReleaseRFile
> Task :widgets:prepareLintJar
> Task :widgets:generateReleaseSources
Download https://dl.google.com/dl/android/maven2/androidx/collection/collection/1.0.0/collection-1.0.0.jar
Download https://dl.google.com/dl/android/maven2/androidx/lifecycle/lifecycle-common/2.0.0/lifecycle-common-2.0.0.jar
Download https://dl.google.com/dl/android/maven2/androidx/annotation/annotation/1.1.0/annotation-1.1.0.jar
Download https://dl.google.com/dl/android/maven2/androidx/arch/core/core-common/2.0.0/core-common-2.0.0.jar
> Task :widgets:javaPreCompileRelease

> Task :widgets:compileReleaseJavaWithJavac
Note: Some input files use or override a deprecated API.
Note: Recompile with -Xlint:deprecation for details.
Note: /home/vagrant/build/srclib/NativeScript_NativeScript/packages/ui-mobile-base/android/widgets/src/main/java/org/nativescript/widgets/Image/AsyncTask.java uses unchecked or unsafe operations.
Note: Recompile with -Xlint:unchecked for details.
Download https://dl.google.com/dl/android/maven2/com/android/tools/lint/lint-gradle/26.2.0/lint-gradle-26.2.0.pom
Download https://dl.google.com/dl/android/maven2/com/android/tools/external/org-jetbrains/uast/26.2.0/uast-26.2.0.pom
Download https://dl.google.com/dl/android/maven2/com/android/tools/lint/lint/26.2.0/lint-26.2.0.pom
Download https://dl.google.com/dl/android/maven2/com/android/tools/external/com-intellij/intellij-core/26.2.0/intellij-core-26.2.0.pom
Download https://jcenter.bintray.com/org/codehaus/groovy/groovy-all/2.4.12/groovy-all-2.4.12.pom
Download https://jcenter.bintray.com/org/jetbrains/trove4j/trove4j/20160824/trove4j-20160824.pom
Download https://dl.google.com/dl/android/maven2/com/android/tools/lint/lint-kotlin/26.2.0/lint-kotlin-26.2.0.pom
Download https://dl.google.com/dl/android/maven2/com/android/tools/lint/lint-checks/26.2.0/lint-checks-26.2.0.pom
Download https://dl.google.com/dl/android/maven2/com/android/tools/external/com-intellij/kotlin-compiler/26.2.0/kotlin-compiler-26.2.0.pom
Download https://dl.google.com/dl/android/maven2/com/android/tools/lint/lint-api/26.2.0/lint-api-26.2.0.pom
Download https://jcenter.bintray.com/com/google/errorprone/error_prone_annotations/2.0.18/error_prone_annotations-2.0.18.pom
Download https://jcenter.bintray.com/com/google/errorprone/error_prone_parent/2.0.18/error_prone_parent-2.0.18.pom
Download https://dl.google.com/dl/android/maven2/com/android/tools/lint/lint-kotlin/26.2.0/lint-kotlin-26.2.0.jar
Download https://dl.google.com/dl/android/maven2/com/android/tools/lint/lint/26.2.0/lint-26.2.0.jar
Download https://dl.google.com/dl/android/maven2/com/android/tools/lint/lint-api/26.2.0/lint-api-26.2.0.jar
Download https://jcenter.bintray.com/org/codehaus/groovy/groovy-all/2.4.12/groovy-all-2.4.12.jar
Download https://dl.google.com/dl/android/maven2/com/android/tools/lint/lint-checks/26.2.0/lint-checks-26.2.0.jar
Download https://dl.google.com/dl/android/maven2/com/android/tools/lint/lint-gradle/26.2.0/lint-gradle-26.2.0.jar
Download https://dl.google.com/dl/android/maven2/com/android/tools/external/com-intellij/intellij-core/26.2.0/intellij-core-26.2.0.jar
Download https://dl.google.com/dl/android/maven2/com/android/tools/external/com-intellij/kotlin-compiler/26.2.0/kotlin-compiler-26.2.0.jar
Download https://jcenter.bintray.com/org/jetbrains/trove4j/trove4j/20160824/trove4j-20160824.jar
Download https://jcenter.bintray.com/org/jetbrains/kotlin/kotlin-stdlib/1.2.0/kotlin-stdlib-1.2.0.jar
Download https://jcenter.bintray.com/com/google/errorprone/error_prone_annotations/2.0.18/error_prone_annotations-2.0.18.jar
Download https://dl.google.com/dl/android/maven2/com/android/tools/external/org-jetbrains/uast/26.2.0/uast-26.2.0.jar

> Task :widgets:extractReleaseAnnotations
> Task :widgets:mergeReleaseConsumerProguardFiles
> Task :widgets:mergeReleaseShaders
> Task :widgets:compileReleaseShaders
> Task :widgets:generateReleaseAssets
> Task :widgets:packageReleaseAssets
> Task :widgets:packageReleaseRenderscript NO-SOURCE
> Task :widgets:processReleaseJavaRes NO-SOURCE
> Task :widgets:transformResourcesWithMergeJavaResForRelease
> Task :widgets:transformClassesAndResourcesWithSyncLibJarsForRelease
> Task :widgets:compileReleaseNdk NO-SOURCE
> Task :widgets:mergeReleaseJniLibFolders
> Task :widgets:transformNativeLibsWithMergeJniLibsForRelease
> Task :widgets:transformNativeLibsWithStripDebugSymbolForRelease
> Task :widgets:transformNativeLibsWithSyncJniLibsForRelease
> Task :widgets:bundleReleaseAar
> Task :widgets:compileReleaseSources
> Task :widgets:mergeReleaseResources
> Task :widgets:verifyReleaseResources
> Task :widgets:assembleRelease

BUILD SUCCESSFUL in 32s
24 actionable tasks: 24 executed
+ popd
~/build/com.vishnuraghav.EnRecipes
+ mkdir -p node_modules/@nativescript/core/platforms/android
+ cp /home/vagrant/build/srclib/NativeScript_NativeScript/packages/ui-mobile-base/android/widgets/build/outputs/aar/widgets-release.aar node_modules/@nativescript/core/platforms/android/widgets-release.aar
+ rm -rf /home/vagrant/build/srclib/NativeScript_NativeScript
+ pushd /home/vagrant/build/srclib/NativeScript_android-runtime
~/build/srclib/NativeScript_android-runtime ~/build/com.vishnuraghav.EnRecipes
++ readlink -f /usr/bin/javac
++ sed s:/bin/javac::
+ export JAVA_HOME=/usr/lib/jvm/java-8-openjdk-amd64
+ JAVA_HOME=/usr/lib/jvm/java-8-openjdk-amd64
+ cp /opt/android-sdk/build-tools/30.0.3/lib/dx.jar test-app/build-tools/android-metadata-generator/src/libs/dx.jar
+ gradle
Found 6.4 via distributionUrl
Downloading missing gradle version 6.4
cachedir
/tmp/tmp.4NsoL2L1xD/gradle-6.4-bin.zip: OK
Running /opt/gradle/versions/6.4/bin/gradle 

Welcome to Gradle 6.4!

Here are the highlights of this release:
 - Support for building, testing and running Java Modules
 - Precompiled script plugins for Groovy DSL
 - Single dependency lock file per project

For more details see https://docs.gradle.org/6.4/release-notes.html

To honour the JVM settings for this build a new JVM will be forked. Please consider using the daemon: https://docs.gradle.org/6.4/userguide/gradle_daemon.html.
Daemon will be stopped at the end of the build stopping after processing

> Configure project :
Warning: The GIT_COMMIT is not set. This NativeScript Android Runtime will not be tagged with the git commit it is build from

CCache version: CCache not found!
Creating NativeScript Android Package

> Task :cleanDistDir UP-TO-DATE

> Task :generateDtsgJar
Downloading https://services.gradle.org/distributions/gradle-6.4-all.zip
...................................................................................................................................................................................................................................................................................................................................................................................................................................................................................................................................................................................................................................................................................................................................................................................................................................................................................................................................................................................................................................................................................................................................................................................................................................................................................................................................................................................................................................................................................................................................................................................................................................................................................................................................................................................................................................................................................................................................................................................................................................................................................................................................................................................................................................................................................................................................................................................................................................................................................................................................................................................................................................................................................................................................................................................................................................................................................................................................................................................................................................................................................................................................................................................................................................................................................................................................................................................................................................................................................................................................................................................................................................................................................................................................................................................................................................................................................................................................................................................................................................................................................................................................................................................................................................................................................................................................................................................................................................................................................................................................................................................................................................................................................................................................................................................................................................................................................................................................................................................................................................................................................................................................................................................................................................................................................................................................................................................................................................................................................................................................................................................................................................................................................................................................................................................................................................................................................................................................................................................................................................................................................................................................................................................................................................................................................................................................................................................................................................................................................................................................................................................................................................................................................................................................................................................................................................................................................................................................................................................................................................................................................................................................................................................................................................................................................................................................................................................................................................................................................................................................................................................
Unzipping /home/vagrant/.gradle/wrapper/dists/gradle-6.4-all/h8pi7famayzdg9sl28jayaip/gradle-6.4-all.zip to /home/vagrant/.gradle/wrapper/dists/gradle-6.4-all/h8pi7famayzdg9sl28jayaip
Set executable permissions for: /home/vagrant/.gradle/wrapper/dists/gradle-6.4-all/h8pi7famayzdg9sl28jayaip/gradle-6.4/bin/gradle
To honour the JVM settings for this build a new JVM will be forked. Please consider using the daemon: https://docs.gradle.org/6.4/userguide/gradle_daemon.html.
Daemon will be stopped at the end of the build stopping after processing

> Configure project :android-metadata-generator
The compile configuration has been deprecated for dependency declaration. This will fail with an error in Gradle 7.0. Please use the implementation configuration instead. Consult the upgrading guide for further information: https://docs.gradle.org/6.4/userguide/upgrading_version_5.html#dependencies_should_no_longer_be_declared_using_the_compile_and_runtime_configurations
	at build_8qx6x2e529ggcnezerlzur5n8$_run_closure5.doCall(/home/vagrant/build/srclib/NativeScript_android-runtime/test-app/build-tools/android-metadata-generator/build.gradle:47)
	(Run with --stacktrace to get the full stack trace of this deprecation warning.)
The testCompile configuration has been deprecated for dependency declaration. This will fail with an error in Gradle 7.0. Please use the testImplementation configuration instead. Consult the upgrading guide for further information: https://docs.gradle.org/6.4/userguide/upgrading_version_5.html#dependencies_should_no_longer_be_declared_using_the_compile_and_runtime_configurations
	at build_8qx6x2e529ggcnezerlzur5n8$_run_closure5.doCall(/home/vagrant/build/srclib/NativeScript_android-runtime/test-app/build-tools/android-metadata-generator/build.gradle:52)
	(Run with --stacktrace to get the full stack trace of this deprecation warning.)

> Configure project :app
Internal API constructor DefaultDomainObjectSet(Class<T>) has been deprecated. This is scheduled to be removed in Gradle 7.0. Please use ObjectFactory.domainObjectSet(Class<T>) instead. See https://docs.gradle.org/6.4/userguide/custom_gradle_types.html#domainobjectset for more details.
	at build_6py85dmzpz4lpmwdbcvywm8s0.run(/home/vagrant/build/srclib/NativeScript_android-runtime/test-app/app/build.gradle:35)
	(Run with --stacktrace to get the full stack trace of this deprecation warning.)
	 + setting applicationId
	 + couldn't load user-defined configuration from /home/vagrant/build/srclib/app/App_Resources/Android/app.gradle. File doesn't exist.
	 + using android X library androidx.legacy:legacy-support-v4:1.0.0

> Configure project :runtime
WARNING: Support for ANDROID_NDK_HOME is deprecated and will be removed in the future. Use android.ndkVersion in build.gradle instead.
Support for ANDROID_NDK_HOME is deprecated and will be removed in the future. Use android.ndkVersion in build.gradle instead.

> Configure project :app
WARNING: Folder /home/vagrant/build/srclib/NativeScript_android-runtime/test-app/runtime/build/intermediates/runtime_library_classes/debug does not exists, the dependent project's classes won't be included in the metadata

> Configure project :static-binding-generator
The compile configuration has been deprecated for dependency declaration. This will fail with an error in Gradle 7.0. Please use the implementation or api configuration instead. Consult the upgrading guide for further information: https://docs.gradle.org/6.4/userguide/upgrading_version_5.html#dependencies_should_no_longer_be_declared_using_the_compile_and_runtime_configurations
	at build_99samisgx3y8aheva8tb7clh6$_run_closure2.doCall(/home/vagrant/build/srclib/NativeScript_android-runtime/test-app/build-tools/static-binding-generator/build.gradle:13)
	(Run with --stacktrace to get the full stack trace of this deprecation warning.)

> Task :dts-generator:compileJava
> Task :dts-generator:processResources NO-SOURCE
> Task :dts-generator:classes

> Task :dts-generator:jar
Copying or archiving duplicate paths with the default duplicates strategy has been deprecated. This is scheduled to be removed in Gradle 7.0. Duplicate path: "META-INF/LICENSE.txt". Explicitly set the duplicates strategy to 'DuplicatesStrategy.INCLUDE' if you want to allow duplicate paths. Consult the upgrading guide for further information: https://docs.gradle.org/6.4/userguide/upgrading_version_5.html#implicit_duplicate_strategy_for_copy_or_archive_tasks_has_been_deprecated
Copying or archiving duplicate paths with the default duplicates strategy has been deprecated. This is scheduled to be removed in Gradle 7.0. Duplicate path: "META-INF/NOTICE.txt". Explicitly set the duplicates strategy to 'DuplicatesStrategy.INCLUDE' if you want to allow duplicate paths. Consult the upgrading guide for further information: https://docs.gradle.org/6.4/userguide/upgrading_version_5.html#implicit_duplicate_strategy_for_copy_or_archive_tasks_has_been_deprecated
Copying or archiving duplicate paths with the default duplicates strategy has been deprecated. This is scheduled to be removed in Gradle 7.0. Duplicate path: "module-info.class". Explicitly set the duplicates strategy to 'DuplicatesStrategy.INCLUDE' if you want to allow duplicate paths. Consult the upgrading guide for further information: https://docs.gradle.org/6.4/userguide/upgrading_version_5.html#implicit_duplicate_strategy_for_copy_or_archive_tasks_has_been_deprecated

> Task :dts-generator:copyJarToBuildTools
3 actionable tasks: 3 executed

> Task :jsParserNPMInstall
npm WARN deprecated core-js@2.6.12: core-js@<3.3 is no longer maintained and not recommended for usage due to the number of issues. Because of the V8 engine whims, feature detection in old core-js versions could cause a slowdown up to 100x even if nothing is polyfilled. Please, upgrade your dependencies to the actual version of core-js.
npm WARN deprecated querystring@0.2.0: The querystring API is considered Legacy. new code should use the URLSearchParams API instead.
npm WARN deprecated chokidar@2.1.8: Chokidar 2 will break on node v14+. Upgrade to chokidar 3 with 15x less dependencies.
npm WARN deprecated urix@0.1.0: Please see https://github.com/lydell/urix#deprecated
npm WARN deprecated resolve-url@0.2.1: https://github.com/lydell/resolve-url#deprecated
npm WARN deprecated fsevents@1.2.13: fsevents 1 will break on node v14+ and could be using insecure binaries. Upgrade to fsevents 2.

> core-js@2.6.12 postinstall /home/vagrant/build/srclib/NativeScript_android-runtime/test-app/build-tools/jsparser/node_modules/core-js
> node -e "try{require('./postinstall')}catch(e){}"

Thank you for using core-js ( https://github.com/zloirock/core-js ) for polyfilling JavaScript standard library!

The project needs your help! Please consider supporting of core-js on Open Collective or Patreon: 
> https://opencollective.com/core-js 
> https://www.patreon.com/zloirock 

Also, the author of core-js ( https://github.com/zloirock ) is looking for a good job -)

npm notice created a lockfile as package-lock.json. You should commit this file.
npm WARN optional SKIPPING OPTIONAL DEPENDENCY: fsevents@~2.3.2 (node_modules/chokidar/node_modules/fsevents):
npm WARN notsup SKIPPING OPTIONAL DEPENDENCY: Unsupported platform for fsevents@2.3.2: wanted {"os":"darwin","arch":"any"} (current: {"os":"linux","arch":"x64"})
npm WARN optional SKIPPING OPTIONAL DEPENDENCY: fsevents@^1.2.7 (node_modules/watchpack-chokidar2/node_modules/chokidar/node_modules/fsevents):
npm WARN notsup SKIPPING OPTIONAL DEPENDENCY: Unsupported platform for fsevents@1.2.13: wanted {"os":"darwin","arch":"any"} (current: {"os":"linux","arch":"x64"})

added 434 packages from 222 contributors and audited 438 packages in 12.116s

7 packages are looking for funding
  run `npm fund` for details

found 2 vulnerabilities (1 low, 1 moderate)
  run `npm audit fix` to fix them, or `npm audit` for details

> Task :generateSbgJar
To honour the JVM settings for this build a new JVM will be forked. Please consider using the daemon: https://docs.gradle.org/6.4/userguide/gradle_daemon.html.
Daemon will be stopped at the end of the build stopping after processing

> Configure project :android-metadata-generator
The compile configuration has been deprecated for dependency declaration. This will fail with an error in Gradle 7.0. Please use the implementation configuration instead. Consult the upgrading guide for further information: https://docs.gradle.org/6.4/userguide/upgrading_version_5.html#dependencies_should_no_longer_be_declared_using_the_compile_and_runtime_configurations
	at build_8qx6x2e529ggcnezerlzur5n8$_run_closure5.doCall(/home/vagrant/build/srclib/NativeScript_android-runtime/test-app/build-tools/android-metadata-generator/build.gradle:47)
	(Run with --stacktrace to get the full stack trace of this deprecation warning.)
The testCompile configuration has been deprecated for dependency declaration. This will fail with an error in Gradle 7.0. Please use the testImplementation configuration instead. Consult the upgrading guide for further information: https://docs.gradle.org/6.4/userguide/upgrading_version_5.html#dependencies_should_no_longer_be_declared_using_the_compile_and_runtime_configurations
	at build_8qx6x2e529ggcnezerlzur5n8$_run_closure5.doCall(/home/vagrant/build/srclib/NativeScript_android-runtime/test-app/build-tools/android-metadata-generator/build.gradle:52)
	(Run with --stacktrace to get the full stack trace of this deprecation warning.)

> Configure project :app
Internal API constructor DefaultDomainObjectSet(Class<T>) has been deprecated. This is scheduled to be removed in Gradle 7.0. Please use ObjectFactory.domainObjectSet(Class<T>) instead. See https://docs.gradle.org/6.4/userguide/custom_gradle_types.html#domainobjectset for more details.
	at build_6py85dmzpz4lpmwdbcvywm8s0.run(/home/vagrant/build/srclib/NativeScript_android-runtime/test-app/app/build.gradle:35)
	(Run with --stacktrace to get the full stack trace of this deprecation warning.)
	 + setting applicationId
	 + couldn't load user-defined configuration from /home/vagrant/build/srclib/app/App_Resources/Android/app.gradle. File doesn't exist.
	 + using android X library androidx.legacy:legacy-support-v4:1.0.0

> Configure project :runtime
WARNING: Support for ANDROID_NDK_HOME is deprecated and will be removed in the future. Use android.ndkVersion in build.gradle instead.
Support for ANDROID_NDK_HOME is deprecated and will be removed in the future. Use android.ndkVersion in build.gradle instead.

> Configure project :app
WARNING: Folder /home/vagrant/build/srclib/NativeScript_android-runtime/test-app/runtime/build/intermediates/runtime_library_classes/debug does not exists, the dependent project's classes won't be included in the metadata

> Configure project :static-binding-generator
The compile configuration has been deprecated for dependency declaration. This will fail with an error in Gradle 7.0. Please use the implementation or api configuration instead. Consult the upgrading guide for further information: https://docs.gradle.org/6.4/userguide/upgrading_version_5.html#dependencies_should_no_longer_be_declared_using_the_compile_and_runtime_configurations
	at build_99samisgx3y8aheva8tb7clh6$_run_closure2.doCall(/home/vagrant/build/srclib/NativeScript_android-runtime/test-app/build-tools/static-binding-generator/build.gradle:13)
	(Run with --stacktrace to get the full stack trace of this deprecation warning.)
The runtime configuration has been deprecated for resolution. This will fail with an error in Gradle 7.0. Please resolve the runtimeClasspath configuration instead. Consult the upgrading guide for further information: https://docs.gradle.org/6.4/userguide/upgrading_version_5.html#dependencies_should_no_longer_be_declared_using_the_compile_and_runtime_configurations
	at build_99samisgx3y8aheva8tb7clh6$_run_closure5$_closure7.doCall(/home/vagrant/build/srclib/NativeScript_android-runtime/test-app/build-tools/static-binding-generator/build.gradle:42)
	(Run with --stacktrace to get the full stack trace of this deprecation warning.)
The compile configuration has been deprecated for resolution. This will fail with an error in Gradle 7.0. Please resolve the compileClasspath configuration instead. Consult the upgrading guide for further information: https://docs.gradle.org/6.4/userguide/upgrading_version_5.html#dependencies_should_no_longer_be_declared_using_the_compile_and_runtime_configurations
	at build_99samisgx3y8aheva8tb7clh6$_run_closure5$_closure7.doCall(/home/vagrant/build/srclib/NativeScript_android-runtime/test-app/build-tools/static-binding-generator/build.gradle:46)
	(Run with --stacktrace to get the full stack trace of this deprecation warning.)

> Task :static-binding-generator:compileJava
> Task :static-binding-generator:processResources NO-SOURCE
> Task :static-binding-generator:classes

> Task :static-binding-generator:jar
Copying or archiving duplicate paths with the default duplicates strategy has been deprecated. This is scheduled to be removed in Gradle 7.0. Duplicate path: "module-info.class". Explicitly set the duplicates strategy to 'DuplicatesStrategy.INCLUDE' if you want to allow duplicate paths. Consult the upgrading guide for further information: https://docs.gradle.org/6.4/userguide/upgrading_version_5.html#implicit_duplicate_strategy_for_copy_or_archive_tasks_has_been_deprecated
Copying or archiving duplicate paths with the default duplicates strategy has been deprecated. This is scheduled to be removed in Gradle 7.0. Duplicate path: "META-INF/LICENSE.txt". Explicitly set the duplicates strategy to 'DuplicatesStrategy.INCLUDE' if you want to allow duplicate paths. Consult the upgrading guide for further information: https://docs.gradle.org/6.4/userguide/upgrading_version_5.html#implicit_duplicate_strategy_for_copy_or_archive_tasks_has_been_deprecated
Copying or archiving duplicate paths with the default duplicates strategy has been deprecated. This is scheduled to be removed in Gradle 7.0. Duplicate path: "META-INF/NOTICE.txt". Explicitly set the duplicates strategy to 'DuplicatesStrategy.INCLUDE' if you want to allow duplicate paths. Consult the upgrading guide for further information: https://docs.gradle.org/6.4/userguide/upgrading_version_5.html#implicit_duplicate_strategy_for_copy_or_archive_tasks_has_been_deprecated

> Task :static-binding-generator:copyJarToBuildTools
3 actionable tasks: 3 executed

> Task :generateMdgJar
To honour the JVM settings for this build a new JVM will be forked. Please consider using the daemon: https://docs.gradle.org/6.4/userguide/gradle_daemon.html.
Daemon will be stopped at the end of the build stopping after processing

> Configure project :android-metadata-generator
The compile configuration has been deprecated for dependency declaration. This will fail with an error in Gradle 7.0. Please use the implementation configuration instead. Consult the upgrading guide for further information: https://docs.gradle.org/6.4/userguide/upgrading_version_5.html#dependencies_should_no_longer_be_declared_using_the_compile_and_runtime_configurations
	at build_8qx6x2e529ggcnezerlzur5n8$_run_closure5.doCall(/home/vagrant/build/srclib/NativeScript_android-runtime/test-app/build-tools/android-metadata-generator/build.gradle:47)
	(Run with --stacktrace to get the full stack trace of this deprecation warning.)
The testCompile configuration has been deprecated for dependency declaration. This will fail with an error in Gradle 7.0. Please use the testImplementation configuration instead. Consult the upgrading guide for further information: https://docs.gradle.org/6.4/userguide/upgrading_version_5.html#dependencies_should_no_longer_be_declared_using_the_compile_and_runtime_configurations
	at build_8qx6x2e529ggcnezerlzur5n8$_run_closure5.doCall(/home/vagrant/build/srclib/NativeScript_android-runtime/test-app/build-tools/android-metadata-generator/build.gradle:52)
	(Run with --stacktrace to get the full stack trace of this deprecation warning.)

> Configure project :app
Internal API constructor DefaultDomainObjectSet(Class<T>) has been deprecated. This is scheduled to be removed in Gradle 7.0. Please use ObjectFactory.domainObjectSet(Class<T>) instead. See https://docs.gradle.org/6.4/userguide/custom_gradle_types.html#domainobjectset for more details.
	at build_6py85dmzpz4lpmwdbcvywm8s0.run(/home/vagrant/build/srclib/NativeScript_android-runtime/test-app/app/build.gradle:35)
	(Run with --stacktrace to get the full stack trace of this deprecation warning.)
	 + setting applicationId
	 + couldn't load user-defined configuration from /home/vagrant/build/srclib/app/App_Resources/Android/app.gradle. File doesn't exist.
	 + using android X library androidx.legacy:legacy-support-v4:1.0.0

> Configure project :runtime
WARNING: Support for ANDROID_NDK_HOME is deprecated and will be removed in the future. Use android.ndkVersion in build.gradle instead.
Support for ANDROID_NDK_HOME is deprecated and will be removed in the future. Use android.ndkVersion in build.gradle instead.

> Configure project :app
WARNING: Folder /home/vagrant/build/srclib/NativeScript_android-runtime/test-app/runtime/build/intermediates/runtime_library_classes/debug does not exists, the dependent project's classes won't be included in the metadata

> Configure project :static-binding-generator
The compile configuration has been deprecated for dependency declaration. This will fail with an error in Gradle 7.0. Please use the implementation or api configuration instead. Consult the upgrading guide for further information: https://docs.gradle.org/6.4/userguide/upgrading_version_5.html#dependencies_should_no_longer_be_declared_using_the_compile_and_runtime_configurations
	at build_99samisgx3y8aheva8tb7clh6$_run_closure2.doCall(/home/vagrant/build/srclib/NativeScript_android-runtime/test-app/build-tools/static-binding-generator/build.gradle:13)
	(Run with --stacktrace to get the full stack trace of this deprecation warning.)
The runtime configuration has been deprecated for resolution. This will fail with an error in Gradle 7.0. Please resolve the runtimeClasspath configuration instead. Consult the upgrading guide for further information: https://docs.gradle.org/6.4/userguide/upgrading_version_5.html#dependencies_should_no_longer_be_declared_using_the_compile_and_runtime_configurations
	at build_8qx6x2e529ggcnezerlzur5n8$_run_closure7$_closure16.doCall(/home/vagrant/build/srclib/NativeScript_android-runtime/test-app/build-tools/android-metadata-generator/build.gradle:79)
	(Run with --stacktrace to get the full stack trace of this deprecation warning.)
The compile configuration has been deprecated for resolution. This will fail with an error in Gradle 7.0. Please resolve the compileClasspath configuration instead. Consult the upgrading guide for further information: https://docs.gradle.org/6.4/userguide/upgrading_version_5.html#dependencies_should_no_longer_be_declared_using_the_compile_and_runtime_configurations
	at build_8qx6x2e529ggcnezerlzur5n8$_run_closure7$_closure16.doCall(/home/vagrant/build/srclib/NativeScript_android-runtime/test-app/build-tools/android-metadata-generator/build.gradle:83)
	(Run with --stacktrace to get the full stack trace of this deprecation warning.)

> Task :android-metadata-generator:compileKotlin
> Task :android-metadata-generator:compileJava
> Task :android-metadata-generator:processResources NO-SOURCE
> Task :android-metadata-generator:classes
> Task :android-metadata-generator:inspectClassesForKotlinIC
> Task :android-metadata-generator:jar
> Task :android-metadata-generator:copyJarToBuildTools
5 actionable tasks: 5 executed

> Task :createDistDir

> Task :getPackageVersion
Using runtime version from package.json '7.0.1'
The package version is '7.0.1'

> Task :getCommitVersion

> Task :generateOptimizedRuntimeAar
To honour the JVM settings for this build a new JVM will be forked. Please consider using the daemon: https://docs.gradle.org/6.4/userguide/gradle_daemon.html.
Daemon will be stopped at the end of the build stopping after processing

> Configure project :android-metadata-generator
The compile configuration has been deprecated for dependency declaration. This will fail with an error in Gradle 7.0. Please use the implementation configuration instead. Consult the upgrading guide for further information: https://docs.gradle.org/6.4/userguide/upgrading_version_5.html#dependencies_should_no_longer_be_declared_using_the_compile_and_runtime_configurations
	at build_8qx6x2e529ggcnezerlzur5n8$_run_closure5.doCall(/home/vagrant/build/srclib/NativeScript_android-runtime/test-app/build-tools/android-metadata-generator/build.gradle:47)
	(Run with --stacktrace to get the full stack trace of this deprecation warning.)
The testCompile configuration has been deprecated for dependency declaration. This will fail with an error in Gradle 7.0. Please use the testImplementation configuration instead. Consult the upgrading guide for further information: https://docs.gradle.org/6.4/userguide/upgrading_version_5.html#dependencies_should_no_longer_be_declared_using_the_compile_and_runtime_configurations
	at build_8qx6x2e529ggcnezerlzur5n8$_run_closure5.doCall(/home/vagrant/build/srclib/NativeScript_android-runtime/test-app/build-tools/android-metadata-generator/build.gradle:52)
	(Run with --stacktrace to get the full stack trace of this deprecation warning.)

> Configure project :app
Internal API constructor DefaultDomainObjectSet(Class<T>) has been deprecated. This is scheduled to be removed in Gradle 7.0. Please use ObjectFactory.domainObjectSet(Class<T>) instead. See https://docs.gradle.org/6.4/userguide/custom_gradle_types.html#domainobjectset for more details.
	at build_6py85dmzpz4lpmwdbcvywm8s0.run(/home/vagrant/build/srclib/NativeScript_android-runtime/test-app/app/build.gradle:35)
	(Run with --stacktrace to get the full stack trace of this deprecation warning.)
	 + setting applicationId
	 + couldn't load user-defined configuration from /home/vagrant/build/srclib/app/App_Resources/Android/app.gradle. File doesn't exist.
	 + using android X library androidx.legacy:legacy-support-v4:1.0.0

> Configure project :runtime
Optimized build triggered.
Use CCache build triggered.
WARNING: Support for ANDROID_NDK_HOME is deprecated and will be removed in the future. Use android.ndkVersion in build.gradle instead.
Support for ANDROID_NDK_HOME is deprecated and will be removed in the future. Use android.ndkVersion in build.gradle instead.

> Configure project :app
WARNING: Folder /home/vagrant/build/srclib/NativeScript_android-runtime/test-app/runtime/build/intermediates/runtime_library_classes/debug does not exists, the dependent project's classes won't be included in the metadata

> Configure project :static-binding-generator
The compile configuration has been deprecated for dependency declaration. This will fail with an error in Gradle 7.0. Please use the implementation or api configuration instead. Consult the upgrading guide for further information: https://docs.gradle.org/6.4/userguide/upgrading_version_5.html#dependencies_should_no_longer_be_declared_using_the_compile_and_runtime_configurations
	at build_99samisgx3y8aheva8tb7clh6$_run_closure2.doCall(/home/vagrant/build/srclib/NativeScript_android-runtime/test-app/build-tools/static-binding-generator/build.gradle:13)
	(Run with --stacktrace to get the full stack trace of this deprecation warning.)
File /home/vagrant/.android/repositories.cfg could not be loaded.
Checking the license for package Android SDK Build-Tools 30.0.1 in /opt/android-sdk/licenses
License for package Android SDK Build-Tools 30.0.1 accepted.
Preparing "Install Android SDK Build-Tools 30.0.1 (revision: 30.0.1)".
"Install Android SDK Build-Tools 30.0.1 (revision: 30.0.1)" ready.
Installing Android SDK Build-Tools 30.0.1 in /opt/android-sdk/build-tools/30.0.1
"Install Android SDK Build-Tools 30.0.1 (revision: 30.0.1)" complete.
"Install Android SDK Build-Tools 30.0.1 (revision: 30.0.1)" finished.
Checking the license for package CMake 3.10.2.4988404 in /opt/android-sdk/licenses
License for package CMake 3.10.2.4988404 accepted.
Preparing "Install CMake 3.10.2.4988404 (revision: 3.10.2)".
"Install CMake 3.10.2.4988404 (revision: 3.10.2)" ready.
Installing CMake 3.10.2.4988404 in /opt/android-sdk/cmake/3.10.2.4988404
"Install CMake 3.10.2.4988404 (revision: 3.10.2)" complete.
"Install CMake 3.10.2.4988404 (revision: 3.10.2)" finished.

> Task :runtime:preBuild UP-TO-DATE
> Task :runtime:preReleaseBuild UP-TO-DATE
> Task :runtime:compileReleaseAidl NO-SOURCE

> Task :runtime:generateJsonModelRelease
WARNING: /home/vagrant/build/srclib/NativeScript_android-runtime/test-app/runtime/CMakeLists.txt : C/C++ release|armeabi-v7a : CMake Warning at /opt/android-sdk/ndk/22.1.7171670/build/cmake/android.toolchain.cmake:449 (message):
  An old version of CMake is being used that cannot automatically detect
  compiler attributes.  Compiler identification is being bypassed.  Some
  values may be wrong or missing.  Update to CMake 3.19 or newer to use
  CMake's built-in compiler identification.
Call Stack (most recent call first):
  /opt/android-sdk/cmake/3.10.2.4988404/share/cmake-3.10/Modules/CMakeDetermineSystem.cmake:94 (include)
  CMakeLists.txt

/home/vagrant/build/srclib/NativeScript_android-runtime/test-app/runtime/CMakeLists.txt : C/C++ release|armeabi-v7a : CMake Warning at /opt/android-sdk/ndk/22.1.7171670/build/cmake/android.toolchain.cmake:449 (message):
  An old version of CMake is being used that cannot automatically detect
  compiler attributes.  Compiler identification is being bypassed.  Some
  values may be wrong or missing.  Update to CMake 3.19 or newer to use
  CMake's built-in compiler identification.
Call Stack (most recent call first):
  /opt/android-sdk/cmake/3.10.2.4988404/share/cmake-3.10/Modules/CMakeDetermineSystem.cmake:94 (include)
  CMakeLists.txt

WARNING: /home/vagrant/build/srclib/NativeScript_android-runtime/test-app/runtime/CMakeLists.txt : C/C++ release|armeabi-v7a : CMake Warning at /opt/android-sdk/ndk/22.1.7171670/build/cmake/android.toolchain.cmake:449 (message):
  An old version of CMake is being used that cannot automatically detect
  compiler attributes.  Compiler identification is being bypassed.  Some
  values may be wrong or missing.  Update to CMake 3.19 or newer to use
  CMake's built-in compiler identification.
Call Stack (most recent call first):
  /home/vagrant/build/srclib/NativeScript_android-runtime/test-app/runtime/.cxx/cmake/release/armeabi-v7a/CMakeFiles/3.10.2/CMakeSystem.cmake:6 (include)
  /home/vagrant/build/srclib/NativeScript_android-runtime/test-app/runtime/.cxx/cmake/release/armeabi-v7a/CMakeFiles/CMakeTmp/CMakeLists.txt:2 (project)

/home/vagrant/build/srclib/NativeScript_android-runtime/test-app/runtime/CMakeLists.txt : C/C++ release|armeabi-v7a : CMake Warning at /opt/android-sdk/ndk/22.1.7171670/build/cmake/android.toolchain.cmake:449 (message):
  An old version of CMake is being used that cannot automatically detect
  compiler attributes.  Compiler identification is being bypassed.  Some
  values may be wrong or missing.  Update to CMake 3.19 or newer to use
  CMake's built-in compiler identification.
Call Stack (most recent call first):
  /home/vagrant/build/srclib/NativeScript_android-runtime/test-app/runtime/.cxx/cmake/release/armeabi-v7a/CMakeFiles/3.10.2/CMakeSystem.cmake:6 (include)
  /home/vagrant/build/srclib/NativeScript_android-runtime/test-app/runtime/.cxx/cmake/release/armeabi-v7a/CMakeFiles/CMakeTmp/CMakeLists.txt:2 (project)

WARNING: /home/vagrant/build/srclib/NativeScript_android-runtime/test-app/runtime/CMakeLists.txt : C/C++ release|arm64-v8a : CMake Warning at /opt/android-sdk/ndk/22.1.7171670/build/cmake/android.toolchain.cmake:449 (message):
  An old version of CMake is being used that cannot automatically detect
  compiler attributes.  Compiler identification is being bypassed.  Some
  values may be wrong or missing.  Update to CMake 3.19 or newer to use
  CMake's built-in compiler identification.
Call Stack (most recent call first):
  /opt/android-sdk/cmake/3.10.2.4988404/share/cmake-3.10/Modules/CMakeDetermineSystem.cmake:94 (include)
  CMakeLists.txt

/home/vagrant/build/srclib/NativeScript_android-runtime/test-app/runtime/CMakeLists.txt : C/C++ release|arm64-v8a : CMake Warning at /opt/android-sdk/ndk/22.1.7171670/build/cmake/android.toolchain.cmake:449 (message):
  An old version of CMake is being used that cannot automatically detect
  compiler attributes.  Compiler identification is being bypassed.  Some
  values may be wrong or missing.  Update to CMake 3.19 or newer to use
  CMake's built-in compiler identification.
Call Stack (most recent call first):
  /opt/android-sdk/cmake/3.10.2.4988404/share/cmake-3.10/Modules/CMakeDetermineSystem.cmake:94 (include)
  CMakeLists.txt

WARNING: /home/vagrant/build/srclib/NativeScript_android-runtime/test-app/runtime/CMakeLists.txt : C/C++ release|arm64-v8a : CMake Warning at /opt/android-sdk/ndk/22.1.7171670/build/cmake/android.toolchain.cmake:449 (message):
  An old version of CMake is being used that cannot automatically detect
  compiler attributes.  Compiler identification is being bypassed.  Some
  values may be wrong or missing.  Update to CMake 3.19 or newer to use
  CMake's built-in compiler identification.
Call Stack (most recent call first):
  /home/vagrant/build/srclib/NativeScript_android-runtime/test-app/runtime/.cxx/cmake/release/arm64-v8a/CMakeFiles/3.10.2/CMakeSystem.cmake:6 (include)
  /home/vagrant/build/srclib/NativeScript_android-runtime/test-app/runtime/.cxx/cmake/release/arm64-v8a/CMakeFiles/CMakeTmp/CMakeLists.txt:2 (project)

/home/vagrant/build/srclib/NativeScript_android-runtime/test-app/runtime/CMakeLists.txt : C/C++ release|arm64-v8a : CMake Warning at /opt/android-sdk/ndk/22.1.7171670/build/cmake/android.toolchain.cmake:449 (message):
  An old version of CMake is being used that cannot automatically detect
  compiler attributes.  Compiler identification is being bypassed.  Some
  values may be wrong or missing.  Update to CMake 3.19 or newer to use
  CMake's built-in compiler identification.
Call Stack (most recent call first):
  /home/vagrant/build/srclib/NativeScript_android-runtime/test-app/runtime/.cxx/cmake/release/arm64-v8a/CMakeFiles/3.10.2/CMakeSystem.cmake:6 (include)
  /home/vagrant/build/srclib/NativeScript_android-runtime/test-app/runtime/.cxx/cmake/release/arm64-v8a/CMakeFiles/CMakeTmp/CMakeLists.txt:2 (project)

WARNING: /home/vagrant/build/srclib/NativeScript_android-runtime/test-app/runtime/CMakeLists.txt : C/C++ release|x86 : CMake Warning at /opt/android-sdk/ndk/22.1.7171670/build/cmake/android.toolchain.cmake:449 (message):
  An old version of CMake is being used that cannot automatically detect
  compiler attributes.  Compiler identification is being bypassed.  Some
  values may be wrong or missing.  Update to CMake 3.19 or newer to use
  CMake's built-in compiler identification.
Call Stack (most recent call first):
  /opt/android-sdk/cmake/3.10.2.4988404/share/cmake-3.10/Modules/CMakeDetermineSystem.cmake:94 (include)
  CMakeLists.txt

/home/vagrant/build/srclib/NativeScript_android-runtime/test-app/runtime/CMakeLists.txt : C/C++ release|x86 : CMake Warning at /opt/android-sdk/ndk/22.1.7171670/build/cmake/android.toolchain.cmake:449 (message):
  An old version of CMake is being used that cannot automatically detect
  compiler attributes.  Compiler identification is being bypassed.  Some
  values may be wrong or missing.  Update to CMake 3.19 or newer to use
  CMake's built-in compiler identification.
Call Stack (most recent call first):
  /opt/android-sdk/cmake/3.10.2.4988404/share/cmake-3.10/Modules/CMakeDetermineSystem.cmake:94 (include)
  CMakeLists.txt

WARNING: /home/vagrant/build/srclib/NativeScript_android-runtime/test-app/runtime/CMakeLists.txt : C/C++ release|x86 : CMake Warning at /opt/android-sdk/ndk/22.1.7171670/build/cmake/android.toolchain.cmake:449 (message):
  An old version of CMake is being used that cannot automatically detect
  compiler attributes.  Compiler identification is being bypassed.  Some
  values may be wrong or missing.  Update to CMake 3.19 or newer to use
  CMake's built-in compiler identification.
Call Stack (most recent call first):
  /home/vagrant/build/srclib/NativeScript_android-runtime/test-app/runtime/.cxx/cmake/release/x86/CMakeFiles/3.10.2/CMakeSystem.cmake:6 (include)
  /home/vagrant/build/srclib/NativeScript_android-runtime/test-app/runtime/.cxx/cmake/release/x86/CMakeFiles/CMakeTmp/CMakeLists.txt:2 (project)

/home/vagrant/build/srclib/NativeScript_android-runtime/test-app/runtime/CMakeLists.txt : C/C++ release|x86 : CMake Warning at /opt/android-sdk/ndk/22.1.7171670/build/cmake/android.toolchain.cmake:449 (message):
  An old version of CMake is being used that cannot automatically detect
  compiler attributes.  Compiler identification is being bypassed.  Some
  values may be wrong or missing.  Update to CMake 3.19 or newer to use
  CMake's built-in compiler identification.
Call Stack (most recent call first):
  /home/vagrant/build/srclib/NativeScript_android-runtime/test-app/runtime/.cxx/cmake/release/x86/CMakeFiles/3.10.2/CMakeSystem.cmake:6 (include)
  /home/vagrant/build/srclib/NativeScript_android-runtime/test-app/runtime/.cxx/cmake/release/x86/CMakeFiles/CMakeTmp/CMakeLists.txt:2 (project)

WARNING: /home/vagrant/build/srclib/NativeScript_android-runtime/test-app/runtime/CMakeLists.txt : C/C++ release|x86_64 : CMake Warning at /opt/android-sdk/ndk/22.1.7171670/build/cmake/android.toolchain.cmake:449 (message):
  An old version of CMake is being used that cannot automatically detect
  compiler attributes.  Compiler identification is being bypassed.  Some
  values may be wrong or missing.  Update to CMake 3.19 or newer to use
  CMake's built-in compiler identification.
Call Stack (most recent call first):
  /opt/android-sdk/cmake/3.10.2.4988404/share/cmake-3.10/Modules/CMakeDetermineSystem.cmake:94 (include)
  CMakeLists.txt

/home/vagrant/build/srclib/NativeScript_android-runtime/test-app/runtime/CMakeLists.txt : C/C++ release|x86_64 : CMake Warning at /opt/android-sdk/ndk/22.1.7171670/build/cmake/android.toolchain.cmake:449 (message):
  An old version of CMake is being used that cannot automatically detect
  compiler attributes.  Compiler identification is being bypassed.  Some
  values may be wrong or missing.  Update to CMake 3.19 or newer to use
  CMake's built-in compiler identification.
Call Stack (most recent call first):
  /opt/android-sdk/cmake/3.10.2.4988404/share/cmake-3.10/Modules/CMakeDetermineSystem.cmake:94 (include)
  CMakeLists.txt

WARNING: /home/vagrant/build/srclib/NativeScript_android-runtime/test-app/runtime/CMakeLists.txt : C/C++ release|x86_64 : CMake Warning at /opt/android-sdk/ndk/22.1.7171670/build/cmake/android.toolchain.cmake:449 (message):
  An old version of CMake is being used that cannot automatically detect
  compiler attributes.  Compiler identification is being bypassed.  Some
  values may be wrong or missing.  Update to CMake 3.19 or newer to use
  CMake's built-in compiler identification.
Call Stack (most recent call first):
  /home/vagrant/build/srclib/NativeScript_android-runtime/test-app/runtime/.cxx/cmake/release/x86_64/CMakeFiles/3.10.2/CMakeSystem.cmake:6 (include)
  /home/vagrant/build/srclib/NativeScript_android-runtime/test-app/runtime/.cxx/cmake/release/x86_64/CMakeFiles/CMakeTmp/CMakeLists.txt:2 (project)

/home/vagrant/build/srclib/NativeScript_android-runtime/test-app/runtime/CMakeLists.txt : C/C++ release|x86_64 : CMake Warning at /opt/android-sdk/ndk/22.1.7171670/build/cmake/android.toolchain.cmake:449 (message):
  An old version of CMake is being used that cannot automatically detect
  compiler attributes.  Compiler identification is being bypassed.  Some
  values may be wrong or missing.  Update to CMake 3.19 or newer to use
  CMake's built-in compiler identification.
Call Stack (most recent call first):
  /home/vagrant/build/srclib/NativeScript_android-runtime/test-app/runtime/.cxx/cmake/release/x86_64/CMakeFiles/3.10.2/CMakeSystem.cmake:6 (include)
  /home/vagrant/build/srclib/NativeScript_android-runtime/test-app/runtime/.cxx/cmake/release/x86_64/CMakeFiles/CMakeTmp/CMakeLists.txt:2 (project)


> Task :runtime:setPackageVersion
Setting runtime version: '7.0.1'

> Task :runtime:setRuntimeCommit
Setting runtime commit: 'no commit sha was provided by build.gradle build'

> Task :runtime:externalNativeBuildRelease
Build NativeScript_armeabi-v7a
ninja: Entering directory `/home/vagrant/build/srclib/NativeScript_android-runtime/test-app/runtime/.cxx/cmake/release/armeabi-v7a'
[1/42] Building CXX object CMakeFiles/NativeScript.dir/src/main/cpp/Constants.cpp.o
[2/42] Building CXX object CMakeFiles/NativeScript.dir/src/main/cpp/DirectBuffer.cpp.o
[3/42] Building CXX object CMakeFiles/NativeScript.dir/src/main/cpp/AssetExtractor.cpp.o
[4/42] Building CXX object CMakeFiles/NativeScript.dir/src/main/cpp/ArrayElementAccessor.cpp.o
[5/42] Building CXX object CMakeFiles/NativeScript.dir/src/main/cpp/ArrayBufferHelper.cpp.o
[6/42] Building CXX object CMakeFiles/NativeScript.dir/src/main/cpp/ArrayHelper.cpp.o
[7/42] Building CXX object CMakeFiles/NativeScript.dir/src/main/cpp/JEnv.cpp.o
[8/42] Building CXX object CMakeFiles/NativeScript.dir/src/main/cpp/File.cpp.o
[9/42] Building CXX object CMakeFiles/NativeScript.dir/src/main/cpp/FieldAccessor.cpp.o
[10/42] Building CXX object CMakeFiles/NativeScript.dir/src/main/cpp/ArgConverter.cpp.o
[11/42] Building CXX object CMakeFiles/NativeScript.dir/src/main/cpp/Logger.cpp.o
[12/42] Building CXX object CMakeFiles/NativeScript.dir/src/main/cpp/JType.cpp.o
[13/42] Building CXX object CMakeFiles/NativeScript.dir/src/main/cpp/DesugaredInterfaceCompanionClassNameResolver.cpp.o
[14/42] Building CXX object CMakeFiles/NativeScript.dir/src/main/cpp/JniSignatureParser.cpp.o
[15/42] Building CXX object CMakeFiles/NativeScript.dir/src/main/cpp/ManualInstrumentation.cpp.o
[16/42] Building CXX object CMakeFiles/NativeScript.dir/src/main/cpp/MetadataMethodInfo.cpp.o
[17/42] Building CXX object CMakeFiles/NativeScript.dir/src/main/cpp/JSONObjectHelper.cpp.o
[18/42] Building CXX object CMakeFiles/NativeScript.dir/src/main/cpp/CallbackHandlers.cpp.o
[19/42] Building CXX object CMakeFiles/NativeScript.dir/src/main/cpp/JsArgToArrayConverter.cpp.o
[20/42] Building CXX object CMakeFiles/NativeScript.dir/src/main/cpp/JsArgConverter.cpp.o
[21/42] Building CXX object CMakeFiles/NativeScript.dir/src/main/cpp/MetadataTreeNode.cpp.o
[22/42] Building CXX object CMakeFiles/NativeScript.dir/src/main/cpp/MetadataReader.cpp.o
[23/42] Building CXX object CMakeFiles/NativeScript.dir/src/main/cpp/MessageLoopTimer.cpp.o
[24/42] Building CXX object CMakeFiles/NativeScript.dir/src/main/cpp/MethodCache.cpp.o
[25/42] Building CXX object CMakeFiles/NativeScript.dir/src/main/cpp/ReadWriteLock.cpp.o
[26/42] Building CXX object CMakeFiles/NativeScript.dir/src/main/cpp/NativeScriptException.cpp.o
[27/42] Building CXX object CMakeFiles/NativeScript.dir/src/main/cpp/NumericCasts.cpp.o
[28/42] Building CXX object CMakeFiles/NativeScript.dir/src/main/cpp/SimpleAllocator.cpp.o
[29/42] Building CXX object CMakeFiles/NativeScript.dir/src/main/cpp/Profiler.cpp.o
[30/42] Building CXX object CMakeFiles/NativeScript.dir/src/main/cpp/ModuleInternal.cpp.o
[31/42] Building CXX object CMakeFiles/NativeScript.dir/src/main/cpp/Util.cpp.o
FAILED: CMakeFiles/NativeScript.dir/src/main/cpp/Util.cpp.o 
/opt/android-sdk/ndk/22.1.7171670/toolchains/llvm/prebuilt/linux-x86_64/bin/clang++ --target=armv7-none-linux-androideabi17 --gcc-toolchain=/opt/android-sdk/ndk/22.1.7171670/toolchains/llvm/prebuilt/linux-x86_64 --sysroot=/opt/android-sdk/ndk/22.1.7171670/toolchains/llvm/prebuilt/linux-x86_64/sysroot  -DNativeScript_EXPORTS -I../../../../src/main/cpp/include/libc++ -I../../../../src/main/cpp -I../../../../src/main/cpp/include -I../../../../src/main/cpp/v8_inspector -I../../../../src/main/libs/armeabi-v7a/include -nostdinc++ -std=c++14 -Werror -Wno-unused-result -mstackrealign -fexceptions -fno-builtin-stpcpy -fno-rtti -D_LIBCPP_ABI_VERSION=Cr -D_LIBCPP_ENABLE_NODISCARD -D_LIBCPP_ABI_UNSTABLE -DV8_31BIT_SMIS_ON_64BIT_ARCH -DV8_31BIT_SMIS_ON_64BIT_ARCH -DV8_ENABLE_REGEXP_INTERPRETER_THREADED_DISPATCH -DV8_EMBEDDED_BUILTINS -O3 -fvisibility=hidden -ffunction-sections -fno-data-sections -Oz -DNDEBUG  -fPIC -MD -MT CMakeFiles/NativeScript.dir/src/main/cpp/Util.cpp.o -MF CMakeFiles/NativeScript.dir/src/main/cpp/Util.cpp.o.d -o CMakeFiles/NativeScript.dir/src/main/cpp/Util.cpp.o -c ../../../../src/main/cpp/Util.cpp
../../../../src/main/cpp/Util.cpp:118:24: error: address of stack memory associated with local variable 'utf16String' returned [-Werror,-Wreturn-stack-address]
    return (uint16_t*) utf16String.c_str();
                       ^~~~~~~~~~~
1 error generated.
[32/42] Building CXX object CMakeFiles/NativeScript.dir/src/main/cpp/V8GlobalHelpers.cpp.o
[33/42] Building CXX object CMakeFiles/NativeScript.dir/src/main/cpp/SimpleProfiler.cpp.o
[34/42] Building CXX object CMakeFiles/NativeScript.dir/src/main/cpp/V8StringConstants.cpp.o
[35/42] Building CXX object CMakeFiles/NativeScript.dir/src/main/cpp/ObjectManager.cpp.o
[36/42] Building CXX object CMakeFiles/NativeScript.dir/src/main/cpp/WeakRef.cpp.o
[37/42] Building CXX object CMakeFiles/NativeScript.dir/src/main/cpp/MetadataNode.cpp.o
[38/42] Building CXX object CMakeFiles/NativeScript.dir/src/main/cpp/Runtime.cpp.o
ninja: build stopped: subcommand failed.

> Task :runtime:externalNativeBuildRelease FAILED

Execution failed for task ':runtime:externalNativeBuildRelease'.
Build command failed.
Error while executing process /opt/android-sdk/cmake/3.10.2.4988404/bin/ninja with arguments {-C /home/vagrant/build/srclib/NativeScript_android-runtime/test-app/runtime/.cxx/cmake/release/armeabi-v7a NativeScript}
ninja: Entering directory `/home/vagrant/build/srclib/NativeScript_android-runtime/test-app/runtime/.cxx/cmake/release/armeabi-v7a'
[1/42] Building CXX object CMakeFiles/NativeScript.dir/src/main/cpp/Constants.cpp.o
[2/42] Building CXX object CMakeFiles/NativeScript.dir/src/main/cpp/DirectBuffer.cpp.o
[3/42] Building CXX object CMakeFiles/NativeScript.dir/src/main/cpp/AssetExtractor.cpp.o
[4/42] Building CXX object CMakeFiles/NativeScript.dir/src/main/cpp/ArrayElementAccessor.cpp.o
[5/42] Building CXX object CMakeFiles/NativeScript.dir/src/main/cpp/ArrayBufferHelper.cpp.o
[6/42] Building CXX object CMakeFiles/NativeScript.dir/src/main/cpp/ArrayHelper.cpp.o
[7/42] Building CXX object CMakeFiles/NativeScript.dir/src/main/cpp/JEnv.cpp.o
[8/42] Building CXX object CMakeFiles/NativeScript.dir/src/main/cpp/File.cpp.o
[9/42] Building CXX object CMakeFiles/NativeScript.dir/src/main/cpp/FieldAccessor.cpp.o
[10/42] Building CXX object CMakeFiles/NativeScript.dir/src/main/cpp/ArgConverter.cpp.o
[11/42] Building CXX object CMakeFiles/NativeScript.dir/src/main/cpp/Logger.cpp.o
[12/42] Building CXX object CMakeFiles/NativeScript.dir/src/main/cpp/JType.cpp.o
[13/42] Building CXX object CMakeFiles/NativeScript.dir/src/main/cpp/DesugaredInterfaceCompanionClassNameResolver.cpp.o
[14/42] Building CXX object CMakeFiles/NativeScript.dir/src/main/cpp/JniSignatureParser.cpp.o
[15/42] Building CXX object CMakeFiles/NativeScript.dir/src/main/cpp/ManualInstrumentation.cpp.o
[16/42] Building CXX object CMakeFiles/NativeScript.dir/src/main/cpp/MetadataMethodInfo.cpp.o
[17/42] Building CXX object CMakeFiles/NativeScript.dir/src/main/cpp/JSONObjectHelper.cpp.o
[18/42] Building CXX object CMakeFiles/NativeScript.dir/src/main/cpp/CallbackHandlers.cpp.o
[19/42] Building CXX object CMakeFiles/NativeScript.dir/src/main/cpp/JsArgToArrayConverter.cpp.o
[20/42] Building CXX object CMakeFiles/NativeScript.dir/src/main/cpp/JsArgConverter.cpp.o
[21/42] Building CXX object CMakeFiles/NativeScript.dir/src/main/cpp/MetadataTreeNode.cpp.o
[22/42] Building CXX object CMakeFiles/NativeScript.dir/src/main/cpp/MetadataReader.cpp.o
[23/42] Building CXX object CMakeFiles/NativeScript.dir/src/main/cpp/MessageLoopTimer.cpp.o
[24/42] Building CXX object CMakeFiles/NativeScript.dir/src/main/cpp/MethodCache.cpp.o
[25/42] Building CXX object CMakeFiles/NativeScript.dir/src/main/cpp/ReadWriteLock.cpp.o
[26/42] Building CXX object CMakeFiles/NativeScript.dir/src/main/cpp/NativeScriptException.cpp.o
[27/42] Building CXX object CMakeFiles/NativeScript.dir/src/main/cpp/NumericCasts.cpp.o
[28/42] Building CXX object CMakeFiles/NativeScript.dir/src/main/cpp/SimpleAllocator.cpp.o
[29/42] Building CXX object CMakeFiles/NativeScript.dir/src/main/cpp/Profiler.cpp.o
[30/42] Building CXX object CMakeFiles/NativeScript.dir/src/main/cpp/ModuleInternal.cpp.o
[31/42] Building CXX object CMakeFiles/NativeScript.dir/src/main/cpp/Util.cpp.o
FAILED: CMakeFiles/NativeScript.dir/src/main/cpp/Util.cpp.o 
/opt/android-sdk/ndk/22.1.7171670/toolchains/llvm/prebuilt/linux-x86_64/bin/clang++ --target=armv7-none-linux-androideabi17 --gcc-toolchain=/opt/android-sdk/ndk/22.1.7171670/toolchains/llvm/prebuilt/linux-x86_64 --sysroot=/opt/android-sdk/ndk/22.1.7171670/toolchains/llvm/prebuilt/linux-x86_64/sysroot  -DNativeScript_EXPORTS -I../../../../src/main/cpp/include/libc++ -I../../../../src/main/cpp -I../../../../src/main/cpp/include -I../../../../src/main/cpp/v8_inspector -I../../../../src/main/libs/armeabi-v7a/include -nostdinc++ -std=c++14 -Werror -Wno-unused-result -mstackrealign -fexceptions -fno-builtin-stpcpy -fno-rtti -D_LIBCPP_ABI_VERSION=Cr -D_LIBCPP_ENABLE_NODISCARD -D_LIBCPP_ABI_UNSTABLE -DV8_31BIT_SMIS_ON_64BIT_ARCH -DV8_31BIT_SMIS_ON_64BIT_ARCH -DV8_ENABLE_REGEXP_INTERPRETER_THREADED_DISPATCH -DV8_EMBEDDED_BUILTINS -O3 -fvisibility=hidden -ffunction-sections -fno-data-sections -Oz -DNDEBUG  -fPIC -MD -MT CMakeFiles/NativeScript.dir/src/main/cpp/Util.cpp.o -MF CMakeFiles/NativeScript.dir/src/main/cpp/Util.cpp.o.d -o CMakeFiles/NativeScript.dir/src/main/cpp/Util.cpp.o -c ../../../../src/main/cpp/Util.cpp
../../../../src/main/cpp/Util.cpp:118:24: error: address of stack memory associated with local variable 'utf16String' returned [-Werror,-Wreturn-stack-address]
    return (uint16_t*) utf16String.c_str();
                       ^~~~~~~~~~~
1 error generated.
[32/42] Building CXX object CMakeFiles/NativeScript.dir/src/main/cpp/V8GlobalHelpers.cpp.o
[33/42] Building CXX object CMakeFiles/NativeScript.dir/src/main/cpp/SimpleProfiler.cpp.o
[34/42] Building CXX object CMakeFiles/NativeScript.dir/src/main/cpp/V8StringConstants.cpp.o
[35/42] Building CXX object CMakeFiles/NativeScript.dir/src/main/cpp/ObjectManager.cpp.o
[36/42] Building CXX object CMakeFiles/NativeScript.dir/src/main/cpp/WeakRef.cpp.o
[37/42] Building CXX object CMakeFiles/NativeScript.dir/src/main/cpp/MetadataNode.cpp.o
[38/42] Building CXX object CMakeFiles/NativeScript.dir/src/main/cpp/Runtime.cpp.o
ninja: build stopped: subcommand failed.



4 actionable tasks: 4 executed

> Task :generateOptimizedRuntimeAar FAILED

FAILURE: Build failed with an exception.

* What went wrong:
Execution failed for task ':generateOptimizedRuntimeAar'.
> Process 'command './gradlew'' finished with non-zero exit value 1

* Try:
Run with --stacktrace option to get the stack trace. Run with --info or --debug option to get more log output. Run with --scan to get full insights.

* Get more help at https://help.gradle.org

BUILD FAILED in 2m 15s
9 actionable tasks: 8 executed, 1 up-to-date
+ cd platforms/android/app/build/outputs/apk/release
bash: line 0: cd: platforms/android/app/build/outputs/apk/release: No such file or directory
2021-07-27 01:38:36,694 ERROR: Could not build app com.vishnuraghav.EnRecipes: Error running build command for com.vishnuraghav.EnRecipes:2.0.0
==== detail begin ====
+ pushd /home/vagrant/build/srclib/NativeScript_NativeScript/packages/ui-mobile-base/android/widgets
~/build/srclib/NativeScript_NativeScript/packages/ui-mobile-base/android/widgets ~/build/com.vishnuraghav.EnRecipes
+ gradle assembleRelease
Found 4.7 via distributionUrl
Downloading missing gradle version 4.7
cachedir
/tmp/tmp.nFHRgAMKLf/gradle-4.7-bin.zip: OK
Running /opt/gradle/versions/4.7/bin/gradle assembleRelease

Welcome to Gradle 4.7!

Here are the highlights of this release:
 - Incremental annotation processing
 - JDK 10 support
 - Grouped non-interactive console logs
 - Failed tests are re-run first for quicker feedback

For more details see https://docs.gradle.org/4.7/release-notes.html

Download https://dl.google.com/dl/android/maven2/com/android/tools/build/gradle/3.2.0/gradle-3.2.0.pom
Download https://dl.google.com/dl/android/maven2/com/android/tools/lint/lint-gradle-api/26.2.0/lint-gradle-api-26.2.0.pom
Download https://dl.google.com/dl/android/maven2/com/android/tools/build/gradle-api/3.2.0/gradle-api-3.2.0.pom
Download https://dl.google.com/dl/android/maven2/com/android/tools/analytics-library/crash/26.2.0/crash-26.2.0.pom
Download https://dl.google.com/dl/android/maven2/com/android/tools/build/builder/3.2.0/builder-3.2.0.pom
Download https://dl.google.com/dl/android/maven2/com/android/tools/analytics-library/shared/26.2.0/shared-26.2.0.pom
Download https://dl.google.com/dl/android/maven2/com/android/tools/build/transform-api/2.0.0-deprecated-use-gradle-api/transform-api-2.0.0-deprecated-use-gradle-api.pom
Download https://dl.google.com/dl/android/maven2/androidx/databinding/databinding-compiler-common/3.2.0/databinding-compiler-common-3.2.0.pom
Download https://jcenter.bintray.com/org/ow2/asm/asm-util/6.0/asm-util-6.0.pom
Download https://jcenter.bintray.com/org/ow2/asm/asm/6.0/asm-6.0.pom
Download https://jcenter.bintray.com/org/ow2/asm/asm-commons/6.0/asm-commons-6.0.pom
Download https://jcenter.bintray.com/org/ow2/asm/asm-analysis/6.0/asm-analysis-6.0.pom
Download https://jcenter.bintray.com/net/sf/jopt-simple/jopt-simple/4.9/jopt-simple-4.9.pom
Download https://jcenter.bintray.com/net/sf/proguard/proguard-gradle/6.0.3/proguard-gradle-6.0.3.pom
Download https://jcenter.bintray.com/org/ow2/asm/asm-parent/6.0/asm-parent-6.0.pom
Download https://jcenter.bintray.com/net/sf/proguard/proguard-parent/6.0.3/proguard-parent-6.0.3.pom
Download https://jcenter.bintray.com/org/sonatype/oss/oss-parent/7/oss-parent-7.pom
Download https://dl.google.com/dl/android/maven2/com/android/tools/build/jetifier/jetifier-core/1.0.0-alpha10/jetifier-core-1.0.0-alpha10.pom
Download https://jcenter.bintray.com/org/ow2/ow2/1.3/ow2-1.3.pom
Download https://dl.google.com/dl/android/maven2/com/android/tools/build/bundletool/0.5.0/bundletool-0.5.0.pom
Download https://dl.google.com/dl/android/maven2/com/android/tools/build/jetifier/jetifier-processor/1.0.0-alpha10/jetifier-processor-1.0.0-alpha10.pom
Download https://jcenter.bintray.com/org/jetbrains/kotlin/kotlin-stdlib-jre8/1.2.0/kotlin-stdlib-jre8-1.2.0.pom
Download https://dl.google.com/dl/android/maven2/com/android/tools/ddms/ddmlib/26.2.0/ddmlib-26.2.0.pom
Download https://dl.google.com/dl/android/maven2/com/android/tools/build/builder-test-api/3.2.0/builder-test-api-3.2.0.pom
Download https://dl.google.com/dl/android/maven2/com/android/tools/build/manifest-merger/26.2.0/manifest-merger-26.2.0.pom
Download https://dl.google.com/dl/android/maven2/com/android/tools/common/26.2.0/common-26.2.0.pom
Download https://dl.google.com/dl/android/maven2/com/android/tools/sdklib/26.2.0/sdklib-26.2.0.pom
Download https://dl.google.com/dl/android/maven2/com/android/tools/build/builder-model/3.2.0/builder-model-3.2.0.pom
Download https://dl.google.com/dl/android/maven2/com/android/tools/build/apksig/3.2.0/apksig-3.2.0.pom
Download https://dl.google.com/dl/android/maven2/com/android/tools/analytics-library/tracker/26.2.0/tracker-26.2.0.pom
Download https://dl.google.com/dl/android/maven2/com/android/tools/build/apkzlib/3.2.0/apkzlib-3.2.0.pom
Download https://dl.google.com/dl/android/maven2/com/android/tools/analytics-library/protos/26.2.0/protos-26.2.0.pom
Download https://jcenter.bintray.com/com/squareup/javawriter/2.5.0/javawriter-2.5.0.pom
Download https://jcenter.bintray.com/org/bouncycastle/bcpkix-jdk15on/1.56/bcpkix-jdk15on-1.56.pom
Download https://jcenter.bintray.com/org/ow2/asm/asm-tree/6.0/asm-tree-6.0.pom
Download https://dl.google.com/dl/android/maven2/com/android/tools/sdk-common/26.2.0/sdk-common-26.2.0.pom
Download https://jcenter.bintray.com/com/googlecode/json-simple/json-simple/1.1/json-simple-1.1.pom
Download https://jcenter.bintray.com/org/bouncycastle/bcprov-jdk15on/1.56/bcprov-jdk15on-1.56.pom
Download https://jcenter.bintray.com/it/unimi/dsi/fastutil/7.2.0/fastutil-7.2.0.pom
Download https://dl.google.com/dl/android/maven2/com/android/tools/annotations/26.2.0/annotations-26.2.0.pom
Download https://jcenter.bintray.com/com/google/code/gson/gson/2.8.0/gson-2.8.0.pom
Download https://jcenter.bintray.com/com/google/guava/guava/23.0/guava-23.0.pom
Download https://jcenter.bintray.com/com/google/code/gson/gson-parent/2.8.0/gson-parent-2.8.0.pom
Download https://jcenter.bintray.com/com/google/guava/guava-parent/23.0/guava-parent-23.0.pom
Download https://jcenter.bintray.com/org/apache/httpcomponents/httpcore/4.4.5/httpcore-4.4.5.pom
Download https://jcenter.bintray.com/org/apache/httpcomponents/httpclient/4.5.2/httpclient-4.5.2.pom
Download https://jcenter.bintray.com/org/apache/httpcomponents/httpmime/4.5.2/httpmime-4.5.2.pom
Download https://jcenter.bintray.com/org/apache/httpcomponents/httpcomponents-core/4.4.5/httpcomponents-core-4.4.5.pom
Download https://jcenter.bintray.com/org/apache/httpcomponents/httpcomponents-client/4.5.2/httpcomponents-client-4.5.2.pom
Download https://jcenter.bintray.com/org/apache/httpcomponents/project/7/project-7.pom
Download https://jcenter.bintray.com/org/apache/apache/13/apache-13.pom
Download https://jcenter.bintray.com/org/jetbrains/kotlin/kotlin-reflect/1.2.0/kotlin-reflect-1.2.0.pom
Download https://dl.google.com/dl/android/maven2/androidx/databinding/databinding-common/3.2.0/databinding-common-3.2.0.pom
Download https://dl.google.com/dl/android/maven2/com/android/databinding/baseLibrary/3.2.0/baseLibrary-3.2.0.pom
Download https://jcenter.bintray.com/com/squareup/javapoet/1.8.0/javapoet-1.8.0.pom
Download https://jcenter.bintray.com/org/antlr/antlr4/4.5.3/antlr4-4.5.3.pom
Download https://jcenter.bintray.com/com/googlecode/juniversalchardet/juniversalchardet/1.0.3/juniversalchardet-1.0.3.pom
Download https://jcenter.bintray.com/commons-io/commons-io/2.4/commons-io-2.4.pom
Download https://jcenter.bintray.com/org/antlr/antlr4-master/4.5.3/antlr4-master-4.5.3.pom
Download https://jcenter.bintray.com/org/apache/commons/commons-parent/25/commons-parent-25.pom
Download https://jcenter.bintray.com/org/sonatype/oss/oss-parent/9/oss-parent-9.pom
Download https://jcenter.bintray.com/org/apache/apache/9/apache-9.pom
Download https://jcenter.bintray.com/org/jetbrains/kotlin/kotlin-stdlib/1.2.0/kotlin-stdlib-1.2.0.pom
Download https://jcenter.bintray.com/org/jetbrains/kotlin/kotlin-stdlib-jre7/1.2.0/kotlin-stdlib-jre7-1.2.0.pom
Download https://jcenter.bintray.com/net/sf/proguard/proguard-base/6.0.3/proguard-base-6.0.3.pom
Download https://dl.google.com/dl/android/maven2/com/android/tools/build/aapt2-proto/0.3.1/aapt2-proto-0.3.1.pom
Download https://jcenter.bintray.com/com/google/errorprone/error_prone_annotations/2.2.0/error_prone_annotations-2.2.0.pom
Download https://jcenter.bintray.com/com/google/protobuf/protobuf-java/3.4.0/protobuf-java-3.4.0.pom
Download https://jcenter.bintray.com/com/google/protobuf/protobuf-java-util/3.4.0/protobuf-java-util-3.4.0.pom
Download https://jcenter.bintray.com/com/google/auto/value/auto-value/1.5.2/auto-value-1.5.2.pom
Download https://jcenter.bintray.com/com/google/protobuf/protobuf-parent/3.4.0/protobuf-parent-3.4.0.pom
Download https://jcenter.bintray.com/com/google/errorprone/error_prone_parent/2.2.0/error_prone_parent-2.2.0.pom
Download https://jcenter.bintray.com/com/google/auto/auto-parent/3/auto-parent-3.pom
Download https://jcenter.bintray.com/com/google/google/1/google-1.pom
Download https://jcenter.bintray.com/org/jetbrains/kotlin/kotlin-stdlib/1.2.20/kotlin-stdlib-1.2.20.pom
Download https://jcenter.bintray.com/org/jdom/jdom2/2.0.6/jdom2-2.0.6.pom
Download https://dl.google.com/dl/android/maven2/com/android/tools/dvlib/26.2.0/dvlib-26.2.0.pom
Download https://dl.google.com/dl/android/maven2/com/android/tools/layoutlib/layoutlib-api/26.2.0/layoutlib-api-26.2.0.pom
Download https://dl.google.com/dl/android/maven2/com/android/tools/repository/26.2.0/repository-26.2.0.pom
Download https://jcenter.bintray.com/org/apache/commons/commons-compress/1.12/commons-compress-1.12.pom
Download https://jcenter.bintray.com/org/apache/commons/commons-parent/39/commons-parent-39.pom
Download https://jcenter.bintray.com/org/apache/apache/16/apache-16.pom
Download https://jcenter.bintray.com/javax/inject/javax.inject/1/javax.inject-1.pom
Download https://jcenter.bintray.com/net/sf/kxml/kxml2/2.3.0/kxml2-2.3.0.pom
Download https://jcenter.bintray.com/com/google/code/findbugs/jsr305/1.3.9/jsr305-1.3.9.pom
Download https://jcenter.bintray.com/com/google/j2objc/j2objc-annotations/1.1/j2objc-annotations-1.1.pom
Download https://jcenter.bintray.com/org/codehaus/mojo/animal-sniffer-annotations/1.14/animal-sniffer-annotations-1.14.pom
Download https://jcenter.bintray.com/org/codehaus/mojo/animal-sniffer-parent/1.14/animal-sniffer-parent-1.14.pom
Download https://jcenter.bintray.com/org/codehaus/mojo/mojo-parent/34/mojo-parent-34.pom
Download https://jcenter.bintray.com/org/codehaus/codehaus-parent/4/codehaus-parent-4.pom
Download https://jcenter.bintray.com/commons-logging/commons-logging/1.2/commons-logging-1.2.pom
Download https://jcenter.bintray.com/commons-codec/commons-codec/1.9/commons-codec-1.9.pom
Download https://jcenter.bintray.com/org/apache/commons/commons-parent/32/commons-parent-32.pom
Download https://jcenter.bintray.com/org/apache/commons/commons-parent/34/commons-parent-34.pom
Download https://jcenter.bintray.com/org/jetbrains/annotations/13.0/annotations-13.0.pom
Download https://jcenter.bintray.com/com/sun/activation/javax.activation/1.2.0/javax.activation-1.2.0.pom
Download https://jcenter.bintray.com/com/google/jimfs/jimfs/1.1/jimfs-1.1.pom
Download https://jcenter.bintray.com/org/glassfish/jaxb/jaxb-runtime/2.2.11/jaxb-runtime-2.2.11.pom
Download https://jcenter.bintray.com/com/google/jimfs/jimfs-parent/1.1/jimfs-parent-1.1.pom
Download https://jcenter.bintray.com/com/sun/activation/all/1.2.0/all-1.2.0.pom
Download https://jcenter.bintray.com/com/sun/xml/bind/mvn/jaxb-runtime-parent/2.2.11/jaxb-runtime-parent-2.2.11.pom
Download https://jcenter.bintray.com/com/sun/xml/bind/mvn/jaxb-parent/2.2.11/jaxb-parent-2.2.11.pom
Download https://jcenter.bintray.com/net/java/jvnet-parent/1/jvnet-parent-1.pom
Download https://jcenter.bintray.com/com/sun/xml/bind/jaxb-bom-ext/2.2.11/jaxb-bom-ext-2.2.11.pom
Download https://jcenter.bintray.com/org/glassfish/jaxb/jaxb-bom/2.2.11/jaxb-bom-2.2.11.pom
Download https://jcenter.bintray.com/net/java/jvnet-parent/4/jvnet-parent-4.pom
Download https://jcenter.bintray.com/com/sun/xml/fastinfoset/FastInfoset/1.2.13/FastInfoset-1.2.13.pom
Download https://jcenter.bintray.com/org/jvnet/staxex/stax-ex/1.7.7/stax-ex-1.7.7.pom
Download https://jcenter.bintray.com/org/glassfish/jaxb/jaxb-core/2.2.11/jaxb-core-2.2.11.pom
Download https://jcenter.bintray.com/com/sun/xml/fastinfoset/fastinfoset-project/1.2.13/fastinfoset-project-1.2.13.pom
Download https://jcenter.bintray.com/net/java/jvnet-parent/3/jvnet-parent-3.pom
Download https://jcenter.bintray.com/com/sun/istack/istack-commons-runtime/2.21/istack-commons-runtime-2.21.pom
Download https://jcenter.bintray.com/javax/xml/bind/jaxb-api/2.2.12-b140109.1041/jaxb-api-2.2.12-b140109.1041.pom
Download https://jcenter.bintray.com/org/glassfish/jaxb/txw2/2.2.11/txw2-2.2.11.pom
Download https://jcenter.bintray.com/com/sun/xml/bind/mvn/jaxb-txw-parent/2.2.11/jaxb-txw-parent-2.2.11.pom
Download https://jcenter.bintray.com/com/sun/istack/istack-commons/2.21/istack-commons-2.21.pom
Download https://dl.google.com/dl/android/maven2/com/android/tools/analytics-library/tracker/26.2.0/tracker-26.2.0.jar
Download https://dl.google.com/dl/android/maven2/com/android/tools/analytics-library/crash/26.2.0/crash-26.2.0.jar
Download https://dl.google.com/dl/android/maven2/com/android/tools/analytics-library/shared/26.2.0/shared-26.2.0.jar
Download https://dl.google.com/dl/android/maven2/com/android/tools/build/builder/3.2.0/builder-3.2.0.jar
Download https://dl.google.com/dl/android/maven2/com/android/tools/build/gradle/3.2.0/gradle-3.2.0.jar
Download https://dl.google.com/dl/android/maven2/com/android/tools/build/gradle-api/3.2.0/gradle-api-3.2.0.jar
Download https://dl.google.com/dl/android/maven2/androidx/databinding/databinding-compiler-common/3.2.0/databinding-compiler-common-3.2.0.jar
Download https://dl.google.com/dl/android/maven2/com/android/tools/build/manifest-merger/26.2.0/manifest-merger-26.2.0.jar
Download https://dl.google.com/dl/android/maven2/com/android/tools/sdk-common/26.2.0/sdk-common-26.2.0.jar
Download https://dl.google.com/dl/android/maven2/com/android/tools/build/builder-test-api/3.2.0/builder-test-api-3.2.0.jar
Download https://dl.google.com/dl/android/maven2/com/android/tools/sdklib/26.2.0/sdklib-26.2.0.jar
Download https://dl.google.com/dl/android/maven2/com/android/tools/ddms/ddmlib/26.2.0/ddmlib-26.2.0.jar
Download https://dl.google.com/dl/android/maven2/com/android/tools/layoutlib/layoutlib-api/26.2.0/layoutlib-api-26.2.0.jar
Download https://dl.google.com/dl/android/maven2/com/android/tools/dvlib/26.2.0/dvlib-26.2.0.jar
Download https://dl.google.com/dl/android/maven2/com/android/tools/repository/26.2.0/repository-26.2.0.jar
Download https://dl.google.com/dl/android/maven2/com/android/tools/common/26.2.0/common-26.2.0.jar
Download https://jcenter.bintray.com/org/jetbrains/kotlin/kotlin-stdlib-jre8/1.2.0/kotlin-stdlib-jre8-1.2.0.jar
Download https://jcenter.bintray.com/org/ow2/asm/asm-analysis/6.0/asm-analysis-6.0.jar
Download https://dl.google.com/dl/android/maven2/com/android/tools/build/jetifier/jetifier-processor/1.0.0-alpha10/jetifier-processor-1.0.0-alpha10.jar
Download https://dl.google.com/dl/android/maven2/com/android/tools/build/transform-api/2.0.0-deprecated-use-gradle-api/transform-api-2.0.0-deprecated-use-gradle-api.jar
Download https://jcenter.bintray.com/org/ow2/asm/asm-commons/6.0/asm-commons-6.0.jar
Download https://jcenter.bintray.com/org/ow2/asm/asm-util/6.0/asm-util-6.0.jar
Download https://jcenter.bintray.com/org/ow2/asm/asm-tree/6.0/asm-tree-6.0.jar
Download https://jcenter.bintray.com/org/ow2/asm/asm/6.0/asm-6.0.jar
Download https://jcenter.bintray.com/net/sf/proguard/proguard-gradle/6.0.3/proguard-gradle-6.0.3.jar
Download https://jcenter.bintray.com/net/sf/jopt-simple/jopt-simple/4.9/jopt-simple-4.9.jar
Download https://dl.google.com/dl/android/maven2/com/android/tools/build/bundletool/0.5.0/bundletool-0.5.0.jar
Download https://dl.google.com/dl/android/maven2/com/android/tools/build/jetifier/jetifier-core/1.0.0-alpha10/jetifier-core-1.0.0-alpha10.jar
Download https://dl.google.com/dl/android/maven2/com/android/tools/build/builder-model/3.2.0/builder-model-3.2.0.jar
Download https://dl.google.com/dl/android/maven2/com/android/tools/analytics-library/protos/26.2.0/protos-26.2.0.jar
Download https://dl.google.com/dl/android/maven2/com/android/tools/build/apkzlib/3.2.0/apkzlib-3.2.0.jar
Download https://dl.google.com/dl/android/maven2/com/android/tools/build/apksig/3.2.0/apksig-3.2.0.jar
Download https://jcenter.bintray.com/com/squareup/javawriter/2.5.0/javawriter-2.5.0.jar
Download https://jcenter.bintray.com/org/bouncycastle/bcpkix-jdk15on/1.56/bcpkix-jdk15on-1.56.jar
Download https://jcenter.bintray.com/org/bouncycastle/bcprov-jdk15on/1.56/bcprov-jdk15on-1.56.jar
Download https://jcenter.bintray.com/it/unimi/dsi/fastutil/7.2.0/fastutil-7.2.0.jar
Download https://jcenter.bintray.com/com/googlecode/json-simple/json-simple/1.1/json-simple-1.1.jar
Download https://jcenter.bintray.com/com/google/jimfs/jimfs/1.1/jimfs-1.1.jar
Download https://jcenter.bintray.com/com/google/protobuf/protobuf-java-util/3.4.0/protobuf-java-util-3.4.0.jar
Download https://dl.google.com/dl/android/maven2/com/android/tools/annotations/26.2.0/annotations-26.2.0.jar
Download https://jcenter.bintray.com/com/google/guava/guava/23.0/guava-23.0.jar
Download https://jcenter.bintray.com/com/google/code/gson/gson/2.8.0/gson-2.8.0.jar
Download https://jcenter.bintray.com/org/apache/httpcomponents/httpmime/4.5.2/httpmime-4.5.2.jar
Download https://jcenter.bintray.com/org/apache/httpcomponents/httpclient/4.5.2/httpclient-4.5.2.jar
Download https://jcenter.bintray.com/org/apache/httpcomponents/httpcore/4.4.5/httpcore-4.4.5.jar
Download https://jcenter.bintray.com/org/jetbrains/kotlin/kotlin-reflect/1.2.0/kotlin-reflect-1.2.0.jar
Download https://dl.google.com/dl/android/maven2/com/android/databinding/baseLibrary/3.2.0/baseLibrary-3.2.0.jar
Download https://jcenter.bintray.com/org/antlr/antlr4/4.5.3/antlr4-4.5.3.jar
Download https://dl.google.com/dl/android/maven2/androidx/databinding/databinding-common/3.2.0/databinding-common-3.2.0.jar
Download https://jcenter.bintray.com/commons-io/commons-io/2.4/commons-io-2.4.jar
Download https://jcenter.bintray.com/com/googlecode/juniversalchardet/juniversalchardet/1.0.3/juniversalchardet-1.0.3.jar
Download https://jcenter.bintray.com/com/squareup/javapoet/1.8.0/javapoet-1.8.0.jar
Download https://jcenter.bintray.com/org/jetbrains/kotlin/kotlin-stdlib-jre7/1.2.0/kotlin-stdlib-jre7-1.2.0.jar
Download https://jcenter.bintray.com/org/jetbrains/kotlin/kotlin-stdlib/1.2.20/kotlin-stdlib-1.2.20.jar
Download https://jcenter.bintray.com/com/google/auto/value/auto-value/1.5.2/auto-value-1.5.2.jar
Download https://jcenter.bintray.com/net/sf/proguard/proguard-base/6.0.3/proguard-base-6.0.3.jar
Download https://dl.google.com/dl/android/maven2/com/android/tools/build/aapt2-proto/0.3.1/aapt2-proto-0.3.1.jar
Download https://jcenter.bintray.com/com/google/errorprone/error_prone_annotations/2.2.0/error_prone_annotations-2.2.0.jar
Download https://jcenter.bintray.com/org/apache/commons/commons-compress/1.12/commons-compress-1.12.jar
Download https://jcenter.bintray.com/com/google/protobuf/protobuf-java/3.4.0/protobuf-java-3.4.0.jar
Download https://jcenter.bintray.com/org/jdom/jdom2/2.0.6/jdom2-2.0.6.jar
Download https://jcenter.bintray.com/javax/inject/javax.inject/1/javax.inject-1.jar
Download https://jcenter.bintray.com/net/sf/kxml/kxml2/2.3.0/kxml2-2.3.0.jar
Download https://jcenter.bintray.com/com/google/j2objc/j2objc-annotations/1.1/j2objc-annotations-1.1.jar
Download https://jcenter.bintray.com/com/google/code/findbugs/jsr305/1.3.9/jsr305-1.3.9.jar
Download https://jcenter.bintray.com/org/codehaus/mojo/animal-sniffer-annotations/1.14/animal-sniffer-annotations-1.14.jar
Download https://jcenter.bintray.com/commons-logging/commons-logging/1.2/commons-logging-1.2.jar
Download https://jcenter.bintray.com/org/jetbrains/annotations/13.0/annotations-13.0.jar
Download https://jcenter.bintray.com/commons-codec/commons-codec/1.9/commons-codec-1.9.jar
Download https://jcenter.bintray.com/com/sun/activation/javax.activation/1.2.0/javax.activation-1.2.0.jar
Download https://jcenter.bintray.com/org/glassfish/jaxb/jaxb-runtime/2.2.11/jaxb-runtime-2.2.11.jar
Download https://jcenter.bintray.com/org/jvnet/staxex/stax-ex/1.7.7/stax-ex-1.7.7.jar
Download https://jcenter.bintray.com/org/glassfish/jaxb/jaxb-core/2.2.11/jaxb-core-2.2.11.jar
Download https://jcenter.bintray.com/com/sun/xml/fastinfoset/FastInfoset/1.2.13/FastInfoset-1.2.13.jar
Download https://jcenter.bintray.com/javax/xml/bind/jaxb-api/2.2.12-b140109.1041/jaxb-api-2.2.12-b140109.1041.jar
Download https://jcenter.bintray.com/org/glassfish/jaxb/txw2/2.2.11/txw2-2.2.11.jar
Download https://jcenter.bintray.com/com/sun/istack/istack-commons-runtime/2.21/istack-commons-runtime-2.21.jar
Download https://dl.google.com/dl/android/maven2/com/android/tools/lint/lint-gradle-api/26.2.0/lint-gradle-api-26.2.0.jar

> Configure project :widgets
Using android X

> Task :widgets:preBuild UP-TO-DATE
> Task :widgets:preReleaseBuild UP-TO-DATE
> Task :widgets:compileReleaseAidl NO-SOURCE
Download https://dl.google.com/dl/android/maven2/androidx/fragment/fragment/1.0.0/fragment-1.0.0.pom
Download https://dl.google.com/dl/android/maven2/androidx/exifinterface/exifinterface/1.3.2/exifinterface-1.3.2.pom
Download https://dl.google.com/dl/android/maven2/androidx/transition/transition/1.0.0/transition-1.0.0.pom
Download https://dl.google.com/dl/android/maven2/androidx/viewpager/viewpager/1.0.0/viewpager-1.0.0.pom
Download https://dl.google.com/dl/android/maven2/androidx/annotation/annotation/1.0.0/annotation-1.0.0.pom
Download https://dl.google.com/dl/android/maven2/androidx/core/core/1.0.0/core-1.0.0.pom
Download https://dl.google.com/dl/android/maven2/androidx/customview/customview/1.0.0/customview-1.0.0.pom
Download https://dl.google.com/dl/android/maven2/androidx/legacy/legacy-support-core-utils/1.0.0/legacy-support-core-utils-1.0.0.pom
Download https://dl.google.com/dl/android/maven2/androidx/legacy/legacy-support-core-ui/1.0.0/legacy-support-core-ui-1.0.0.pom
Download https://dl.google.com/dl/android/maven2/androidx/lifecycle/lifecycle-viewmodel/2.0.0/lifecycle-viewmodel-2.0.0.pom
Download https://dl.google.com/dl/android/maven2/androidx/loader/loader/1.0.0/loader-1.0.0.pom
Download https://dl.google.com/dl/android/maven2/androidx/annotation/annotation/1.1.0/annotation-1.1.0.pom
Download https://dl.google.com/dl/android/maven2/androidx/versionedparcelable/versionedparcelable/1.0.0/versionedparcelable-1.0.0.pom
Download https://dl.google.com/dl/android/maven2/androidx/collection/collection/1.0.0/collection-1.0.0.pom
Download https://dl.google.com/dl/android/maven2/androidx/lifecycle/lifecycle-runtime/2.0.0/lifecycle-runtime-2.0.0.pom
Download https://dl.google.com/dl/android/maven2/androidx/interpolator/interpolator/1.0.0/interpolator-1.0.0.pom
Download https://dl.google.com/dl/android/maven2/androidx/swiperefreshlayout/swiperefreshlayout/1.0.0/swiperefreshlayout-1.0.0.pom
Download https://dl.google.com/dl/android/maven2/androidx/slidingpanelayout/slidingpanelayout/1.0.0/slidingpanelayout-1.0.0.pom
Download https://dl.google.com/dl/android/maven2/androidx/drawerlayout/drawerlayout/1.0.0/drawerlayout-1.0.0.pom
Download https://dl.google.com/dl/android/maven2/androidx/asynclayoutinflater/asynclayoutinflater/1.0.0/asynclayoutinflater-1.0.0.pom
Download https://dl.google.com/dl/android/maven2/androidx/cursoradapter/cursoradapter/1.0.0/cursoradapter-1.0.0.pom
Download https://dl.google.com/dl/android/maven2/androidx/coordinatorlayout/coordinatorlayout/1.0.0/coordinatorlayout-1.0.0.pom
Download https://dl.google.com/dl/android/maven2/androidx/documentfile/documentfile/1.0.0/documentfile-1.0.0.pom
Download https://dl.google.com/dl/android/maven2/androidx/localbroadcastmanager/localbroadcastmanager/1.0.0/localbroadcastmanager-1.0.0.pom
Download https://dl.google.com/dl/android/maven2/androidx/print/print/1.0.0/print-1.0.0.pom
Download https://dl.google.com/dl/android/maven2/androidx/lifecycle/lifecycle-livedata/2.0.0/lifecycle-livedata-2.0.0.pom
Download https://dl.google.com/dl/android/maven2/androidx/arch/core/core-common/2.0.0/core-common-2.0.0.pom
Download https://dl.google.com/dl/android/maven2/androidx/lifecycle/lifecycle-common/2.0.0/lifecycle-common-2.0.0.pom
Download https://dl.google.com/dl/android/maven2/androidx/lifecycle/lifecycle-livedata-core/2.0.0/lifecycle-livedata-core-2.0.0.pom
Download https://dl.google.com/dl/android/maven2/androidx/arch/core/core-runtime/2.0.0/core-runtime-2.0.0.pom
Download https://dl.google.com/dl/android/maven2/androidx/fragment/fragment/1.0.0/fragment-1.0.0.aar
Download https://dl.google.com/dl/android/maven2/androidx/exifinterface/exifinterface/1.3.2/exifinterface-1.3.2.aar
Download https://dl.google.com/dl/android/maven2/androidx/legacy/legacy-support-core-ui/1.0.0/legacy-support-core-ui-1.0.0.aar
Download https://dl.google.com/dl/android/maven2/androidx/viewpager/viewpager/1.0.0/viewpager-1.0.0.aar
Download https://dl.google.com/dl/android/maven2/androidx/transition/transition/1.0.0/transition-1.0.0.aar
Download https://dl.google.com/dl/android/maven2/androidx/drawerlayout/drawerlayout/1.0.0/drawerlayout-1.0.0.aar
Download https://dl.google.com/dl/android/maven2/androidx/customview/customview/1.0.0/customview-1.0.0.aar
Download https://dl.google.com/dl/android/maven2/androidx/slidingpanelayout/slidingpanelayout/1.0.0/slidingpanelayout-1.0.0.aar
Download https://dl.google.com/dl/android/maven2/androidx/loader/loader/1.0.0/loader-1.0.0.aar
Download https://dl.google.com/dl/android/maven2/androidx/swiperefreshlayout/swiperefreshlayout/1.0.0/swiperefreshlayout-1.0.0.aar
Download https://dl.google.com/dl/android/maven2/androidx/asynclayoutinflater/asynclayoutinflater/1.0.0/asynclayoutinflater-1.0.0.aar
Download https://dl.google.com/dl/android/maven2/androidx/legacy/legacy-support-core-utils/1.0.0/legacy-support-core-utils-1.0.0.aar
Download https://dl.google.com/dl/android/maven2/androidx/core/core/1.0.0/core-1.0.0.aar
Download https://dl.google.com/dl/android/maven2/androidx/lifecycle/lifecycle-runtime/2.0.0/lifecycle-runtime-2.0.0.aar
Download https://dl.google.com/dl/android/maven2/androidx/interpolator/interpolator/1.0.0/interpolator-1.0.0.aar
Download https://dl.google.com/dl/android/maven2/androidx/lifecycle/lifecycle-viewmodel/2.0.0/lifecycle-viewmodel-2.0.0.aar
Download https://dl.google.com/dl/android/maven2/androidx/versionedparcelable/versionedparcelable/1.0.0/versionedparcelable-1.0.0.aar
Download https://dl.google.com/dl/android/maven2/androidx/localbroadcastmanager/localbroadcastmanager/1.0.0/localbroadcastmanager-1.0.0.aar
Download https://dl.google.com/dl/android/maven2/androidx/lifecycle/lifecycle-livedata/2.0.0/lifecycle-livedata-2.0.0.aar
Download https://dl.google.com/dl/android/maven2/androidx/cursoradapter/cursoradapter/1.0.0/cursoradapter-1.0.0.aar
Download https://dl.google.com/dl/android/maven2/androidx/lifecycle/lifecycle-livedata-core/2.0.0/lifecycle-livedata-core-2.0.0.aar
Download https://dl.google.com/dl/android/maven2/androidx/print/print/1.0.0/print-1.0.0.aar
Download https://dl.google.com/dl/android/maven2/androidx/documentfile/documentfile/1.0.0/documentfile-1.0.0.aar
Download https://dl.google.com/dl/android/maven2/androidx/arch/core/core-runtime/2.0.0/core-runtime-2.0.0.aar
Download https://dl.google.com/dl/android/maven2/androidx/coordinatorlayout/coordinatorlayout/1.0.0/coordinatorlayout-1.0.0.aar
> Task :widgets:compileReleaseRenderscript
> Task :widgets:checkReleaseManifest
> Task :widgets:generateReleaseBuildConfig
> Task :widgets:generateReleaseResValues
> Task :widgets:generateReleaseResources
Download https://dl.google.com/dl/android/maven2/com/android/tools/build/aapt2/3.2.0-4818971/aapt2-3.2.0-4818971.pom
Download https://dl.google.com/dl/android/maven2/com/android/tools/build/aapt2/3.2.0-4818971/aapt2-3.2.0-4818971-linux.jar
> Task :widgets:packageReleaseResources
> Task :widgets:processReleaseManifest
> Task :widgets:generateReleaseRFile
> Task :widgets:prepareLintJar
> Task :widgets:generateReleaseSources
Download https://dl.google.com/dl/android/maven2/androidx/collection/collection/1.0.0/collection-1.0.0.jar
Download https://dl.google.com/dl/android/maven2/androidx/lifecycle/lifecycle-common/2.0.0/lifecycle-common-2.0.0.jar
Download https://dl.google.com/dl/android/maven2/androidx/annotation/annotation/1.1.0/annotation-1.1.0.jar
Download https://dl.google.com/dl/android/maven2/androidx/arch/core/core-common/2.0.0/core-common-2.0.0.jar
> Task :widgets:javaPreCompileRelease

> Task :widgets:compileReleaseJavaWithJavac
Note: Some input files use or override a deprecated API.
Note: Recompile with -Xlint:deprecation for details.
Note: /home/vagrant/build/srclib/NativeScript_NativeScript/packages/ui-mobile-base/android/widgets/src/main/java/org/nativescript/widgets/Image/AsyncTask.java uses unchecked or unsafe operations.
Note: Recompile with -Xlint:unchecked for details.
Download https://dl.google.com/dl/android/maven2/com/android/tools/lint/lint-gradle/26.2.0/lint-gradle-26.2.0.pom
Download https://dl.google.com/dl/android/maven2/com/android/tools/external/org-jetbrains/uast/26.2.0/uast-26.2.0.pom
Download https://dl.google.com/dl/android/maven2/com/android/tools/lint/lint/26.2.0/lint-26.2.0.pom
Download https://dl.google.com/dl/android/maven2/com/android/tools/external/com-intellij/intellij-core/26.2.0/intellij-core-26.2.0.pom
Download https://jcenter.bintray.com/org/codehaus/groovy/groovy-all/2.4.12/groovy-all-2.4.12.pom
Download https://jcenter.bintray.com/org/jetbrains/trove4j/trove4j/20160824/trove4j-20160824.pom
Download https://dl.google.com/dl/android/maven2/com/android/tools/lint/lint-kotlin/26.2.0/lint-kotlin-26.2.0.pom
Download https://dl.google.com/dl/android/maven2/com/android/tools/lint/lint-checks/26.2.0/lint-checks-26.2.0.pom
Download https://dl.google.com/dl/android/maven2/com/android/tools/external/com-intellij/kotlin-compiler/26.2.0/kotlin-compiler-26.2.0.pom
Download https://dl.google.com/dl/android/maven2/com/android/tools/lint/lint-api/26.2.0/lint-api-26.2.0.pom
Download https://jcenter.bintray.com/com/google/errorprone/error_prone_annotations/2.0.18/error_prone_annotations-2.0.18.pom
Download https://jcenter.bintray.com/com/google/errorprone/error_prone_parent/2.0.18/error_prone_parent-2.0.18.pom
Download https://dl.google.com/dl/android/maven2/com/android/tools/lint/lint-kotlin/26.2.0/lint-kotlin-26.2.0.jar
Download https://dl.google.com/dl/android/maven2/com/android/tools/lint/lint/26.2.0/lint-26.2.0.jar
Download https://dl.google.com/dl/android/maven2/com/android/tools/lint/lint-api/26.2.0/lint-api-26.2.0.jar
Download https://jcenter.bintray.com/org/codehaus/groovy/groovy-all/2.4.12/groovy-all-2.4.12.jar
Download https://dl.google.com/dl/android/maven2/com/android/tools/lint/lint-checks/26.2.0/lint-checks-26.2.0.jar
Download https://dl.google.com/dl/android/maven2/com/android/tools/lint/lint-gradle/26.2.0/lint-gradle-26.2.0.jar
Download https://dl.google.com/dl/android/maven2/com/android/tools/external/com-intellij/intellij-core/26.2.0/intellij-core-26.2.0.jar
Download https://dl.google.com/dl/android/maven2/com/android/tools/external/com-intellij/kotlin-compiler/26.2.0/kotlin-compiler-26.2.0.jar
Download https://jcenter.bintray.com/org/jetbrains/trove4j/trove4j/20160824/trove4j-20160824.jar
Download https://jcenter.bintray.com/org/jetbrains/kotlin/kotlin-stdlib/1.2.0/kotlin-stdlib-1.2.0.jar
Download https://jcenter.bintray.com/com/google/errorprone/error_prone_annotations/2.0.18/error_prone_annotations-2.0.18.jar
Download https://dl.google.com/dl/android/maven2/com/android/tools/external/org-jetbrains/uast/26.2.0/uast-26.2.0.jar

> Task :widgets:extractReleaseAnnotations
> Task :widgets:mergeReleaseConsumerProguardFiles
> Task :widgets:mergeReleaseShaders
> Task :widgets:compileReleaseShaders
> Task :widgets:generateReleaseAssets
> Task :widgets:packageReleaseAssets
> Task :widgets:packageReleaseRenderscript NO-SOURCE
> Task :widgets:processReleaseJavaRes NO-SOURCE
> Task :widgets:transformResourcesWithMergeJavaResForRelease
> Task :widgets:transformClassesAndResourcesWithSyncLibJarsForRelease
> Task :widgets:compileReleaseNdk NO-SOURCE
> Task :widgets:mergeReleaseJniLibFolders
> Task :widgets:transformNativeLibsWithMergeJniLibsForRelease
> Task :widgets:transformNativeLibsWithStripDebugSymbolForRelease
> Task :widgets:transformNativeLibsWithSyncJniLibsForRelease
> Task :widgets:bundleReleaseAar
> Task :widgets:compileReleaseSources
> Task :widgets:mergeReleaseResources
> Task :widgets:verifyReleaseResources
> Task :widgets:assembleRelease

BUILD SUCCESSFUL in 32s
24 actionable tasks: 24 executed
+ popd
~/build/com.vishnuraghav.EnRecipes
+ mkdir -p node_modules/@nativescript/core/platforms/android
+ cp /home/vagrant/build/srclib/NativeScript_NativeScript/packages/ui-mobile-base/android/widgets/build/outputs/aar/widgets-release.aar node_modules/@nativescript/core/platforms/android/widgets-release.aar
+ rm -rf /home/vagrant/build/srclib/NativeScript_NativeScript
+ pushd /home/vagrant/build/srclib/NativeScript_android-runtime
~/build/srclib/NativeScript_android-runtime ~/build/com.vishnuraghav.EnRecipes
++ readlink -f /usr/bin/javac
++ sed s:/bin/javac::
+ export JAVA_HOME=/usr/lib/jvm/java-8-openjdk-amd64
+ JAVA_HOME=/usr/lib/jvm/java-8-openjdk-amd64
+ cp /opt/android-sdk/build-tools/30.0.3/lib/dx.jar test-app/build-tools/android-metadata-generator/src/libs/dx.jar
+ gradle
Found 6.4 via distributionUrl
Downloading missing gradle version 6.4
cachedir
/tmp/tmp.4NsoL2L1xD/gradle-6.4-bin.zip: OK
Running /opt/gradle/versions/6.4/bin/gradle 

Welcome to Gradle 6.4!

Here are the highlights of this release:
 - Support for building, testing and running Java Modules
 - Precompiled script plugins for Groovy DSL
 - Single dependency lock file per project

For more details see https://docs.gradle.org/6.4/release-notes.html

To honour the JVM settings for this build a new JVM will be forked. Please consider using the daemon: https://docs.gradle.org/6.4/userguide/gradle_daemon.html.
Daemon will be stopped at the end of the build stopping after processing

> Configure project :
Warning: The GIT_COMMIT is not set. This NativeScript Android Runtime will not be tagged with the git commit it is build from

CCache version: CCache not found!
Creating NativeScript Android Package

> Task :cleanDistDir UP-TO-DATE

> Task :generateDtsgJar
Downloading https://services.gradle.org/distributions/gradle-6.4-all.zip
...................................................................................................................................................................................................................................................................................................................................................................................................................................................................................................................................................................................................................................................................................................................................................................................................................................................................................................................................................................................................................................................................................................................................................................................................................................................................................................................................................................................................................................................................................................................................................................................................................................................................................................................................................................................................................................................................................................................................................................................................................................................................................................................................................................................................................................................................................................................................................................................................................................................................................................................................................................................................................................................................................................................................................................................................................................................................................................................................................................................................................................................................................................................................................................................................................................................................................................................................................................................................................................................................................................................................................................................................................................................................................................................................................................................................................................................................................................................................................................................................................................................................................................................................................................................................................................................................................................................................................................................................................................................................................................................................................................................................................................................................................................................................................................................................................................................................................................................................................................................................................................................................................................................................................................................................................................................................................................................................................................................................................................................................................................................................................................................................................................................................................................................................................................................................................................................................................................................................................................................................................................................................................................................................................................................................................................................................................................................................................................................................................................................................................................................................................................................................................................................................................................................................................................................................................................................................................................................................................................................................................................................................................................................................................................................................................................................................................................................................................................................................................................................................................................................................................................................
Unzipping /home/vagrant/.gradle/wrapper/dists/gradle-6.4-all/h8pi7famayzdg9sl28jayaip/gradle-6.4-all.zip to /home/vagrant/.gradle/wrapper/dists/gradle-6.4-all/h8pi7famayzdg9sl28jayaip
Set executable permissions for: /home/vagrant/.gradle/wrapper/dists/gradle-6.4-all/h8pi7famayzdg9sl28jayaip/gradle-6.4/bin/gradle
To honour the JVM settings for this build a new JVM will be forked. Please consider using the daemon: https://docs.gradle.org/6.4/userguide/gradle_daemon.html.
Daemon will be stopped at the end of the build stopping after processing

> Configure project :android-metadata-generator
The compile configuration has been deprecated for dependency declaration. This will fail with an error in Gradle 7.0. Please use the implementation configuration instead. Consult the upgrading guide for further information: https://docs.gradle.org/6.4/userguide/upgrading_version_5.html#dependencies_should_no_longer_be_declared_using_the_compile_and_runtime_configurations
	at build_8qx6x2e529ggcnezerlzur5n8$_run_closure5.doCall(/home/vagrant/build/srclib/NativeScript_android-runtime/test-app/build-tools/android-metadata-generator/build.gradle:47)
	(Run with --stacktrace to get the full stack trace of this deprecation warning.)
The testCompile configuration has been deprecated for dependency declaration. This will fail with an error in Gradle 7.0. Please use the testImplementation configuration instead. Consult the upgrading guide for further information: https://docs.gradle.org/6.4/userguide/upgrading_version_5.html#dependencies_should_no_longer_be_declared_using_the_compile_and_runtime_configurations
	at build_8qx6x2e529ggcnezerlzur5n8$_run_closure5.doCall(/home/vagrant/build/srclib/NativeScript_android-runtime/test-app/build-tools/android-metadata-generator/build.gradle:52)
	(Run with --stacktrace to get the full stack trace of this deprecation warning.)

> Configure project :app
Internal API constructor DefaultDomainObjectSet(Class<T>) has been deprecated. This is scheduled to be removed in Gradle 7.0. Please use ObjectFactory.domainObjectSet(Class<T>) instead. See https://docs.gradle.org/6.4/userguide/custom_gradle_types.html#domainobjectset for more details.
	at build_6py85dmzpz4lpmwdbcvywm8s0.run(/home/vagrant/build/srclib/NativeScript_android-runtime/test-app/app/build.gradle:35)
	(Run with --stacktrace to get the full stack trace of this deprecation warning.)
	 + setting applicationId
	 + couldn't load user-defined configuration from /home/vagrant/build/srclib/app/App_Resources/Android/app.gradle. File doesn't exist.
	 + using android X library androidx.legacy:legacy-support-v4:1.0.0

> Configure project :runtime
WARNING: Support for ANDROID_NDK_HOME is deprecated and will be removed in the future. Use android.ndkVersion in build.gradle instead.
Support for ANDROID_NDK_HOME is deprecated and will be removed in the future. Use android.ndkVersion in build.gradle instead.

> Configure project :app
WARNING: Folder /home/vagrant/build/srclib/NativeScript_android-runtime/test-app/runtime/build/intermediates/runtime_library_classes/debug does not exists, the dependent project's classes won't be included in the metadata

> Configure project :static-binding-generator
The compile configuration has been deprecated for dependency declaration. This will fail with an error in Gradle 7.0. Please use the implementation or api configuration instead. Consult the upgrading guide for further information: https://docs.gradle.org/6.4/userguide/upgrading_version_5.html#dependencies_should_no_longer_be_declared_using_the_compile_and_runtime_configurations
	at build_99samisgx3y8aheva8tb7clh6$_run_closure2.doCall(/home/vagrant/build/srclib/NativeScript_android-runtime/test-app/build-tools/static-binding-generator/build.gradle:13)
	(Run with --stacktrace to get the full stack trace of this deprecation warning.)

> Task :dts-generator:compileJava
> Task :dts-generator:processResources NO-SOURCE
> Task :dts-generator:classes

> Task :dts-generator:jar
Copying or archiving duplicate paths with the default duplicates strategy has been deprecated. This is scheduled to be removed in Gradle 7.0. Duplicate path: "META-INF/LICENSE.txt". Explicitly set the duplicates strategy to 'DuplicatesStrategy.INCLUDE' if you want to allow duplicate paths. Consult the upgrading guide for further information: https://docs.gradle.org/6.4/userguide/upgrading_version_5.html#implicit_duplicate_strategy_for_copy_or_archive_tasks_has_been_deprecated
Copying or archiving duplicate paths with the default duplicates strategy has been deprecated. This is scheduled to be removed in Gradle 7.0. Duplicate path: "META-INF/NOTICE.txt". Explicitly set the duplicates strategy to 'DuplicatesStrategy.INCLUDE' if you want to allow duplicate paths. Consult the upgrading guide for further information: https://docs.gradle.org/6.4/userguide/upgrading_version_5.html#implicit_duplicate_strategy_for_copy_or_archive_tasks_has_been_deprecated
Copying or archiving duplicate paths with the default duplicates strategy has been deprecated. This is scheduled to be removed in Gradle 7.0. Duplicate path: "module-info.class". Explicitly set the duplicates strategy to 'DuplicatesStrategy.INCLUDE' if you want to allow duplicate paths. Consult the upgrading guide for further information: https://docs.gradle.org/6.4/userguide/upgrading_version_5.html#implicit_duplicate_strategy_for_copy_or_archive_tasks_has_been_deprecated

> Task :dts-generator:copyJarToBuildTools
3 actionable tasks: 3 executed

> Task :jsParserNPMInstall
npm WARN deprecated core-js@2.6.12: core-js@<3.3 is no longer maintained and not recommended for usage due to the number of issues. Because of the V8 engine whims, feature detection in old core-js versions could cause a slowdown up to 100x even if nothing is polyfilled. Please, upgrade your dependencies to the actual version of core-js.
npm WARN deprecated querystring@0.2.0: The querystring API is considered Legacy. new code should use the URLSearchParams API instead.
npm WARN deprecated chokidar@2.1.8: Chokidar 2 will break on node v14+. Upgrade to chokidar 3 with 15x less dependencies.
npm WARN deprecated urix@0.1.0: Please see https://github.com/lydell/urix#deprecated
npm WARN deprecated resolve-url@0.2.1: https://github.com/lydell/resolve-url#deprecated
npm WARN deprecated fsevents@1.2.13: fsevents 1 will break on node v14+ and could be using insecure binaries. Upgrade to fsevents 2.

> core-js@2.6.12 postinstall /home/vagrant/build/srclib/NativeScript_android-runtime/test-app/build-tools/jsparser/node_modules/core-js
> node -e "try{require('./postinstall')}catch(e){}"

Thank you for using core-js ( https://github.com/zloirock/core-js ) for polyfilling JavaScript standard library!

The project needs your help! Please consider supporting of core-js on Open Collective or Patreon: 
> https://opencollective.com/core-js 
> https://www.patreon.com/zloirock 

Also, the author of core-js ( https://github.com/zloirock ) is looking for a good job -)

npm notice created a lockfile as package-lock.json. You should commit this file.
npm WARN optional SKIPPING OPTIONAL DEPENDENCY: fsevents@~2.3.2 (node_modules/chokidar/node_modules/fsevents):
npm WARN notsup SKIPPING OPTIONAL DEPENDENCY: Unsupported platform for fsevents@2.3.2: wanted {"os":"darwin","arch":"any"} (current: {"os":"linux","arch":"x64"})
npm WARN optional SKIPPING OPTIONAL DEPENDENCY: fsevents@^1.2.7 (node_modules/watchpack-chokidar2/node_modules/chokidar/node_modules/fsevents):
npm WARN notsup SKIPPING OPTIONAL DEPENDENCY: Unsupported platform for fsevents@1.2.13: wanted {"os":"darwin","arch":"any"} (current: {"os":"linux","arch":"x64"})

added 434 packages from 222 contributors and audited 438 packages in 12.116s

7 packages are looking for funding
  run `npm fund` for details

found 2 vulnerabilities (1 low, 1 moderate)
  run `npm audit fix` to fix them, or `npm audit` for details

> Task :generateSbgJar
To honour the JVM settings for this build a new JVM will be forked. Please consider using the daemon: https://docs.gradle.org/6.4/userguide/gradle_daemon.html.
Daemon will be stopped at the end of the build stopping after processing

> Configure project :android-metadata-generator
The compile configuration has been deprecated for dependency declaration. This will fail with an error in Gradle 7.0. Please use the implementation configuration instead. Consult the upgrading guide for further information: https://docs.gradle.org/6.4/userguide/upgrading_version_5.html#dependencies_should_no_longer_be_declared_using_the_compile_and_runtime_configurations
	at build_8qx6x2e529ggcnezerlzur5n8$_run_closure5.doCall(/home/vagrant/build/srclib/NativeScript_android-runtime/test-app/build-tools/android-metadata-generator/build.gradle:47)
	(Run with --stacktrace to get the full stack trace of this deprecation warning.)
The testCompile configuration has been deprecated for dependency declaration. This will fail with an error in Gradle 7.0. Please use the testImplementation configuration instead. Consult the upgrading guide for further information: https://docs.gradle.org/6.4/userguide/upgrading_version_5.html#dependencies_should_no_longer_be_declared_using_the_compile_and_runtime_configurations
	at build_8qx6x2e529ggcnezerlzur5n8$_run_closure5.doCall(/home/vagrant/build/srclib/NativeScript_android-runtime/test-app/build-tools/android-metadata-generator/build.gradle:52)
	(Run with --stacktrace to get the full stack trace of this deprecation warning.)

> Configure project :app
Internal API constructor DefaultDomainObjectSet(Class<T>) has been deprecated. This is scheduled to be removed in Gradle 7.0. Please use ObjectFactory.domainObjectSet(Class<T>) instead. See https://docs.gradle.org/6.4/userguide/custom_gradle_types.html#domainobjectset for more details.
	at build_6py85dmzpz4lpmwdbcvywm8s0.run(/home/vagrant/build/srclib/NativeScript_android-runtime/test-app/app/build.gradle:35)
	(Run with --stacktrace to get the full stack trace of this deprecation warning.)
	 + setting applicationId
	 + couldn't load user-defined configuration from /home/vagrant/build/srclib/app/App_Resources/Android/app.gradle. File doesn't exist.
	 + using android X library androidx.legacy:legacy-support-v4:1.0.0

> Configure project :runtime
WARNING: Support for ANDROID_NDK_HOME is deprecated and will be removed in the future. Use android.ndkVersion in build.gradle instead.
Support for ANDROID_NDK_HOME is deprecated and will be removed in the future. Use android.ndkVersion in build.gradle instead.

> Configure project :app
WARNING: Folder /home/vagrant/build/srclib/NativeScript_android-runtime/test-app/runtime/build/intermediates/runtime_library_classes/debug does not exists, the dependent project's classes won't be included in the metadata

> Configure project :static-binding-generator
The compile configuration has been deprecated for dependency declaration. This will fail with an error in Gradle 7.0. Please use the implementation or api configuration instead. Consult the upgrading guide for further information: https://docs.gradle.org/6.4/userguide/upgrading_version_5.html#dependencies_should_no_longer_be_declared_using_the_compile_and_runtime_configurations
	at build_99samisgx3y8aheva8tb7clh6$_run_closure2.doCall(/home/vagrant/build/srclib/NativeScript_android-runtime/test-app/build-tools/static-binding-generator/build.gradle:13)
	(Run with --stacktrace to get the full stack trace of this deprecation warning.)
The runtime configuration has been deprecated for resolution. This will fail with an error in Gradle 7.0. Please resolve the runtimeClasspath configuration instead. Consult the upgrading guide for further information: https://docs.gradle.org/6.4/userguide/upgrading_version_5.html#dependencies_should_no_longer_be_declared_using_the_compile_and_runtime_configurations
	at build_99samisgx3y8aheva8tb7clh6$_run_closure5$_closure7.doCall(/home/vagrant/build/srclib/NativeScript_android-runtime/test-app/build-tools/static-binding-generator/build.gradle:42)
	(Run with --stacktrace to get the full stack trace of this deprecation warning.)
The compile configuration has been deprecated for resolution. This will fail with an error in Gradle 7.0. Please resolve the compileClasspath configuration instead. Consult the upgrading guide for further information: https://docs.gradle.org/6.4/userguide/upgrading_version_5.html#dependencies_should_no_longer_be_declared_using_the_compile_and_runtime_configurations
	at build_99samisgx3y8aheva8tb7clh6$_run_closure5$_closure7.doCall(/home/vagrant/build/srclib/NativeScript_android-runtime/test-app/build-tools/static-binding-generator/build.gradle:46)
	(Run with --stacktrace to get the full stack trace of this deprecation warning.)

> Task :static-binding-generator:compileJava
> Task :static-binding-generator:processResources NO-SOURCE
> Task :static-binding-generator:classes

> Task :static-binding-generator:jar
Copying or archiving duplicate paths with the default duplicates strategy has been deprecated. This is scheduled to be removed in Gradle 7.0. Duplicate path: "module-info.class". Explicitly set the duplicates strategy to 'DuplicatesStrategy.INCLUDE' if you want to allow duplicate paths. Consult the upgrading guide for further information: https://docs.gradle.org/6.4/userguide/upgrading_version_5.html#implicit_duplicate_strategy_for_copy_or_archive_tasks_has_been_deprecated
Copying or archiving duplicate paths with the default duplicates strategy has been deprecated. This is scheduled to be removed in Gradle 7.0. Duplicate path: "META-INF/LICENSE.txt". Explicitly set the duplicates strategy to 'DuplicatesStrategy.INCLUDE' if you want to allow duplicate paths. Consult the upgrading guide for further information: https://docs.gradle.org/6.4/userguide/upgrading_version_5.html#implicit_duplicate_strategy_for_copy_or_archive_tasks_has_been_deprecated
Copying or archiving duplicate paths with the default duplicates strategy has been deprecated. This is scheduled to be removed in Gradle 7.0. Duplicate path: "META-INF/NOTICE.txt". Explicitly set the duplicates strategy to 'DuplicatesStrategy.INCLUDE' if you want to allow duplicate paths. Consult the upgrading guide for further information: https://docs.gradle.org/6.4/userguide/upgrading_version_5.html#implicit_duplicate_strategy_for_copy_or_archive_tasks_has_been_deprecated

> Task :static-binding-generator:copyJarToBuildTools
3 actionable tasks: 3 executed

> Task :generateMdgJar
To honour the JVM settings for this build a new JVM will be forked. Please consider using the daemon: https://docs.gradle.org/6.4/userguide/gradle_daemon.html.
Daemon will be stopped at the end of the build stopping after processing

> Configure project :android-metadata-generator
The compile configuration has been deprecated for dependency declaration. This will fail with an error in Gradle 7.0. Please use the implementation configuration instead. Consult the upgrading guide for further information: https://docs.gradle.org/6.4/userguide/upgrading_version_5.html#dependencies_should_no_longer_be_declared_using_the_compile_and_runtime_configurations
	at build_8qx6x2e529ggcnezerlzur5n8$_run_closure5.doCall(/home/vagrant/build/srclib/NativeScript_android-runtime/test-app/build-tools/android-metadata-generator/build.gradle:47)
	(Run with --stacktrace to get the full stack trace of this deprecation warning.)
The testCompile configuration has been deprecated for dependency declaration. This will fail with an error in Gradle 7.0. Please use the testImplementation configuration instead. Consult the upgrading guide for further information: https://docs.gradle.org/6.4/userguide/upgrading_version_5.html#dependencies_should_no_longer_be_declared_using_the_compile_and_runtime_configurations
	at build_8qx6x2e529ggcnezerlzur5n8$_run_closure5.doCall(/home/vagrant/build/srclib/NativeScript_android-runtime/test-app/build-tools/android-metadata-generator/build.gradle:52)
	(Run with --stacktrace to get the full stack trace of this deprecation warning.)

> Configure project :app
Internal API constructor DefaultDomainObjectSet(Class<T>) has been deprecated. This is scheduled to be removed in Gradle 7.0. Please use ObjectFactory.domainObjectSet(Class<T>) instead. See https://docs.gradle.org/6.4/userguide/custom_gradle_types.html#domainobjectset for more details.
	at build_6py85dmzpz4lpmwdbcvywm8s0.run(/home/vagrant/build/srclib/NativeScript_android-runtime/test-app/app/build.gradle:35)
	(Run with --stacktrace to get the full stack trace of this deprecation warning.)
	 + setting applicationId
	 + couldn't load user-defined configuration from /home/vagrant/build/srclib/app/App_Resources/Android/app.gradle. File doesn't exist.
	 + using android X library androidx.legacy:legacy-support-v4:1.0.0

> Configure project :runtime
WARNING: Support for ANDROID_NDK_HOME is deprecated and will be removed in the future. Use android.ndkVersion in build.gradle instead.
Support for ANDROID_NDK_HOME is deprecated and will be removed in the future. Use android.ndkVersion in build.gradle instead.

> Configure project :app
WARNING: Folder /home/vagrant/build/srclib/NativeScript_android-runtime/test-app/runtime/build/intermediates/runtime_library_classes/debug does not exists, the dependent project's classes won't be included in the metadata

> Configure project :static-binding-generator
The compile configuration has been deprecated for dependency declaration. This will fail with an error in Gradle 7.0. Please use the implementation or api configuration instead. Consult the upgrading guide for further information: https://docs.gradle.org/6.4/userguide/upgrading_version_5.html#dependencies_should_no_longer_be_declared_using_the_compile_and_runtime_configurations
	at build_99samisgx3y8aheva8tb7clh6$_run_closure2.doCall(/home/vagrant/build/srclib/NativeScript_android-runtime/test-app/build-tools/static-binding-generator/build.gradle:13)
	(Run with --stacktrace to get the full stack trace of this deprecation warning.)
The runtime configuration has been deprecated for resolution. This will fail with an error in Gradle 7.0. Please resolve the runtimeClasspath configuration instead. Consult the upgrading guide for further information: https://docs.gradle.org/6.4/userguide/upgrading_version_5.html#dependencies_should_no_longer_be_declared_using_the_compile_and_runtime_configurations
	at build_8qx6x2e529ggcnezerlzur5n8$_run_closure7$_closure16.doCall(/home/vagrant/build/srclib/NativeScript_android-runtime/test-app/build-tools/android-metadata-generator/build.gradle:79)
	(Run with --stacktrace to get the full stack trace of this deprecation warning.)
The compile configuration has been deprecated for resolution. This will fail with an error in Gradle 7.0. Please resolve the compileClasspath configuration instead. Consult the upgrading guide for further information: https://docs.gradle.org/6.4/userguide/upgrading_version_5.html#dependencies_should_no_longer_be_declared_using_the_compile_and_runtime_configurations
	at build_8qx6x2e529ggcnezerlzur5n8$_run_closure7$_closure16.doCall(/home/vagrant/build/srclib/NativeScript_android-runtime/test-app/build-tools/android-metadata-generator/build.gradle:83)
	(Run with --stacktrace to get the full stack trace of this deprecation warning.)

> Task :android-metadata-generator:compileKotlin
> Task :android-metadata-generator:compileJava
> Task :android-metadata-generator:processResources NO-SOURCE
> Task :android-metadata-generator:classes
> Task :android-metadata-generator:inspectClassesForKotlinIC
> Task :android-metadata-generator:jar
> Task :android-metadata-generator:copyJarToBuildTools
5 actionable tasks: 5 executed

> Task :createDistDir

> Task :getPackageVersion
Using runtime version from package.json '7.0.1'
The package version is '7.0.1'

> Task :getCommitVersion

> Task :generateOptimizedRuntimeAar
To honour the JVM settings for this build a new JVM will be forked. Please consider using the daemon: https://docs.gradle.org/6.4/userguide/gradle_daemon.html.
Daemon will be stopped at the end of the build stopping after processing

> Configure project :android-metadata-generator
The compile configuration has been deprecated for dependency declaration. This will fail with an error in Gradle 7.0. Please use the implementation configuration instead. Consult the upgrading guide for further information: https://docs.gradle.org/6.4/userguide/upgrading_version_5.html#dependencies_should_no_longer_be_declared_using_the_compile_and_runtime_configurations
	at build_8qx6x2e529ggcnezerlzur5n8$_run_closure5.doCall(/home/vagrant/build/srclib/NativeScript_android-runtime/test-app/build-tools/android-metadata-generator/build.gradle:47)
	(Run with --stacktrace to get the full stack trace of this deprecation warning.)
The testCompile configuration has been deprecated for dependency declaration. This will fail with an error in Gradle 7.0. Please use the testImplementation configuration instead. Consult the upgrading guide for further information: https://docs.gradle.org/6.4/userguide/upgrading_version_5.html#dependencies_should_no_longer_be_declared_using_the_compile_and_runtime_configurations
	at build_8qx6x2e529ggcnezerlzur5n8$_run_closure5.doCall(/home/vagrant/build/srclib/NativeScript_android-runtime/test-app/build-tools/android-metadata-generator/build.gradle:52)
	(Run with --stacktrace to get the full stack trace of this deprecation warning.)

> Configure project :app
Internal API constructor DefaultDomainObjectSet(Class<T>) has been deprecated. This is scheduled to be removed in Gradle 7.0. Please use ObjectFactory.domainObjectSet(Class<T>) instead. See https://docs.gradle.org/6.4/userguide/custom_gradle_types.html#domainobjectset for more details.
	at build_6py85dmzpz4lpmwdbcvywm8s0.run(/home/vagrant/build/srclib/NativeScript_android-runtime/test-app/app/build.gradle:35)
	(Run with --stacktrace to get the full stack trace of this deprecation warning.)
	 + setting applicationId
	 + couldn't load user-defined configuration from /home/vagrant/build/srclib/app/App_Resources/Android/app.gradle. File doesn't exist.
	 + using android X library androidx.legacy:legacy-support-v4:1.0.0

> Configure project :runtime
Optimized build triggered.
Use CCache build triggered.
WARNING: Support for ANDROID_NDK_HOME is deprecated and will be removed in the future. Use android.ndkVersion in build.gradle instead.
Support for ANDROID_NDK_HOME is deprecated and will be removed in the future. Use android.ndkVersion in build.gradle instead.

> Configure project :app
WARNING: Folder /home/vagrant/build/srclib/NativeScript_android-runtime/test-app/runtime/build/intermediates/runtime_library_classes/debug does not exists, the dependent project's classes won't be included in the metadata

> Configure project :static-binding-generator
The compile configuration has been deprecated for dependency declaration. This will fail with an error in Gradle 7.0. Please use the implementation or api configuration instead. Consult the upgrading guide for further information: https://docs.gradle.org/6.4/userguide/upgrading_version_5.html#dependencies_should_no_longer_be_declared_using_the_compile_and_runtime_configurations
	at build_99samisgx3y8aheva8tb7clh6$_run_closure2.doCall(/home/vagrant/build/srclib/NativeScript_android-runtime/test-app/build-tools/static-binding-generator/build.gradle:13)
	(Run with --stacktrace to get the full stack trace of this deprecation warning.)
File /home/vagrant/.android/repositories.cfg could not be loaded.
Checking the license for package Android SDK Build-Tools 30.0.1 in /opt/android-sdk/licenses
License for package Android SDK Build-Tools 30.0.1 accepted.
Preparing "Install Android SDK Build-Tools 30.0.1 (revision: 30.0.1)".
"Install Android SDK Build-Tools 30.0.1 (revision: 30.0.1)" ready.
Installing Android SDK Build-Tools 30.0.1 in /opt/android-sdk/build-tools/30.0.1
"Install Android SDK Build-Tools 30.0.1 (revision: 30.0.1)" complete.
"Install Android SDK Build-Tools 30.0.1 (revision: 30.0.1)" finished.
Checking the license for package CMake 3.10.2.4988404 in /opt/android-sdk/licenses
License for package CMake 3.10.2.4988404 accepted.
Preparing "Install CMake 3.10.2.4988404 (revision: 3.10.2)".
"Install CMake 3.10.2.4988404 (revision: 3.10.2)" ready.
Installing CMake 3.10.2.4988404 in /opt/android-sdk/cmake/3.10.2.4988404
"Install CMake 3.10.2.4988404 (revision: 3.10.2)" complete.
"Install CMake 3.10.2.4988404 (revision: 3.10.2)" finished.

> Task :runtime:preBuild UP-TO-DATE
> Task :runtime:preReleaseBuild UP-TO-DATE
> Task :runtime:compileReleaseAidl NO-SOURCE

> Task :runtime:generateJsonModelRelease
WARNING: /home/vagrant/build/srclib/NativeScript_android-runtime/test-app/runtime/CMakeLists.txt : C/C++ release|armeabi-v7a : CMake Warning at /opt/android-sdk/ndk/22.1.7171670/build/cmake/android.toolchain.cmake:449 (message):
  An old version of CMake is being used that cannot automatically detect
  compiler attributes.  Compiler identification is being bypassed.  Some
  values may be wrong or missing.  Update to CMake 3.19 or newer to use
  CMake's built-in compiler identification.
Call Stack (most recent call first):
  /opt/android-sdk/cmake/3.10.2.4988404/share/cmake-3.10/Modules/CMakeDetermineSystem.cmake:94 (include)
  CMakeLists.txt

/home/vagrant/build/srclib/NativeScript_android-runtime/test-app/runtime/CMakeLists.txt : C/C++ release|armeabi-v7a : CMake Warning at /opt/android-sdk/ndk/22.1.7171670/build/cmake/android.toolchain.cmake:449 (message):
  An old version of CMake is being used that cannot automatically detect
  compiler attributes.  Compiler identification is being bypassed.  Some
  values may be wrong or missing.  Update to CMake 3.19 or newer to use
  CMake's built-in compiler identification.
Call Stack (most recent call first):
  /opt/android-sdk/cmake/3.10.2.4988404/share/cmake-3.10/Modules/CMakeDetermineSystem.cmake:94 (include)
  CMakeLists.txt

WARNING: /home/vagrant/build/srclib/NativeScript_android-runtime/test-app/runtime/CMakeLists.txt : C/C++ release|armeabi-v7a : CMake Warning at /opt/android-sdk/ndk/22.1.7171670/build/cmake/android.toolchain.cmake:449 (message):
  An old version of CMake is being used that cannot automatically detect
  compiler attributes.  Compiler identification is being bypassed.  Some
  values may be wrong or missing.  Update to CMake 3.19 or newer to use
  CMake's built-in compiler identification.
Call Stack (most recent call first):
  /home/vagrant/build/srclib/NativeScript_android-runtime/test-app/runtime/.cxx/cmake/release/armeabi-v7a/CMakeFiles/3.10.2/CMakeSystem.cmake:6 (include)
  /home/vagrant/build/srclib/NativeScript_android-runtime/test-app/runtime/.cxx/cmake/release/armeabi-v7a/CMakeFiles/CMakeTmp/CMakeLists.txt:2 (project)

/home/vagrant/build/srclib/NativeScript_android-runtime/test-app/runtime/CMakeLists.txt : C/C++ release|armeabi-v7a : CMake Warning at /opt/android-sdk/ndk/22.1.7171670/build/cmake/android.toolchain.cmake:449 (message):
  An old version of CMake is being used that cannot automatically detect
  compiler attributes.  Compiler identification is being bypassed.  Some
  values may be wrong or missing.  Update to CMake 3.19 or newer to use
  CMake's built-in compiler identification.
Call Stack (most recent call first):
  /home/vagrant/build/srclib/NativeScript_android-runtime/test-app/runtime/.cxx/cmake/release/armeabi-v7a/CMakeFiles/3.10.2/CMakeSystem.cmake:6 (include)
  /home/vagrant/build/srclib/NativeScript_android-runtime/test-app/runtime/.cxx/cmake/release/armeabi-v7a/CMakeFiles/CMakeTmp/CMakeLists.txt:2 (project)

WARNING: /home/vagrant/build/srclib/NativeScript_android-runtime/test-app/runtime/CMakeLists.txt : C/C++ release|arm64-v8a : CMake Warning at /opt/android-sdk/ndk/22.1.7171670/build/cmake/android.toolchain.cmake:449 (message):
  An old version of CMake is being used that cannot automatically detect
  compiler attributes.  Compiler identification is being bypassed.  Some
  values may be wrong or missing.  Update to CMake 3.19 or newer to use
  CMake's built-in compiler identification.
Call Stack (most recent call first):
  /opt/android-sdk/cmake/3.10.2.4988404/share/cmake-3.10/Modules/CMakeDetermineSystem.cmake:94 (include)
  CMakeLists.txt

/home/vagrant/build/srclib/NativeScript_android-runtime/test-app/runtime/CMakeLists.txt : C/C++ release|arm64-v8a : CMake Warning at /opt/android-sdk/ndk/22.1.7171670/build/cmake/android.toolchain.cmake:449 (message):
  An old version of CMake is being used that cannot automatically detect
  compiler attributes.  Compiler identification is being bypassed.  Some
  values may be wrong or missing.  Update to CMake 3.19 or newer to use
  CMake's built-in compiler identification.
Call Stack (most recent call first):
  /opt/android-sdk/cmake/3.10.2.4988404/share/cmake-3.10/Modules/CMakeDetermineSystem.cmake:94 (include)
  CMakeLists.txt

WARNING: /home/vagrant/build/srclib/NativeScript_android-runtime/test-app/runtime/CMakeLists.txt : C/C++ release|arm64-v8a : CMake Warning at /opt/android-sdk/ndk/22.1.7171670/build/cmake/android.toolchain.cmake:449 (message):
  An old version of CMake is being used that cannot automatically detect
  compiler attributes.  Compiler identification is being bypassed.  Some
  values may be wrong or missing.  Update to CMake 3.19 or newer to use
  CMake's built-in compiler identification.
Call Stack (most recent call first):
  /home/vagrant/build/srclib/NativeScript_android-runtime/test-app/runtime/.cxx/cmake/release/arm64-v8a/CMakeFiles/3.10.2/CMakeSystem.cmake:6 (include)
  /home/vagrant/build/srclib/NativeScript_android-runtime/test-app/runtime/.cxx/cmake/release/arm64-v8a/CMakeFiles/CMakeTmp/CMakeLists.txt:2 (project)

/home/vagrant/build/srclib/NativeScript_android-runtime/test-app/runtime/CMakeLists.txt : C/C++ release|arm64-v8a : CMake Warning at /opt/android-sdk/ndk/22.1.7171670/build/cmake/android.toolchain.cmake:449 (message):
  An old version of CMake is being used that cannot automatically detect
  compiler attributes.  Compiler identification is being bypassed.  Some
  values may be wrong or missing.  Update to CMake 3.19 or newer to use
  CMake's built-in compiler identification.
Call Stack (most recent call first):
  /home/vagrant/build/srclib/NativeScript_android-runtime/test-app/runtime/.cxx/cmake/release/arm64-v8a/CMakeFiles/3.10.2/CMakeSystem.cmake:6 (include)
  /home/vagrant/build/srclib/NativeScript_android-runtime/test-app/runtime/.cxx/cmake/release/arm64-v8a/CMakeFiles/CMakeTmp/CMakeLists.txt:2 (project)

WARNING: /home/vagrant/build/srclib/NativeScript_android-runtime/test-app/runtime/CMakeLists.txt : C/C++ release|x86 : CMake Warning at /opt/android-sdk/ndk/22.1.7171670/build/cmake/android.toolchain.cmake:449 (message):
  An old version of CMake is being used that cannot automatically detect
  compiler attributes.  Compiler identification is being bypassed.  Some
  values may be wrong or missing.  Update to CMake 3.19 or newer to use
  CMake's built-in compiler identification.
Call Stack (most recent call first):
  /opt/android-sdk/cmake/3.10.2.4988404/share/cmake-3.10/Modules/CMakeDetermineSystem.cmake:94 (include)
  CMakeLists.txt

/home/vagrant/build/srclib/NativeScript_android-runtime/test-app/runtime/CMakeLists.txt : C/C++ release|x86 : CMake Warning at /opt/android-sdk/ndk/22.1.7171670/build/cmake/android.toolchain.cmake:449 (message):
  An old version of CMake is being used that cannot automatically detect
  compiler attributes.  Compiler identification is being bypassed.  Some
  values may be wrong or missing.  Update to CMake 3.19 or newer to use
  CMake's built-in compiler identification.
Call Stack (most recent call first):
  /opt/android-sdk/cmake/3.10.2.4988404/share/cmake-3.10/Modules/CMakeDetermineSystem.cmake:94 (include)
  CMakeLists.txt

WARNING: /home/vagrant/build/srclib/NativeScript_android-runtime/test-app/runtime/CMakeLists.txt : C/C++ release|x86 : CMake Warning at /opt/android-sdk/ndk/22.1.7171670/build/cmake/android.toolchain.cmake:449 (message):
  An old version of CMake is being used that cannot automatically detect
  compiler attributes.  Compiler identification is being bypassed.  Some
  values may be wrong or missing.  Update to CMake 3.19 or newer to use
  CMake's built-in compiler identification.
Call Stack (most recent call first):
  /home/vagrant/build/srclib/NativeScript_android-runtime/test-app/runtime/.cxx/cmake/release/x86/CMakeFiles/3.10.2/CMakeSystem.cmake:6 (include)
  /home/vagrant/build/srclib/NativeScript_android-runtime/test-app/runtime/.cxx/cmake/release/x86/CMakeFiles/CMakeTmp/CMakeLists.txt:2 (project)

/home/vagrant/build/srclib/NativeScript_android-runtime/test-app/runtime/CMakeLists.txt : C/C++ release|x86 : CMake Warning at /opt/android-sdk/ndk/22.1.7171670/build/cmake/android.toolchain.cmake:449 (message):
  An old version of CMake is being used that cannot automatically detect
  compiler attributes.  Compiler identification is being bypassed.  Some
  values may be wrong or missing.  Update to CMake 3.19 or newer to use
  CMake's built-in compiler identification.
Call Stack (most recent call first):
  /home/vagrant/build/srclib/NativeScript_android-runtime/test-app/runtime/.cxx/cmake/release/x86/CMakeFiles/3.10.2/CMakeSystem.cmake:6 (include)
  /home/vagrant/build/srclib/NativeScript_android-runtime/test-app/runtime/.cxx/cmake/release/x86/CMakeFiles/CMakeTmp/CMakeLists.txt:2 (project)

WARNING: /home/vagrant/build/srclib/NativeScript_android-runtime/test-app/runtime/CMakeLists.txt : C/C++ release|x86_64 : CMake Warning at /opt/android-sdk/ndk/22.1.7171670/build/cmake/android.toolchain.cmake:449 (message):
  An old version of CMake is being used that cannot automatically detect
  compiler attributes.  Compiler identification is being bypassed.  Some
  values may be wrong or missing.  Update to CMake 3.19 or newer to use
  CMake's built-in compiler identification.
Call Stack (most recent call first):
  /opt/android-sdk/cmake/3.10.2.4988404/share/cmake-3.10/Modules/CMakeDetermineSystem.cmake:94 (include)
  CMakeLists.txt

/home/vagrant/build/srclib/NativeScript_android-runtime/test-app/runtime/CMakeLists.txt : C/C++ release|x86_64 : CMake Warning at /opt/android-sdk/ndk/22.1.7171670/build/cmake/android.toolchain.cmake:449 (message):
  An old version of CMake is being used that cannot automatically detect
  compiler attributes.  Compiler identification is being bypassed.  Some
  values may be wrong or missing.  Update to CMake 3.19 or newer to use
  CMake's built-in compiler identification.
Call Stack (most recent call first):
  /opt/android-sdk/cmake/3.10.2.4988404/share/cmake-3.10/Modules/CMakeDetermineSystem.cmake:94 (include)
  CMakeLists.txt

WARNING: /home/vagrant/build/srclib/NativeScript_android-runtime/test-app/runtime/CMakeLists.txt : C/C++ release|x86_64 : CMake Warning at /opt/android-sdk/ndk/22.1.7171670/build/cmake/android.toolchain.cmake:449 (message):
  An old version of CMake is being used that cannot automatically detect
  compiler attributes.  Compiler identification is being bypassed.  Some
  values may be wrong or missing.  Update to CMake 3.19 or newer to use
  CMake's built-in compiler identification.
Call Stack (most recent call first):
  /home/vagrant/build/srclib/NativeScript_android-runtime/test-app/runtime/.cxx/cmake/release/x86_64/CMakeFiles/3.10.2/CMakeSystem.cmake:6 (include)
  /home/vagrant/build/srclib/NativeScript_android-runtime/test-app/runtime/.cxx/cmake/release/x86_64/CMakeFiles/CMakeTmp/CMakeLists.txt:2 (project)

/home/vagrant/build/srclib/NativeScript_android-runtime/test-app/runtime/CMakeLists.txt : C/C++ release|x86_64 : CMake Warning at /opt/android-sdk/ndk/22.1.7171670/build/cmake/android.toolchain.cmake:449 (message):
  An old version of CMake is being used that cannot automatically detect
  compiler attributes.  Compiler identification is being bypassed.  Some
  values may be wrong or missing.  Update to CMake 3.19 or newer to use
  CMake's built-in compiler identification.
Call Stack (most recent call first):
  /home/vagrant/build/srclib/NativeScript_android-runtime/test-app/runtime/.cxx/cmake/release/x86_64/CMakeFiles/3.10.2/CMakeSystem.cmake:6 (include)
  /home/vagrant/build/srclib/NativeScript_android-runtime/test-app/runtime/.cxx/cmake/release/x86_64/CMakeFiles/CMakeTmp/CMakeLists.txt:2 (project)


> Task :runtime:setPackageVersion
Setting runtime version: '7.0.1'

> Task :runtime:setRuntimeCommit
Setting runtime commit: 'no commit sha was provided by build.gradle build'

> Task :runtime:externalNativeBuildRelease
Build NativeScript_armeabi-v7a
ninja: Entering directory `/home/vagrant/build/srclib/NativeScript_android-runtime/test-app/runtime/.cxx/cmake/release/armeabi-v7a'
[1/42] Building CXX object CMakeFiles/NativeScript.dir/src/main/cpp/Constants.cpp.o
[2/42] Building CXX object CMakeFiles/NativeScript.dir/src/main/cpp/DirectBuffer.cpp.o
[3/42] Building CXX object CMakeFiles/NativeScript.dir/src/main/cpp/AssetExtractor.cpp.o
[4/42] Building CXX object CMakeFiles/NativeScript.dir/src/main/cpp/ArrayElementAccessor.cpp.o
[5/42] Building CXX object CMakeFiles/NativeScript.dir/src/main/cpp/ArrayBufferHelper.cpp.o
[6/42] Building CXX object CMakeFiles/NativeScript.dir/src/main/cpp/ArrayHelper.cpp.o
[7/42] Building CXX object CMakeFiles/NativeScript.dir/src/main/cpp/JEnv.cpp.o
[8/42] Building CXX object CMakeFiles/NativeScript.dir/src/main/cpp/File.cpp.o
[9/42] Building CXX object CMakeFiles/NativeScript.dir/src/main/cpp/FieldAccessor.cpp.o
[10/42] Building CXX object CMakeFiles/NativeScript.dir/src/main/cpp/ArgConverter.cpp.o
[11/42] Building CXX object CMakeFiles/NativeScript.dir/src/main/cpp/Logger.cpp.o
[12/42] Building CXX object CMakeFiles/NativeScript.dir/src/main/cpp/JType.cpp.o
[13/42] Building CXX object CMakeFiles/NativeScript.dir/src/main/cpp/DesugaredInterfaceCompanionClassNameResolver.cpp.o
[14/42] Building CXX object CMakeFiles/NativeScript.dir/src/main/cpp/JniSignatureParser.cpp.o
[15/42] Building CXX object CMakeFiles/NativeScript.dir/src/main/cpp/ManualInstrumentation.cpp.o
[16/42] Building CXX object CMakeFiles/NativeScript.dir/src/main/cpp/MetadataMethodInfo.cpp.o
[17/42] Building CXX object CMakeFiles/NativeScript.dir/src/main/cpp/JSONObjectHelper.cpp.o
[18/42] Building CXX object CMakeFiles/NativeScript.dir/src/main/cpp/CallbackHandlers.cpp.o
[19/42] Building CXX object CMakeFiles/NativeScript.dir/src/main/cpp/JsArgToArrayConverter.cpp.o
[20/42] Building CXX object CMakeFiles/NativeScript.dir/src/main/cpp/JsArgConverter.cpp.o
[21/42] Building CXX object CMakeFiles/NativeScript.dir/src/main/cpp/MetadataTreeNode.cpp.o
[22/42] Building CXX object CMakeFiles/NativeScript.dir/src/main/cpp/MetadataReader.cpp.o
[23/42] Building CXX object CMakeFiles/NativeScript.dir/src/main/cpp/MessageLoopTimer.cpp.o
[24/42] Building CXX object CMakeFiles/NativeScript.dir/src/main/cpp/MethodCache.cpp.o
[25/42] Building CXX object CMakeFiles/NativeScript.dir/src/main/cpp/ReadWriteLock.cpp.o
[26/42] Building CXX object CMakeFiles/NativeScript.dir/src/main/cpp/NativeScriptException.cpp.o
[27/42] Building CXX object CMakeFiles/NativeScript.dir/src/main/cpp/NumericCasts.cpp.o
[28/42] Building CXX object CMakeFiles/NativeScript.dir/src/main/cpp/SimpleAllocator.cpp.o
[29/42] Building CXX object CMakeFiles/NativeScript.dir/src/main/cpp/Profiler.cpp.o
[30/42] Building CXX object CMakeFiles/NativeScript.dir/src/main/cpp/ModuleInternal.cpp.o
[31/42] Building CXX object CMakeFiles/NativeScript.dir/src/main/cpp/Util.cpp.o
FAILED: CMakeFiles/NativeScript.dir/src/main/cpp/Util.cpp.o 
/opt/android-sdk/ndk/22.1.7171670/toolchains/llvm/prebuilt/linux-x86_64/bin/clang++ --target=armv7-none-linux-androideabi17 --gcc-toolchain=/opt/android-sdk/ndk/22.1.7171670/toolchains/llvm/prebuilt/linux-x86_64 --sysroot=/opt/android-sdk/ndk/22.1.7171670/toolchains/llvm/prebuilt/linux-x86_64/sysroot  -DNativeScript_EXPORTS -I../../../../src/main/cpp/include/libc++ -I../../../../src/main/cpp -I../../../../src/main/cpp/include -I../../../../src/main/cpp/v8_inspector -I../../../../src/main/libs/armeabi-v7a/include -nostdinc++ -std=c++14 -Werror -Wno-unused-result -mstackrealign -fexceptions -fno-builtin-stpcpy -fno-rtti -D_LIBCPP_ABI_VERSION=Cr -D_LIBCPP_ENABLE_NODISCARD -D_LIBCPP_ABI_UNSTABLE -DV8_31BIT_SMIS_ON_64BIT_ARCH -DV8_31BIT_SMIS_ON_64BIT_ARCH -DV8_ENABLE_REGEXP_INTERPRETER_THREADED_DISPATCH -DV8_EMBEDDED_BUILTINS -O3 -fvisibility=hidden -ffunction-sections -fno-data-sections -Oz -DNDEBUG  -fPIC -MD -MT CMakeFiles/NativeScript.dir/src/main/cpp/Util.cpp.o -MF CMakeFiles/NativeScript.dir/src/main/cpp/Util.cpp.o.d -o CMakeFiles/NativeScript.dir/src/main/cpp/Util.cpp.o -c ../../../../src/main/cpp/Util.cpp
../../../../src/main/cpp/Util.cpp:118:24: error: address of stack memory associated with local variable 'utf16String' returned [-Werror,-Wreturn-stack-address]
    return (uint16_t*) utf16String.c_str();
                       ^~~~~~~~~~~
1 error generated.
[32/42] Building CXX object CMakeFiles/NativeScript.dir/src/main/cpp/V8GlobalHelpers.cpp.o
[33/42] Building CXX object CMakeFiles/NativeScript.dir/src/main/cpp/SimpleProfiler.cpp.o
[34/42] Building CXX object CMakeFiles/NativeScript.dir/src/main/cpp/V8StringConstants.cpp.o
[35/42] Building CXX object CMakeFiles/NativeScript.dir/src/main/cpp/ObjectManager.cpp.o
[36/42] Building CXX object CMakeFiles/NativeScript.dir/src/main/cpp/WeakRef.cpp.o
[37/42] Building CXX object CMakeFiles/NativeScript.dir/src/main/cpp/MetadataNode.cpp.o
[38/42] Building CXX object CMakeFiles/NativeScript.dir/src/main/cpp/Runtime.cpp.o
ninja: build stopped: subcommand failed.

> Task :runtime:externalNativeBuildRelease FAILED

Execution failed for task ':runtime:externalNativeBuildRelease'.
Build command failed.
Error while executing process /opt/android-sdk/cmake/3.10.2.4988404/bin/ninja with arguments {-C /home/vagrant/build/srclib/NativeScript_android-runtime/test-app/runtime/.cxx/cmake/release/armeabi-v7a NativeScript}
ninja: Entering directory `/home/vagrant/build/srclib/NativeScript_android-runtime/test-app/runtime/.cxx/cmake/release/armeabi-v7a'
[1/42] Building CXX object CMakeFiles/NativeScript.dir/src/main/cpp/Constants.cpp.o
[2/42] Building CXX object CMakeFiles/NativeScript.dir/src/main/cpp/DirectBuffer.cpp.o
[3/42] Building CXX object CMakeFiles/NativeScript.dir/src/main/cpp/AssetExtractor.cpp.o
[4/42] Building CXX object CMakeFiles/NativeScript.dir/src/main/cpp/ArrayElementAccessor.cpp.o
[5/42] Building CXX object CMakeFiles/NativeScript.dir/src/main/cpp/ArrayBufferHelper.cpp.o
[6/42] Building CXX object CMakeFiles/NativeScript.dir/src/main/cpp/ArrayHelper.cpp.o
[7/42] Building CXX object CMakeFiles/NativeScript.dir/src/main/cpp/JEnv.cpp.o
[8/42] Building CXX object CMakeFiles/NativeScript.dir/src/main/cpp/File.cpp.o
[9/42] Building CXX object CMakeFiles/NativeScript.dir/src/main/cpp/FieldAccessor.cpp.o
[10/42] Building CXX object CMakeFiles/NativeScript.dir/src/main/cpp/ArgConverter.cpp.o
[11/42] Building CXX object CMakeFiles/NativeScript.dir/src/main/cpp/Logger.cpp.o
[12/42] Building CXX object CMakeFiles/NativeScript.dir/src/main/cpp/JType.cpp.o
[13/42] Building CXX object CMakeFiles/NativeScript.dir/src/main/cpp/DesugaredInterfaceCompanionClassNameResolver.cpp.o
[14/42] Building CXX object CMakeFiles/NativeScript.dir/src/main/cpp/JniSignatureParser.cpp.o
[15/42] Building CXX object CMakeFiles/NativeScript.dir/src/main/cpp/ManualInstrumentation.cpp.o
[16/42] Building CXX object CMakeFiles/NativeScript.dir/src/main/cpp/MetadataMethodInfo.cpp.o
[17/42] Building CXX object CMakeFiles/NativeScript.dir/src/main/cpp/JSONObjectHelper.cpp.o
[18/42] Building CXX object CMakeFiles/NativeScript.dir/src/main/cpp/CallbackHandlers.cpp.o
[19/42] Building CXX object CMakeFiles/NativeScript.dir/src/main/cpp/JsArgToArrayConverter.cpp.o
[20/42] Building CXX object CMakeFiles/NativeScript.dir/src/main/cpp/JsArgConverter.cpp.o
[21/42] Building CXX object CMakeFiles/NativeScript.dir/src/main/cpp/MetadataTreeNode.cpp.o
[22/42] Building CXX object CMakeFiles/NativeScript.dir/src/main/cpp/MetadataReader.cpp.o
[23/42] Building CXX object CMakeFiles/NativeScript.dir/src/main/cpp/MessageLoopTimer.cpp.o
[24/42] Building CXX object CMakeFiles/NativeScript.dir/src/main/cpp/MethodCache.cpp.o
[25/42] Building CXX object CMakeFiles/NativeScript.dir/src/main/cpp/ReadWriteLock.cpp.o
[26/42] Building CXX object CMakeFiles/NativeScript.dir/src/main/cpp/NativeScriptException.cpp.o
[27/42] Building CXX object CMakeFiles/NativeScript.dir/src/main/cpp/NumericCasts.cpp.o
[28/42] Building CXX object CMakeFiles/NativeScript.dir/src/main/cpp/SimpleAllocator.cpp.o
[29/42] Building CXX object CMakeFiles/NativeScript.dir/src/main/cpp/Profiler.cpp.o
[30/42] Building CXX object CMakeFiles/NativeScript.dir/src/main/cpp/ModuleInternal.cpp.o
[31/42] Building CXX object CMakeFiles/NativeScript.dir/src/main/cpp/Util.cpp.o
FAILED: CMakeFiles/NativeScript.dir/src/main/cpp/Util.cpp.o 
/opt/android-sdk/ndk/22.1.7171670/toolchains/llvm/prebuilt/linux-x86_64/bin/clang++ --target=armv7-none-linux-androideabi17 --gcc-toolchain=/opt/android-sdk/ndk/22.1.7171670/toolchains/llvm/prebuilt/linux-x86_64 --sysroot=/opt/android-sdk/ndk/22.1.7171670/toolchains/llvm/prebuilt/linux-x86_64/sysroot  -DNativeScript_EXPORTS -I../../../../src/main/cpp/include/libc++ -I../../../../src/main/cpp -I../../../../src/main/cpp/include -I../../../../src/main/cpp/v8_inspector -I../../../../src/main/libs/armeabi-v7a/include -nostdinc++ -std=c++14 -Werror -Wno-unused-result -mstackrealign -fexceptions -fno-builtin-stpcpy -fno-rtti -D_LIBCPP_ABI_VERSION=Cr -D_LIBCPP_ENABLE_NODISCARD -D_LIBCPP_ABI_UNSTABLE -DV8_31BIT_SMIS_ON_64BIT_ARCH -DV8_31BIT_SMIS_ON_64BIT_ARCH -DV8_ENABLE_REGEXP_INTERPRETER_THREADED_DISPATCH -DV8_EMBEDDED_BUILTINS -O3 -fvisibility=hidden -ffunction-sections -fno-data-sections -Oz -DNDEBUG  -fPIC -MD -MT CMakeFiles/NativeScript.dir/src/main/cpp/Util.cpp.o -MF CMakeFiles/NativeScript.dir/src/main/cpp/Util.cpp.o.d -o CMakeFiles/NativeScript.dir/src/main/cpp/Util.cpp.o -c ../../../../src/main/cpp/Util.cpp
../../../../src/main/cpp/Util.cpp:118:24: error: address of stack memory associated with local variable 'utf16String' returned [-Werror,-Wreturn-stack-address]
    return (uint16_t*) utf16String.c_str();
                       ^~~~~~~~~~~
1 error generated.
[32/42] Building CXX object CMakeFiles/NativeScript.dir/src/main/cpp/V8GlobalHelpers.cpp.o
[33/42] Building CXX object CMakeFiles/NativeScript.dir/src/main/cpp/SimpleProfiler.cpp.o
[34/42] Building CXX object CMakeFiles/NativeScript.dir/src/main/cpp/V8StringConstants.cpp.o
[35/42] Building CXX object CMakeFiles/NativeScript.dir/src/main/cpp/ObjectManager.cpp.o
[36/42] Building CXX object CMakeFiles/NativeScript.dir/src/main/cpp/WeakRef.cpp.o
[37/42] Building CXX object CMakeFiles/NativeScript.dir/src/main/cpp/MetadataNode.cpp.o
[38/42] Building CXX object CMakeFiles/NativeScript.dir/src/main/cpp/Runtime.cpp.o
ninja: build stopped: subcommand failed.



4 actionable tasks: 4 executed

> Task :generateOptimizedRuntimeAar FAILED

FAILURE: Build failed with an exception.

* What went wrong:
Execution failed for task ':generateOptimizedRuntimeAar'.
> Process 'command './gradlew'' finished with non-zero exit value 1

* Try:
Run with --stacktrace option to get the stack trace. Run with --info or --debug option to get more log output. Run with --scan to get full insights.

* Get more help at https://help.gradle.org

BUILD FAILED in 2m 15s
9 actionable tasks: 8 executed, 1 up-to-date
+ cd platforms/android/app/build/outputs/apk/release
bash: line 0: cd: platforms/android/app/build/outputs/apk/release: No such file or directory
==== detail end ====
2021-07-27 01:38:36,705 DEBUG: Error encoutered, stopping by user request.