log for de.blinkt.openvpn:191

Traceback (most recent call last):
  File "/home/fbuild/fdroidserver/fdroidserver/build.py", line 1128, in main
    options.onserver, options.refresh):
  File "/home/fbuild/fdroidserver/fdroidserver/build.py", line 887, in trybuild
    build_server(app, build, vcs, build_dir, output_dir, log_dir, force)
  File "/home/fbuild/fdroidserver/fdroidserver/build.py", line 270, in build_server
    str(output, 'utf-8'))
fdroidserver.exception.BuildException: Build.py failed on server for de.blinkt.openvpn:0.7.36
==== detail begin ====
== Installed Android Tools ==

2022-05-08 09:12:16,181 DEBUG: Reading 'config.yml'
2022-05-08 09:12:16,192 INFO: Using /opt/android-sdk/build-tools/29.0.3/apksigner 
2022-05-08 09:12:16,195 INFO: Creating log directory
2022-05-08 09:12:16,195 INFO: Creating temporary directory
2022-05-08 09:12:16,195 INFO: Creating output directory
2022-05-08 09:12:16,206 DEBUG: Getting git vcs interface for https://github.com/schwabe/ics-openvpn
2022-05-08 09:12:16,207 DEBUG: > git --version
git version 2.11.0
2022-05-08 09:12:16,506 INFO: Using git version 2.11.0
2022-05-08 09:12:16,506 DEBUG: Checking 0.7.36
2022-05-08 09:12:16,506 INFO: Building version 0.7.36 (191) of de.blinkt.openvpn
2022-05-08 09:12:16,507 WARNING: Android NDK version 'r19c' could not be found!
2022-05-08 09:12:16,507 WARNING: Configured versions:
2022-05-08 09:12:16,507 WARNING:   r23b: /opt/android-sdk/ndk/23.1.7779620
2022-05-08 09:12:16,507 WARNING:   r21e: /opt/android-sdk/ndk/21.4.7075529
2022-05-08 09:12:16,508 INFO: Downloading https://dl.google.com/android/repository/android-ndk-r19c-linux-x86_64.zip
2022-05-08 09:12:16,520 DEBUG: Starting new HTTPS connection (1): dl.google.com
2022-05-08 09:12:16,581 DEBUG: https://dl.google.com:443 "GET /android/repository/android-ndk-r19c-linux-x86_64.zip HTTP/1.1" 200 823376982
2022-05-08 09:12:40,317 INFO: Unzipping to /opt/android-sdk/ndk
2022-05-08 09:13:00,768 INFO: Set NDK r19c (19.2.5345600) up
2022-05-08 09:13:00,774 INFO: Running 'sudo' commands in /home/vagrant
2022-05-08 09:13:00,774 DEBUG: > sudo DEBIAN_FRONTEND=noninteractive bash -x -c apt-get update || apt-get update && apt-get install -y openjdk-11-jdk-headless && update-alternatives --auto java
+ apt-get update
Get:1 http://security.debian.org/debian-security stretch/updates InRelease [53.0 kB]
Ign:2 http://deb.debian.org/debian stretch InRelease
Hit:3 http://deb.debian.org/debian stretch-updates InRelease
Get:4 http://deb.debian.org/debian stretch-backports-sloppy InRelease [46.7 kB]
Get:5 http://deb.debian.org/debian stretch-backports InRelease [91.8 kB]
Get:6 http://deb.debian.org/debian testing InRelease [130 kB]
Hit:7 http://deb.debian.org/debian stretch Release
Get:8 http://deb.debian.org/debian testing/main i386 Packages.diff/Index [63.6 kB]
Get:10 http://deb.debian.org/debian testing/main amd64 Packages.diff/Index [63.6 kB]
Get:11 http://deb.debian.org/debian testing/main Translation-en.diff/Index [63.6 kB]
Get:12 http://deb.debian.org/debian testing/main i386 Packages T-2022-05-08-0206.12-F-2022-05-07-1407.05.pdiff [55.5 kB]
Get:13 http://deb.debian.org/debian testing/main amd64 Packages T-2022-05-08-0206.12-F-2022-05-07-1407.05.pdiff [56.2 kB]
Get:12 http://deb.debian.org/debian testing/main i386 Packages T-2022-05-08-0206.12-F-2022-05-07-1407.05.pdiff [55.5 kB]
Get:13 http://deb.debian.org/debian testing/main amd64 Packages T-2022-05-08-0206.12-F-2022-05-07-1407.05.pdiff [56.2 kB]
Get:14 http://deb.debian.org/debian testing/main Translation-en T-2022-05-08-0206.12-F-2022-05-07-1407.05.pdiff [5,949 B]
Get:14 http://deb.debian.org/debian testing/main Translation-en T-2022-05-08-0206.12-F-2022-05-07-1407.05.pdiff [5,949 B]
Fetched 630 kB in 7s (88.5 kB/s)
Reading package lists...
+ apt-get install -y openjdk-11-jdk-headless
Reading package lists...
Building dependency tree...
Reading state information...
The following additional packages will be installed:
  libasound2 libasound2-data openjdk-11-jre-headless
Suggested packages:
  libasound2-plugins alsa-utils openjdk-11-demo openjdk-11-source libnss-mdns
  fonts-dejavu-extra fonts-ipafont-gothic fonts-ipafont-mincho
  fonts-wqy-microhei | fonts-wqy-zenhei fonts-indic
The following NEW packages will be installed:
  libasound2 libasound2-data openjdk-11-jdk-headless openjdk-11-jre-headless
0 upgraded, 4 newly installed, 0 to remove and 2 not upgraded.
Need to get 230 MB of archives.
After this operation, 374 MB of additional disk space will be used.
Get:1 http://deb.debian.org/debian stretch/main amd64 libasound2-data all 1.1.3-5 [173 kB]
Get:2 http://deb.debian.org/debian stretch/main amd64 libasound2 amd64 1.1.3-5 [497 kB]
Get:3 http://deb.debian.org/debian stretch-backports/main amd64 openjdk-11-jre-headless amd64 11.0.6+10-1~bpo9+1 [37.4 MB]
Get:4 http://deb.debian.org/debian stretch-backports/main amd64 openjdk-11-jdk-headless amd64 11.0.6+10-1~bpo9+1 [192 MB]
Fetched 230 MB in 2s (90.7 MB/s)
Selecting previously unselected package libasound2-data.
(Reading database ... 64892 files and directories currently installed.)
Preparing to unpack .../libasound2-data_1.1.3-5_all.deb ...
Unpacking libasound2-data (1.1.3-5) ...
Selecting previously unselected package libasound2:amd64.
Preparing to unpack .../libasound2_1.1.3-5_amd64.deb ...
Unpacking libasound2:amd64 (1.1.3-5) ...
Selecting previously unselected package openjdk-11-jre-headless:amd64.
Preparing to unpack .../openjdk-11-jre-headless_11.0.6+10-1~bpo9+1_amd64.deb ...
Unpacking openjdk-11-jre-headless:amd64 (11.0.6+10-1~bpo9+1) ...
Selecting previously unselected package openjdk-11-jdk-headless:amd64.
Preparing to unpack .../openjdk-11-jdk-headless_11.0.6+10-1~bpo9+1_amd64.deb ...
Unpacking openjdk-11-jdk-headless:amd64 (11.0.6+10-1~bpo9+1) ...
Setting up libasound2-data (1.1.3-5) ...
Setting up libasound2:amd64 (1.1.3-5) ...
Processing triggers for libc-bin (2.24-11+deb9u4) ...
Setting up openjdk-11-jre-headless:amd64 (11.0.6+10-1~bpo9+1) ...
Setting up openjdk-11-jdk-headless:amd64 (11.0.6+10-1~bpo9+1) ...
update-alternatives: using /usr/lib/jvm/java-11-openjdk-amd64/bin/jdeprscan to provide /usr/bin/jdeprscan (jdeprscan) in auto mode
update-alternatives: using /usr/lib/jvm/java-11-openjdk-amd64/bin/jimage to provide /usr/bin/jimage (jimage) in auto mode
update-alternatives: using /usr/lib/jvm/java-11-openjdk-amd64/bin/jlink to provide /usr/bin/jlink (jlink) in auto mode
update-alternatives: using /usr/lib/jvm/java-11-openjdk-amd64/bin/jmod to provide /usr/bin/jmod (jmod) in auto mode
update-alternatives: using /usr/lib/jvm/java-11-openjdk-amd64/bin/jshell to provide /usr/bin/jshell (jshell) in auto mode
update-alternatives: using /usr/lib/jvm/java-11-openjdk-amd64/bin/jaotc to provide /usr/bin/jaotc (jaotc) in auto mode
update-alternatives: using /usr/lib/jvm/java-11-openjdk-amd64/bin/jhsdb to provide /usr/bin/jhsdb (jhsdb) in auto mode
+ update-alternatives --auto java
update-alternatives: using /usr/lib/jvm/java-11-openjdk-amd64/bin/java to provide /usr/bin/java (java) in auto mode
2022-05-08 09:13:31,401 DEBUG: > sudo passwd --lock root
passwd: password expiry information changed.
2022-05-08 09:13:31,611 DEBUG: > sudo SUDO_FORCE_REMOVE=yes dpkg --purge sudo
(Reading database ... 65549 files and directories currently installed.)
Removing sudo (1.8.19p1-2.1+deb9u3) ...
Purging configuration files for sudo (1.8.19p1-2.1+deb9u3) ...
Processing triggers for systemd (232-25+deb9u13) ...
2022-05-08 09:13:37,008 INFO: Getting source for revision b8067d4eda6d198db8a799c921310779253bbe11
2022-05-08 09:13:37,009 DEBUG: Directory: build/de.blinkt.openvpn
2022-05-08 09:13:37,009 DEBUG: > git rev-parse --show-toplevel
2022-05-08 09:13:37,399 DEBUG: Directory: build/de.blinkt.openvpn
2022-05-08 09:13:37,399 DEBUG: > git submodule foreach --recursive git reset --hard
2022-05-08 09:13:43,826 DEBUG: Directory: build/de.blinkt.openvpn
2022-05-08 09:13:43,826 DEBUG: > git reset --hard
2022-05-08 09:13:44,134 DEBUG: Directory: build/de.blinkt.openvpn
2022-05-08 09:13:44,134 DEBUG: > git submodule foreach --recursive git clean -dffx
2022-05-08 09:13:44,444 DEBUG: Directory: build/de.blinkt.openvpn
2022-05-08 09:13:44,444 DEBUG: > git clean -dffx
2022-05-08 09:13:44,554 DEBUG: Directory: build/de.blinkt.openvpn
2022-05-08 09:13:44,554 DEBUG: > git -c core.askpass=/bin/true -c core.sshCommand=/bin/false -c url.https://.insteadOf=ssh:// -c url.https://u:p@bitbucket.org/.insteadOf=git@bitbucket.org: -c url.https://u:p@bitbucket.org.insteadOf=git://bitbucket.org -c url.https://u:p@bitbucket.org.insteadOf=https://bitbucket.org -c url.https://u:p@github.com/.insteadOf=git@github.com: -c url.https://u:p@github.com.insteadOf=git://github.com -c url.https://u:p@github.com.insteadOf=https://github.com -c url.https://u:p@gitlab.com/.insteadOf=git@gitlab.com: -c url.https://u:p@gitlab.com.insteadOf=git://gitlab.com -c url.https://u:p@gitlab.com.insteadOf=https://gitlab.com fetch origin
2022-05-08 09:13:59,797 DEBUG: Directory: build/de.blinkt.openvpn
2022-05-08 09:13:59,797 DEBUG: > git -c core.askpass=/bin/true -c core.sshCommand=/bin/false -c url.https://.insteadOf=ssh:// -c url.https://u:p@bitbucket.org/.insteadOf=git@bitbucket.org: -c url.https://u:p@bitbucket.org.insteadOf=git://bitbucket.org -c url.https://u:p@bitbucket.org.insteadOf=https://bitbucket.org -c url.https://u:p@github.com/.insteadOf=git@github.com: -c url.https://u:p@github.com.insteadOf=git://github.com -c url.https://u:p@github.com.insteadOf=https://github.com -c url.https://u:p@gitlab.com/.insteadOf=git@gitlab.com: -c url.https://u:p@gitlab.com.insteadOf=git://gitlab.com -c url.https://u:p@gitlab.com.insteadOf=https://gitlab.com remote prune origin
2022-05-08 09:14:00,109 DEBUG: Directory: build/de.blinkt.openvpn
2022-05-08 09:14:00,110 DEBUG: > git -c core.askpass=/bin/true -c core.sshCommand=/bin/false -c url.https://.insteadOf=ssh:// -c url.https://u:p@bitbucket.org/.insteadOf=git@bitbucket.org: -c url.https://u:p@bitbucket.org.insteadOf=git://bitbucket.org -c url.https://u:p@bitbucket.org.insteadOf=https://bitbucket.org -c url.https://u:p@github.com/.insteadOf=git@github.com: -c url.https://u:p@github.com.insteadOf=git://github.com -c url.https://u:p@github.com.insteadOf=https://github.com -c url.https://u:p@gitlab.com/.insteadOf=git@gitlab.com: -c url.https://u:p@gitlab.com.insteadOf=git://gitlab.com -c url.https://u:p@gitlab.com.insteadOf=https://gitlab.com fetch --prune --tags --force origin
2022-05-08 09:14:00,419 DEBUG: Directory: build/de.blinkt.openvpn
2022-05-08 09:14:00,419 DEBUG: > git remote set-head origin --auto
2022-05-08 09:14:00,869 DEBUG: Directory: build/de.blinkt.openvpn
2022-05-08 09:14:00,869 DEBUG: > git checkout -f b8067d4eda6d198db8a799c921310779253bbe11
2022-05-08 09:14:01,079 DEBUG: Directory: build/de.blinkt.openvpn
2022-05-08 09:14:01,079 DEBUG: > git clean -dffx
2022-05-08 09:14:01,191 INFO: Initialising submodules
2022-05-08 09:14:01,192 DEBUG: Directory: build/de.blinkt.openvpn
2022-05-08 09:14:01,192 DEBUG: > git rev-parse --show-toplevel
2022-05-08 09:14:01,399 DEBUG: Directory: build/de.blinkt.openvpn
2022-05-08 09:14:01,400 DEBUG: > git submodule sync
2022-05-08 09:14:01,706 DEBUG: Directory: build/de.blinkt.openvpn
2022-05-08 09:14:01,706 DEBUG: > git -c core.askpass=/bin/true -c core.sshCommand=/bin/false -c url.https://.insteadOf=ssh:// -c url.https://u:p@bitbucket.org/.insteadOf=git@bitbucket.org: -c url.https://u:p@bitbucket.org.insteadOf=git://bitbucket.org -c url.https://u:p@bitbucket.org.insteadOf=https://bitbucket.org -c url.https://u:p@github.com/.insteadOf=git@github.com: -c url.https://u:p@github.com.insteadOf=git://github.com -c url.https://u:p@github.com.insteadOf=https://github.com -c url.https://u:p@gitlab.com/.insteadOf=git@gitlab.com: -c url.https://u:p@gitlab.com.insteadOf=git://gitlab.com -c url.https://u:p@gitlab.com.insteadOf=https://gitlab.com submodule update --init --force --recursive
Submodule path 'main/src/main/cpp/asio': checked out '08a7029cb10c911b6fb66fb015217a431206e52c'
Submodule path 'main/src/main/cpp/lz4': checked out 'd44371841a2f1728a3f36839fd4b7e872d0927d3'
Submodule path 'main/src/main/cpp/mbedtls': checked out 'b1c8e41ae3b36a9a88e0cbee10ed38a577b54726'
Submodule path 'main/src/main/cpp/openssl': checked out '49f483b327d75b78acc0e29ce64fda6cb3617f4a'
Submodule path 'main/src/main/cpp/openvpn': checked out '458d3cf87d4d8b691da5efc84f239c636c3f546d'
Submodule path 'main/src/main/cpp/openvpn3': checked out '6274c08e40b567397c92680f937953db47af50d0'
2022-05-08 09:14:02,637 INFO: Creating local.properties file at build/de.blinkt.openvpn/local.properties
2022-05-08 09:14:02,637 INFO: Creating local.properties file at build/de.blinkt.openvpn/main/local.properties
2022-05-08 09:14:02,638 DEBUG: Removing debuggable flags from build/de.blinkt.openvpn/main
2022-05-08 09:14:02,665 INFO: Removing specified files
2022-05-08 09:14:02,665 INFO: Removing main/src/main/cpp/lz4/tmpsparse
2022-05-08 09:14:02,665 INFO: Removing main/src/main/cpp/openvpn3/test/unittests
2022-05-08 09:14:02,667 INFO: Removing main/src/main/cpp/lz4/tmp
2022-05-08 09:14:02,667 INFO: Removing main/src/main/cpp/mbedtls/programs/fuzz
2022-05-08 09:14:02,668 INFO: Removing main/src/main/cpp/mbedtls/tests
2022-05-08 09:14:02,707 INFO: Cleaned build.gradle.kts of keysigning configs at build/de.blinkt.openvpn/main/build.gradle.kts
2022-05-08 09:14:02,728 INFO: Running 'prebuild' commands in build/de.blinkt.openvpn/main
2022-05-08 09:14:02,728 DEBUG: Directory: build/de.blinkt.openvpn/main
2022-05-08 09:14:02,728 DEBUG: > bash -x -c -- sed -i -e '/signingConfigs.getByName/d' -e 's/isEnable\ =\ true/isEnable\ =\ false/' build.gradle.kts
+ sed -i -e /signingConfigs.getByName/d -e 's/isEnable\ =\ true/isEnable\ =\ false/' build.gradle.kts
2022-05-08 09:14:02,942 INFO: Cleaning Gradle project...
2022-05-08 09:14:02,943 DEBUG: Directory: build/de.blinkt.openvpn/main
2022-05-08 09:14:02,943 DEBUG: > /home/vagrant/fdroidserver/gradlew-fdroid clean
Found 7.2 via distributionUrl
Downloading missing gradle version 7.2
cachedir /home/vagrant/.cache/fdroidserver
/home/vagrant/.cache/fdroidserver/gradle-7.2-bin.zip: OK
Running /opt/gradle/versions/7.2/bin/gradle clean

Welcome to Gradle 7.2!

Here are the highlights of this release:
 - Toolchain support for Scala
 - More cache hits when Java source files have platform-specific line endings
 - More resilient remote HTTP build cache behavior

For more details see https://docs.gradle.org/7.2/release-notes.html

To honour the JVM settings for this build a single-use Daemon process will be forked. See https://docs.gradle.org/7.2/userguide/gradle_daemon.html#sec:disabling_the_daemon.
Daemon will be stopped at the end of the build 

> Configure project :main
WARNING:The option 'android.enableUnitTestBinaryResources' is deprecated.
The current default is 'false'.
It has been removed from the current version of the Android Gradle plugin.
The raw resource for unit test functionality is removed.
[CXX1104] NDK from ndk.dir at /opt/android-sdk/ndk/19.2.5345600 had version [19.2.5345600] which disagrees with android.ndkVersion [24.0.8215888]
[CXX1104] NDK from ndk.dir at /opt/android-sdk/ndk/19.2.5345600 had version [19.2.5345600] which disagrees with android.ndkVersion [24.0.8215888]
[CXX1104] NDK from ndk.dir at /opt/android-sdk/ndk/19.2.5345600 had version [19.2.5345600] which disagrees with android.ndkVersion [24.0.8215888]
[CXX1104] NDK from ndk.dir at /opt/android-sdk/ndk/19.2.5345600 had version [19.2.5345600] which disagrees with android.ndkVersion [24.0.8215888]

FAILURE: Build failed with an exception.

* What went wrong:
A problem occurred configuring project ':main'.
> [CXX1104] NDK from ndk.dir at /opt/android-sdk/ndk/19.2.5345600 had version [19.2.5345600] which disagrees with android.ndkVersion [24.0.8215888]

* Try:
Run with --stacktrace option to get the stack trace. Run with --info or --debug option to get more log output. Run with --scan to get full insights.

* Get more help at https://help.gradle.org

BUILD FAILED in 1m 2s
2022-05-08 09:15:12,456 ERROR: Could not build app de.blinkt.openvpn: Error cleaning de.blinkt.openvpn:0.7.36
==== detail begin ====
Found 7.2 via distributionUrl
Downloading missing gradle version 7.2
cachedir /home/vagrant/.cache/fdroidserver
/home/vagrant/.cache/fdroidserver/gradle-7.2-bin.zip: OK
Running /opt/gradle/versions/7.2/bin/gradle clean

Welcome to Gradle 7.2!

Here are the highlights of this release:
 - Toolchain support for Scala
 - More cache hits when Java source files have platform-specific line endings
 - More resilient remote HTTP build cache behavior

For more details see https://docs.gradle.org/7.2/release-notes.html

To honour the JVM settings for this build a single-use Daemon process will be forked. See https://docs.gradle.org/7.2/userguide/gradle_daemon.html#sec:disabling_the_daemon.
Daemon will be stopped at the end of the build 

> Configure project :main
WARNING:The option 'android.enableUnitTestBinaryResources' is deprecated.
The current default is 'false'.
It has been removed from the current version of the Android Gradle plugin.
The raw resource for unit test functionality is removed.
[CXX1104] NDK from ndk.dir at /opt/android-sdk/ndk/19.2.5345600 had version [19.2.5345600] which disagrees with android.ndkVersion [24.0.8215888]
[CXX1104] NDK from ndk.dir at /opt/android-sdk/ndk/19.2.5345600 had version [19.2.5345600] which disagrees with android.ndkVersion [24.0.8215888]
[CXX1104] NDK from ndk.dir at /opt/android-sdk/ndk/19.2.5345600 had version [19.2.5345600] which disagrees with android.ndkVersion [24.0.8215888]
[CXX1104] NDK from ndk.dir at /opt/android-sdk/ndk/19.2.5345600 had version [19.2.5345600] which disagrees with android.ndkVersion [24.0.8215888]

FAILURE: Build failed with an exception.

* What went wrong:
A problem occurred configuring project ':main'.
> [CXX1104] NDK from ndk.dir at /opt/android-sdk/ndk/19.2.5345600 had version [19.2.5345600] which disagrees with android.ndkVersion [24.0.8215888]

* Try:
Run with --stacktrace option to get the stack trace. Run with --info or --debug option to get more log output. Run with --scan to get full insights.

* Get more help at https://help.gradle.org

BUILD FAILED in 1m 2s
==== detail end ====
2022-05-08 09:15:12,457 DEBUG: Error encoutered, stopping by user request.
==== detail end ====