log for de.sorunome.unifiednlp.trains:20033

Traceback (most recent call last):
  File "/home/fbuild/fdroidserver/fdroidserver/build.py", line 1130, in main
    options.onserver, options.refresh):
  File "/home/fbuild/fdroidserver/fdroidserver/build.py", line 889, in trybuild
    build_server(app, build, vcs, build_dir, output_dir, log_dir, force)
  File "/home/fbuild/fdroidserver/fdroidserver/build.py", line 272, in build_server
    str(output, 'utf-8'))
fdroidserver.exception.BuildException: Build.py failed on server for de.sorunome.unifiednlp.trains:1.4.0
==== detail begin ====
== Installed Android Tools ==

2022-08-15 21:50:02,785 DEBUG: Reading 'config.yml'
2022-08-15 21:50:02,796 DEBUG: Local Android SDK only has outdated apksigner versions
2022-08-15 21:50:02,797 WARNING: apksigner not found! Cannot sign or verify modern APKs
2022-08-15 21:50:02,799 INFO: Creating log directory
2022-08-15 21:50:02,799 INFO: Creating temporary directory
2022-08-15 21:50:02,799 INFO: Creating output directory
2022-08-15 21:50:02,802 DEBUG: Getting git vcs interface for https://gitlab.com/Sorunome/trains-unifiednlp.git
2022-08-15 21:50:02,802 DEBUG: > git --version
git version 2.11.0
2022-08-15 21:50:03,017 INFO: Using git version 2.11.0
2022-08-15 21:50:03,017 DEBUG: Checking 1.4.0
2022-08-15 21:50:03,018 INFO: Building version 1.4.0 (20033) of de.sorunome.unifiednlp.trains
2022-08-15 21:50:03,018 INFO: Running 'sudo' commands in /home/vagrant
2022-08-15 21:50:03,019 DEBUG: > sudo DEBIAN_FRONTEND=noninteractive bash -x -c apt-get update || apt-get update && apt-get install -y openjdk-11-jdk-headless && update-alternatives --auto java
+ apt-get update
Ign:1 http://deb.debian.org/debian stretch InRelease
Get:2 http://security.debian.org/debian-security stretch/updates InRelease [59.1 kB]
Hit:3 http://deb.debian.org/debian stretch-updates InRelease
Get:4 http://deb.debian.org/debian stretch-backports-sloppy InRelease [51.4 kB]
Get:5 http://deb.debian.org/debian stretch-backports InRelease [99.9 kB]
Get:6 http://deb.debian.org/debian testing InRelease [157 kB]
Hit:7 http://deb.debian.org/debian stretch Release
Get:8 http://deb.debian.org/debian testing/main i386 Packages.diff/Index [63.6 kB]
Get:10 http://deb.debian.org/debian testing/main amd64 Packages.diff/Index [63.6 kB]
Get:11 http://deb.debian.org/debian testing/main Translation-en.diff/Index [63.6 kB]
Get:12 http://deb.debian.org/debian testing/main i386 Packages T-2022-08-15-2048.45-F-2022-08-15-2048.45.pdiff [10.0 kB]
Get:13 http://deb.debian.org/debian testing/main amd64 Packages T-2022-08-15-2048.45-F-2022-08-15-2048.45.pdiff [11.0 kB]
Get:12 http://deb.debian.org/debian testing/main i386 Packages T-2022-08-15-2048.45-F-2022-08-15-2048.45.pdiff [10.0 kB]
Get:13 http://deb.debian.org/debian testing/main amd64 Packages T-2022-08-15-2048.45-F-2022-08-15-2048.45.pdiff [11.0 kB]
Get:14 http://deb.debian.org/debian testing/main Translation-en T-2022-08-15-2048.45-F-2022-08-15-2048.45.pdiff [47 B]
Get:14 http://deb.debian.org/debian testing/main Translation-en T-2022-08-15-2048.45-F-2022-08-15-2048.45.pdiff [47 B]
Fetched 579 kB in 3s (169 kB/s)
Reading package lists...
+ apt-get install -y openjdk-11-jdk-headless
Reading package lists...
Building dependency tree...
Reading state information...
The following additional packages will be installed:
  libasound2 libasound2-data openjdk-11-jre-headless
Suggested packages:
  libasound2-plugins alsa-utils openjdk-11-demo openjdk-11-source libnss-mdns
  fonts-dejavu-extra fonts-ipafont-gothic fonts-ipafont-mincho
  fonts-wqy-microhei | fonts-wqy-zenhei fonts-indic
The following NEW packages will be installed:
  libasound2 libasound2-data openjdk-11-jdk-headless openjdk-11-jre-headless
0 upgraded, 4 newly installed, 0 to remove and 2 not upgraded.
Need to get 230 MB of archives.
After this operation, 374 MB of additional disk space will be used.
Get:1 http://deb.debian.org/debian stretch/main amd64 libasound2-data all 1.1.3-5 [173 kB]
Get:2 http://deb.debian.org/debian stretch/main amd64 libasound2 amd64 1.1.3-5 [497 kB]
Get:3 http://deb.debian.org/debian stretch-backports/main amd64 openjdk-11-jre-headless amd64 11.0.6+10-1~bpo9+1 [37.4 MB]
Get:4 http://deb.debian.org/debian stretch-backports/main amd64 openjdk-11-jdk-headless amd64 11.0.6+10-1~bpo9+1 [192 MB]
Fetched 230 MB in 2s (107 MB/s)
Selecting previously unselected package libasound2-data.
(Reading database ... 65038 files and directories currently installed.)
Preparing to unpack .../libasound2-data_1.1.3-5_all.deb ...
Unpacking libasound2-data (1.1.3-5) ...
Selecting previously unselected package libasound2:amd64.
Preparing to unpack .../libasound2_1.1.3-5_amd64.deb ...
Unpacking libasound2:amd64 (1.1.3-5) ...
Selecting previously unselected package openjdk-11-jre-headless:amd64.
Preparing to unpack .../openjdk-11-jre-headless_11.0.6+10-1~bpo9+1_amd64.deb ...
Unpacking openjdk-11-jre-headless:amd64 (11.0.6+10-1~bpo9+1) ...
Selecting previously unselected package openjdk-11-jdk-headless:amd64.
Preparing to unpack .../openjdk-11-jdk-headless_11.0.6+10-1~bpo9+1_amd64.deb ...
Unpacking openjdk-11-jdk-headless:amd64 (11.0.6+10-1~bpo9+1) ...
Setting up libasound2-data (1.1.3-5) ...
Setting up libasound2:amd64 (1.1.3-5) ...
Processing triggers for libc-bin (2.24-11+deb9u4) ...
Setting up openjdk-11-jre-headless:amd64 (11.0.6+10-1~bpo9+1) ...
Setting up openjdk-11-jdk-headless:amd64 (11.0.6+10-1~bpo9+1) ...
update-alternatives: using /usr/lib/jvm/java-11-openjdk-amd64/bin/jdeprscan to provide /usr/bin/jdeprscan (jdeprscan) in auto mode
update-alternatives: using /usr/lib/jvm/java-11-openjdk-amd64/bin/jimage to provide /usr/bin/jimage (jimage) in auto mode
update-alternatives: using /usr/lib/jvm/java-11-openjdk-amd64/bin/jlink to provide /usr/bin/jlink (jlink) in auto mode
update-alternatives: using /usr/lib/jvm/java-11-openjdk-amd64/bin/jmod to provide /usr/bin/jmod (jmod) in auto mode
update-alternatives: using /usr/lib/jvm/java-11-openjdk-amd64/bin/jshell to provide /usr/bin/jshell (jshell) in auto mode
update-alternatives: using /usr/lib/jvm/java-11-openjdk-amd64/bin/jaotc to provide /usr/bin/jaotc (jaotc) in auto mode
update-alternatives: using /usr/lib/jvm/java-11-openjdk-amd64/bin/jhsdb to provide /usr/bin/jhsdb (jhsdb) in auto mode
+ update-alternatives --auto java
update-alternatives: using /usr/lib/jvm/java-11-openjdk-amd64/bin/java to provide /usr/bin/java (java) in auto mode
2022-08-15 21:50:24,447 DEBUG: > sudo passwd --lock root
passwd: password expiry information changed.
2022-08-15 21:50:24,652 DEBUG: > sudo SUDO_FORCE_REMOVE=yes dpkg --purge sudo
(Reading database ... 65695 files and directories currently installed.)
Removing sudo (1.8.19p1-2.1+deb9u3) ...
Purging configuration files for sudo (1.8.19p1-2.1+deb9u3) ...
Processing triggers for systemd (232-25+deb9u14) ...
2022-08-15 21:50:27,813 INFO: Getting source for revision f51c7d5bd110140d8704a8c3780422603c136599
2022-08-15 21:50:27,814 DEBUG: Directory: build/de.sorunome.unifiednlp.trains
2022-08-15 21:50:27,814 DEBUG: > git rev-parse --show-toplevel
2022-08-15 21:50:28,018 DEBUG: Directory: build/de.sorunome.unifiednlp.trains
2022-08-15 21:50:28,019 DEBUG: > git submodule foreach --recursive git reset --hard
2022-08-15 21:50:28,124 DEBUG: Directory: build/de.sorunome.unifiednlp.trains
2022-08-15 21:50:28,124 DEBUG: > git reset --hard
2022-08-15 21:50:28,329 DEBUG: Directory: build/de.sorunome.unifiednlp.trains
2022-08-15 21:50:28,330 DEBUG: > git submodule foreach --recursive git clean -dffx
2022-08-15 21:50:28,434 DEBUG: Directory: build/de.sorunome.unifiednlp.trains
2022-08-15 21:50:28,434 DEBUG: > git clean -dffx
2022-08-15 21:50:28,539 DEBUG: Directory: build/de.sorunome.unifiednlp.trains
2022-08-15 21:50:28,539 DEBUG: > git -c core.askpass=/bin/true -c core.sshCommand=/bin/false -c url.https://.insteadOf=ssh:// -c url.https://u:p@bitbucket.org/.insteadOf=git@bitbucket.org: -c url.https://u:p@bitbucket.org.insteadOf=git://bitbucket.org -c url.https://u:p@bitbucket.org.insteadOf=https://bitbucket.org -c url.https://u:p@github.com/.insteadOf=git@github.com: -c url.https://u:p@github.com.insteadOf=git://github.com -c url.https://u:p@github.com.insteadOf=https://github.com -c url.https://u:p@gitlab.com/.insteadOf=git@gitlab.com: -c url.https://u:p@gitlab.com.insteadOf=git://gitlab.com -c url.https://u:p@gitlab.com.insteadOf=https://gitlab.com fetch origin
2022-08-15 21:50:28,947 DEBUG: Directory: build/de.sorunome.unifiednlp.trains
2022-08-15 21:50:28,947 DEBUG: > git -c core.askpass=/bin/true -c core.sshCommand=/bin/false -c url.https://.insteadOf=ssh:// -c url.https://u:p@bitbucket.org/.insteadOf=git@bitbucket.org: -c url.https://u:p@bitbucket.org.insteadOf=git://bitbucket.org -c url.https://u:p@bitbucket.org.insteadOf=https://bitbucket.org -c url.https://u:p@github.com/.insteadOf=git@github.com: -c url.https://u:p@github.com.insteadOf=git://github.com -c url.https://u:p@github.com.insteadOf=https://github.com -c url.https://u:p@gitlab.com/.insteadOf=git@gitlab.com: -c url.https://u:p@gitlab.com.insteadOf=git://gitlab.com -c url.https://u:p@gitlab.com.insteadOf=https://gitlab.com remote prune origin
2022-08-15 21:50:29,353 DEBUG: Directory: build/de.sorunome.unifiednlp.trains
2022-08-15 21:50:29,353 DEBUG: > git -c core.askpass=/bin/true -c core.sshCommand=/bin/false -c url.https://.insteadOf=ssh:// -c url.https://u:p@bitbucket.org/.insteadOf=git@bitbucket.org: -c url.https://u:p@bitbucket.org.insteadOf=git://bitbucket.org -c url.https://u:p@bitbucket.org.insteadOf=https://bitbucket.org -c url.https://u:p@github.com/.insteadOf=git@github.com: -c url.https://u:p@github.com.insteadOf=git://github.com -c url.https://u:p@github.com.insteadOf=https://github.com -c url.https://u:p@gitlab.com/.insteadOf=git@gitlab.com: -c url.https://u:p@gitlab.com.insteadOf=git://gitlab.com -c url.https://u:p@gitlab.com.insteadOf=https://gitlab.com fetch --prune --tags --force origin
2022-08-15 21:50:29,759 DEBUG: Directory: build/de.sorunome.unifiednlp.trains
2022-08-15 21:50:29,760 DEBUG: > git remote set-head origin --auto
2022-08-15 21:50:30,266 DEBUG: Directory: build/de.sorunome.unifiednlp.trains
2022-08-15 21:50:30,266 DEBUG: > git checkout -f f51c7d5bd110140d8704a8c3780422603c136599
2022-08-15 21:50:30,472 DEBUG: Directory: build/de.sorunome.unifiednlp.trains
2022-08-15 21:50:30,472 DEBUG: > git clean -dffx
2022-08-15 21:50:30,578 INFO: Collecting source libraries
2022-08-15 21:50:30,583 DEBUG: Removing debuggable flags from build/srclib/earth-gravitational-model
2022-08-15 21:50:30,585 INFO: Creating local.properties file at build/de.sorunome.unifiednlp.trains/local.properties
2022-08-15 21:50:30,586 DEBUG: Removing debuggable flags from build/de.sorunome.unifiednlp.trains
2022-08-15 21:50:30,589 INFO: Running 'prebuild' commands in build/de.sorunome.unifiednlp.trains
2022-08-15 21:50:30,589 DEBUG: Directory: build/de.sorunome.unifiednlp.trains
2022-08-15 21:50:30,589 DEBUG: > bash -x -c -- sed -i -e '/git {/,+4d' -e '/google/amavenLocal()' -e "/implementation/aimplementation 'com.barbeaudev:earth-gravitational-model:1.0.0'" build.gradle
+ sed -i -e '/git {/,+4d' -e '/google/amavenLocal()' -e '/implementation/aimplementation '\''com.barbeaudev:earth-gravitational-model:1.0.0'\''' build.gradle
2022-08-15 21:50:30,792 INFO: Cleaning Gradle project...
2022-08-15 21:50:30,793 DEBUG: Directory: build/de.sorunome.unifiednlp.trains
2022-08-15 21:50:30,794 DEBUG: > /home/vagrant/fdroidserver/gradlew-fdroid clean
Found 4.4 via gradle plugin version 3.1
Downloading missing gradle version 4.4
cachedir /home/vagrant/.cache/fdroidserver
/home/vagrant/.cache/fdroidserver/gradle-4.4-bin.zip: OK
Running /opt/gradle/versions/4.4/bin/gradle clean

FAILURE: Build failed with an exception.

* What went wrong:
Could not determine java version from '11.0.6'.

* Try:
Run with --stacktrace option to get the stack trace. Run with --info or --debug option to get more log output. Run with --scan to get full insights.

* Get more help at https://help.gradle.org
2022-08-15 21:50:35,839 ERROR: Could not build app de.sorunome.unifiednlp.trains: Error cleaning de.sorunome.unifiednlp.trains:1.4.0
==== detail begin ====
Found 4.4 via gradle plugin version 3.1
Downloading missing gradle version 4.4
cachedir /home/vagrant/.cache/fdroidserver
/home/vagrant/.cache/fdroidserver/gradle-4.4-bin.zip: OK
Running /opt/gradle/versions/4.4/bin/gradle clean

FAILURE: Build failed with an exception.

* What went wrong:
Could not determine java version from '11.0.6'.

* Try:
Run with --stacktrace option to get the stack trace. Run with --info or --debug option to get more log output. Run with --scan to get full insights.

* Get more help at https://help.gradle.org
==== detail end ====
2022-08-15 21:50:35,839 DEBUG: Error encoutered, stopping by user request.
==== detail end ====