log for email.schaal.ocreader:58

Traceback (most recent call last):
  File "/home/fbuild/fdroidserver/fdroidserver/build.py", line 1127, in main
    options.onserver, options.refresh):
  File "/home/fbuild/fdroidserver/fdroidserver/build.py", line 885, in trybuild
    build_server(app, build, vcs, build_dir, output_dir, log_dir, force)
  File "/home/fbuild/fdroidserver/fdroidserver/build.py", line 268, in build_server
    str(output, 'utf-8'))
fdroidserver.exception.BuildException: Build.py failed on server for email.schaal.ocreader:0.58
==== detail begin ====
== Installed Android Tools ==

2022-01-19 01:23:44,386 DEBUG: Reading 'config.yml'
2022-01-19 01:23:44,395 INFO: Using /opt/android-sdk/build-tools/29.0.3/apksigner 
2022-01-19 01:23:44,397 INFO: Creating log directory
2022-01-19 01:23:44,398 INFO: Creating temporary directory
2022-01-19 01:23:44,398 INFO: Creating output directory
2022-01-19 01:23:44,419 DEBUG: Getting git vcs interface for https://github.com/schaal/ocreader
2022-01-19 01:23:44,419 DEBUG: > git --version
git version 2.11.0
2022-01-19 01:23:44,631 INFO: Using git version 2.11.0
2022-01-19 01:23:44,631 DEBUG: Checking 0.58
2022-01-19 01:23:44,632 INFO: Building version 0.58 (58) of email.schaal.ocreader
2022-01-19 01:23:44,632 DEBUG: > sudo passwd --lock root
passwd: password expiry information changed.
2022-01-19 01:23:44,839 DEBUG: > sudo SUDO_FORCE_REMOVE=yes dpkg --purge sudo
(Reading database ... 64893 files and directories currently installed.)
Removing sudo (1.8.19p1-2.1+deb9u3) ...
Purging configuration files for sudo (1.8.19p1-2.1+deb9u3) ...
Processing triggers for systemd (232-25+deb9u13) ...
2022-01-19 01:23:50,126 INFO: Getting source for revision 71d5fc759c3c1509f8e8dcc4aa22310437b5c06c
2022-01-19 01:23:50,126 DEBUG: Directory: build/email.schaal.ocreader
2022-01-19 01:23:50,126 DEBUG: > git rev-parse --show-toplevel
2022-01-19 01:23:50,330 DEBUG: Directory: build/email.schaal.ocreader
2022-01-19 01:23:50,330 DEBUG: > git submodule foreach --recursive git reset --hard
2022-01-19 01:23:50,437 DEBUG: Directory: build/email.schaal.ocreader
2022-01-19 01:23:50,437 DEBUG: > git reset --hard
2022-01-19 01:23:50,644 DEBUG: Directory: build/email.schaal.ocreader
2022-01-19 01:23:50,644 DEBUG: > git submodule foreach --recursive git clean -dffx
2022-01-19 01:23:50,844 DEBUG: Directory: build/email.schaal.ocreader
2022-01-19 01:23:50,844 DEBUG: > git clean -dffx
2022-01-19 01:23:51,036 DEBUG: Directory: build/email.schaal.ocreader
2022-01-19 01:23:51,037 DEBUG: > git -c core.askpass=/bin/true -c core.sshCommand=/bin/false -c url.https://.insteadOf=ssh:// -c url.https://u:p@bitbucket.org/.insteadOf=git@bitbucket.org: -c url.https://u:p@bitbucket.org.insteadOf=git://bitbucket.org -c url.https://u:p@bitbucket.org.insteadOf=https://bitbucket.org -c url.https://u:p@github.com/.insteadOf=git@github.com: -c url.https://u:p@github.com.insteadOf=git://github.com -c url.https://u:p@github.com.insteadOf=https://github.com -c url.https://u:p@gitlab.com/.insteadOf=git@gitlab.com: -c url.https://u:p@gitlab.com.insteadOf=git://gitlab.com -c url.https://u:p@gitlab.com.insteadOf=https://gitlab.com fetch origin
2022-01-19 01:23:51,466 DEBUG: Directory: build/email.schaal.ocreader
2022-01-19 01:23:51,467 DEBUG: > git -c core.askpass=/bin/true -c core.sshCommand=/bin/false -c url.https://.insteadOf=ssh:// -c url.https://u:p@bitbucket.org/.insteadOf=git@bitbucket.org: -c url.https://u:p@bitbucket.org.insteadOf=git://bitbucket.org -c url.https://u:p@bitbucket.org.insteadOf=https://bitbucket.org -c url.https://u:p@github.com/.insteadOf=git@github.com: -c url.https://u:p@github.com.insteadOf=git://github.com -c url.https://u:p@github.com.insteadOf=https://github.com -c url.https://u:p@gitlab.com/.insteadOf=git@gitlab.com: -c url.https://u:p@gitlab.com.insteadOf=git://gitlab.com -c url.https://u:p@gitlab.com.insteadOf=https://gitlab.com remote prune origin
2022-01-19 01:23:51,796 DEBUG: Directory: build/email.schaal.ocreader
2022-01-19 01:23:51,797 DEBUG: > git -c core.askpass=/bin/true -c core.sshCommand=/bin/false -c url.https://.insteadOf=ssh:// -c url.https://u:p@bitbucket.org/.insteadOf=git@bitbucket.org: -c url.https://u:p@bitbucket.org.insteadOf=git://bitbucket.org -c url.https://u:p@bitbucket.org.insteadOf=https://bitbucket.org -c url.https://u:p@github.com/.insteadOf=git@github.com: -c url.https://u:p@github.com.insteadOf=git://github.com -c url.https://u:p@github.com.insteadOf=https://github.com -c url.https://u:p@gitlab.com/.insteadOf=git@gitlab.com: -c url.https://u:p@gitlab.com.insteadOf=git://gitlab.com -c url.https://u:p@gitlab.com.insteadOf=https://gitlab.com fetch --prune --tags --force origin
2022-01-19 01:23:52,107 DEBUG: Directory: build/email.schaal.ocreader
2022-01-19 01:23:52,107 DEBUG: > git remote set-head origin --auto
2022-01-19 01:23:52,427 DEBUG: Directory: build/email.schaal.ocreader
2022-01-19 01:23:52,428 DEBUG: > git checkout -f 71d5fc759c3c1509f8e8dcc4aa22310437b5c06c
2022-01-19 01:23:52,637 DEBUG: Directory: build/email.schaal.ocreader
2022-01-19 01:23:52,638 DEBUG: > git clean -dffx
2022-01-19 01:23:52,815 INFO: Creating local.properties file at build/email.schaal.ocreader/local.properties
2022-01-19 01:23:52,816 INFO: Creating local.properties file at build/email.schaal.ocreader/app/local.properties
2022-01-19 01:23:52,816 DEBUG: Removing debuggable flags from build/email.schaal.ocreader/app
2022-01-19 01:23:52,835 INFO: Cleaning Gradle project...
2022-01-19 01:23:52,835 DEBUG: Directory: build/email.schaal.ocreader/app
2022-01-19 01:23:52,835 DEBUG: > /home/vagrant/fdroidserver/gradlew-fdroid clean
Found 7.1.1 via distributionUrl
Downloading missing gradle version 7.1.1
cachedir /home/vagrant/.cache/fdroidserver
/home/vagrant/.cache/fdroidserver/gradle-7.1.1-bin.zip: OK
Running /opt/gradle/versions/7.1.1/bin/gradle clean

Welcome to Gradle 7.1.1!

Here are the highlights of this release:
 - Faster incremental Java compilation
 - Easier source set configuration in the Kotlin DSL

For more details see https://docs.gradle.org/7.1.1/release-notes.html

To honour the JVM settings for this build a single-use Daemon process will be forked. See https://docs.gradle.org/7.1.1/userguide/gradle_daemon.html#sec:disabling_the_daemon.
Daemon will be stopped at the end of the build 
> Task :app:clean UP-TO-DATE

BUILD SUCCESSFUL in 1m 8s
1 actionable task: 1 up-to-date
2022-01-19 01:25:04,290 INFO: Scanning source for common problems...
2022-01-19 01:25:04,294 INFO: Removing gradle-wrapper.jar at gradle/wrapper/gradle-wrapper.jar
2022-01-19 01:25:04,303 INFO: Creating source tarball...
2022-01-19 01:25:04,428 INFO: Building Gradle project...
2022-01-19 01:25:04,428 DEBUG: Directory: build/email.schaal.ocreader/app
2022-01-19 01:25:04,428 DEBUG: > /home/vagrant/fdroidserver/gradlew-fdroid assembleRelease
Found 7.1.1 via distributionUrl
Running /opt/gradle/versions/7.1.1/bin/gradle assembleRelease
To honour the JVM settings for this build a single-use Daemon process will be forked. See https://docs.gradle.org/7.1.1/userguide/gradle_daemon.html#sec:disabling_the_daemon.
Daemon will be stopped at the end of the build 
File /home/vagrant/.android/repositories.cfg could not be loaded.
Checking the license for package Android SDK Build-Tools 30.0.3 in /opt/android-sdk/licenses
License for package Android SDK Build-Tools 30.0.3 accepted.
Preparing "Install Android SDK Build-Tools 30.0.3 (revision: 30.0.3)".
"Install Android SDK Build-Tools 30.0.3 (revision: 30.0.3)" ready.
Installing Android SDK Build-Tools 30.0.3 in /opt/android-sdk/build-tools/30.0.3
"Install Android SDK Build-Tools 30.0.3 (revision: 30.0.3)" complete.
"Install Android SDK Build-Tools 30.0.3 (revision: 30.0.3)" finished.
Checking the license for package Android SDK Platform 30 in /opt/android-sdk/licenses
License for package Android SDK Platform 30 accepted.
Preparing "Install Android SDK Platform 30 (revision: 3)".
"Install Android SDK Platform 30 (revision: 3)" ready.
Installing Android SDK Platform 30 in /opt/android-sdk/platforms/android-30
"Install Android SDK Platform 30 (revision: 3)" complete.
"Install Android SDK Platform 30 (revision: 3)" finished.
> Task :app:preBuild UP-TO-DATE
> Task :app:extractProguardFiles

> Task :app:prepareLibraryDefinitionsRelease
All dependencies.size=100
--> Retrieved POM for: com_google_code_findbugs__jsr305 from org.sonatype.oss:oss-parent:7
Could not get the name for androidx_databinding__viewbinding, Using androidx.databinding:viewbinding
--> Retrieved POM for: com_github_zafarkhaja__java_semver from org.sonatype.oss:oss-parent:9
Could not get the name for androidx_databinding__databinding_adapters, Using androidx.databinding:databinding-adapters
Could not get the name for androidx_databinding__databinding_runtime, Using androidx.databinding:databinding-runtime
--> Retrieved POM for: com_google_guava__listenablefuture from com.google.guava:guava-parent:26.0-android
----> Had to fallback to parent author for: com_google_guava__listenablefuture -- result: Kevin Bourrillion
----> Had to fallback to parent authorWebsite for: com_google_guava__listenablefuture -- result: http://www.google.com
----> Found license from parent for: com_google_guava__listenablefuture -- result: Apache_2_0
--> Had to resolve name from custom mapping for: androidx_savedstate__savedstate as SavedState
--> Had to resolve author from custom mapping for: com_squareup_okio__okio as Square, Inc

> Task :app:preReleaseBuild
> Task :app:compileReleaseAidl NO-SOURCE
> Task :app:compileReleaseRenderscript NO-SOURCE
> Task :app:dataBindingMergeDependencyArtifactsRelease
> Task :app:dataBindingMergeGenClassesRelease
> Task :app:generateReleaseResValues
> Task :app:generateReleaseResources
> Task :app:dataBindingTriggerRelease
> Task :app:generateReleaseBuildConfig
> Task :app:checkReleaseAarMetadata
> Task :app:createReleaseCompatibleScreenManifests
> Task :app:extractDeepLinksRelease
> Task :app:processReleaseMainManifest
> Task :app:processReleaseManifest
> Task :app:writeReleaseApplicationId
> Task :app:analyticsRecordingRelease
> Task :app:mergeReleaseResources
> Task :app:mergeReleaseJniLibFolders
> Task :app:dataBindingGenBaseClassesRelease
> Task :app:mergeReleaseShaders
> Task :app:compileReleaseShaders NO-SOURCE
> Task :app:generateReleaseAssets UP-TO-DATE
> Task :app:mergeReleaseAssets
> Task :app:compressReleaseAssets
> Task :app:processReleaseJavaRes NO-SOURCE
> Task :app:checkReleaseDuplicateClasses
> Task :app:mergeReleaseNativeLibs
> Task :app:collectReleaseDependencies
> Task :app:stripReleaseDebugSymbols
> Task :app:extractReleaseNativeSymbolTables
> Task :app:sdkReleaseDependencyData
> Task :app:processReleaseManifestForPackage
> Task :app:mergeReleaseNativeDebugMetadata NO-SOURCE
> Task :app:writeReleaseAppMetadata
> Task :app:writeReleaseSigningConfigVersions
> Task :app:processReleaseResources
> Task :app:kaptGenerateStubsReleaseKotlin

> Task :app:kaptReleaseKotlin
Note: Version 10.10.0 of Realm is now available: https://static.realm.io/downloads/java/latest
Note: Processing class Feed
Note: Processing class TemporaryFeed
Note: Processing class User
Note: Processing class Item
Note: Processing class Folder
Note: Creating DefaultRealmModule
Note: [1] Wrote GeneratedAppGlideModule with: [com.bumptech.glide.integration.okhttp3.OkHttpLibraryGlideModule]

> Task :app:compileReleaseKotlin
w: /home/vagrant/build/email.schaal.ocreader/app/src/main/java/email/schaal/ocreader/ItemPagerActivity.kt: (45, 30): 'FragmentStatePagerAdapter' is deprecated. Deprecated in Java
w: /home/vagrant/build/email.schaal.ocreader/app/src/main/java/email/schaal/ocreader/ItemPagerActivity.kt: (184, 90): 'FragmentStatePagerAdapter' is deprecated. Deprecated in Java
w: /home/vagrant/build/email.schaal.ocreader/app/src/main/java/email/schaal/ocreader/ManageFeedsActivity.kt: (4, 20): 'ProgressDialog' is deprecated. Deprecated in Java
w: /home/vagrant/build/email.schaal.ocreader/app/src/main/java/email/schaal/ocreader/ManageFeedsActivity.kt: (110, 66): 'ProgressDialog' is deprecated. Deprecated in Java
w: /home/vagrant/build/email.schaal.ocreader/app/src/main/java/email/schaal/ocreader/ManageFeedsActivity.kt: (111, 30): 'constructor ProgressDialog(Context!)' is deprecated. Deprecated in Java
w: /home/vagrant/build/email.schaal.ocreader/app/src/main/java/email/schaal/ocreader/ManageFeedsActivity.kt: (111, 30): 'ProgressDialog' is deprecated. Deprecated in Java
w: /home/vagrant/build/email.schaal.ocreader/app/src/main/java/email/schaal/ocreader/ManageFeedsActivity.kt: (112, 24): 'setter for isIndeterminate: Boolean' is deprecated. Deprecated in Java
w: /home/vagrant/build/email.schaal.ocreader/app/src/main/java/email/schaal/ocreader/ManageFeedsActivity.kt: (113, 24): 'setMessage(CharSequence!): Unit' is deprecated. Deprecated in Java
w: /home/vagrant/build/email.schaal.ocreader/app/src/main/java/email/schaal/ocreader/database/FeedViewModel.kt: (82, 57): Type mismatch: inferred type is String? but String was expected
w: /home/vagrant/build/email.schaal.ocreader/app/src/main/java/email/schaal/ocreader/database/model/Folder.kt: (111, 12): Condition 'name != null' is always 'true'
w: /home/vagrant/build/email.schaal.ocreader/app/src/main/java/email/schaal/ocreader/view/ArticleWebView.kt: (88, 54): Type mismatch: inferred type is String? but String was expected
w: /home/vagrant/build/email.schaal.ocreader/app/src/main/java/email/schaal/ocreader/view/ScrollAwareFABBehavior.kt: (33, 17): Parameter 'context' is never used
w: /home/vagrant/build/email.schaal.ocreader/app/src/main/java/email/schaal/ocreader/view/ScrollAwareFABBehavior.kt: (33, 35): Parameter 'attributeSet' is never used

> Task :app:compileReleaseJavaWithJavac
Note: /home/vagrant/build/email.schaal.ocreader/app/build/generated/source/kapt/release/io/realm/DefaultRealmModuleMediator.java uses unchecked or unsafe operations.
Note: Recompile with -Xlint:unchecked for details.

> Task :app:compileReleaseSources
> Task :app:lintVitalRelease FAILED

FAILURE: Build failed with an exception.

* What went wrong:
Execution failed for task ':app:lintVitalRelease'.
> Could not resolve all artifacts for configuration ':app:debugUnitTestRuntimeClasspath'.
   > Failed to transform bcprov-jdk15on-1.68.jar (org.bouncycastle:bcprov-jdk15on:1.68) to match attributes {artifactType=processed-jar, org.gradle.category=library, org.gradle.libraryelements=jar, org.gradle.status=release, org.gradle.usage=java-runtime}.
      > Execution failed for JetifyTransform: /home/vagrant/.gradle/caches/modules-2/files-2.1/org.bouncycastle/bcprov-jdk15on/1.68/46a080368d38b428d237a59458f9bc915222894d/bcprov-jdk15on-1.68.jar.
         > Failed to transform '/home/vagrant/.gradle/caches/modules-2/files-2.1/org.bouncycastle/bcprov-jdk15on/1.68/46a080368d38b428d237a59458f9bc915222894d/bcprov-jdk15on-1.68.jar' using Jetifier. Reason: IllegalArgumentException, message: Unsupported class file major version 59. (Run with --stacktrace for more details.)
           Suggestions:
            - Check out existing issues at https://issuetracker.google.com/issues?q=componentid:460323&s=modified_time:desc, it's possible that this issue has already been filed there.
            - If this issue has not been filed, please report it at https://issuetracker.google.com/issues/new?component=460323 (run with --stacktrace and provide a stack trace if possible).

* Try:
Run with --stacktrace option to get the stack trace. Run with --info or --debug option to get more log output. Run with --scan to get full insights.

* Get more help at https://help.gradle.org

BUILD FAILED in 1m 36s
35 actionable tasks: 35 executed
2022-01-19 01:26:41,817 DEBUG: Popen(['git', 'cat-file', '--batch-check'], cwd=/home/vagrant/build/email.schaal.ocreader, universal_newlines=False, shell=None)
2022-01-19 01:26:41,821 ERROR: Could not build app email.schaal.ocreader: Build failed for email.schaal.ocreader:0.58@71d5fc759c3c1509f8e8dcc4aa22310437b5c06c
==== detail begin ====
Found 7.1.1 via distributionUrl
Running /opt/gradle/versions/7.1.1/bin/gradle assembleRelease
To honour the JVM settings for this build a single-use Daemon process will be forked. See https://docs.gradle.org/7.1.1/userguide/gradle_daemon.html#sec:disabling_the_daemon.
Daemon will be stopped at the end of the build 
File /home/vagrant/.android/repositories.cfg could not be loaded.
Checking the license for package Android SDK Build-Tools 30.0.3 in /opt/android-sdk/licenses
License for package Android SDK Build-Tools 30.0.3 accepted.
Preparing "Install Android SDK Build-Tools 30.0.3 (revision: 30.0.3)".
"Install Android SDK Build-Tools 30.0.3 (revision: 30.0.3)" ready.
Installing Android SDK Build-Tools 30.0.3 in /opt/android-sdk/build-tools/30.0.3
"Install Android SDK Build-Tools 30.0.3 (revision: 30.0.3)" complete.
"Install Android SDK Build-Tools 30.0.3 (revision: 30.0.3)" finished.
Checking the license for package Android SDK Platform 30 in /opt/android-sdk/licenses
License for package Android SDK Platform 30 accepted.
Preparing "Install Android SDK Platform 30 (revision: 3)".
"Install Android SDK Platform 30 (revision: 3)" ready.
Installing Android SDK Platform 30 in /opt/android-sdk/platforms/android-30
"Install Android SDK Platform 30 (revision: 3)" complete.
"Install Android SDK Platform 30 (revision: 3)" finished.
> Task :app:preBuild UP-TO-DATE
> Task :app:extractProguardFiles

> Task :app:prepareLibraryDefinitionsRelease
All dependencies.size=100
--> Retrieved POM for: com_google_code_findbugs__jsr305 from org.sonatype.oss:oss-parent:7
Could not get the name for androidx_databinding__viewbinding, Using androidx.databinding:viewbinding
--> Retrieved POM for: com_github_zafarkhaja__java_semver from org.sonatype.oss:oss-parent:9
Could not get the name for androidx_databinding__databinding_adapters, Using androidx.databinding:databinding-adapters
Could not get the name for androidx_databinding__databinding_runtime, Using androidx.databinding:databinding-runtime
--> Retrieved POM for: com_google_guava__listenablefuture from com.google.guava:guava-parent:26.0-android
----> Had to fallback to parent author for: com_google_guava__listenablefuture -- result: Kevin Bourrillion
----> Had to fallback to parent authorWebsite for: com_google_guava__listenablefuture -- result: http://www.google.com
----> Found license from parent for: com_google_guava__listenablefuture -- result: Apache_2_0
--> Had to resolve name from custom mapping for: androidx_savedstate__savedstate as SavedState
--> Had to resolve author from custom mapping for: com_squareup_okio__okio as Square, Inc

> Task :app:preReleaseBuild
> Task :app:compileReleaseAidl NO-SOURCE
> Task :app:compileReleaseRenderscript NO-SOURCE
> Task :app:dataBindingMergeDependencyArtifactsRelease
> Task :app:dataBindingMergeGenClassesRelease
> Task :app:generateReleaseResValues
> Task :app:generateReleaseResources
> Task :app:dataBindingTriggerRelease
> Task :app:generateReleaseBuildConfig
> Task :app:checkReleaseAarMetadata
> Task :app:createReleaseCompatibleScreenManifests
> Task :app:extractDeepLinksRelease
> Task :app:processReleaseMainManifest
> Task :app:processReleaseManifest
> Task :app:writeReleaseApplicationId
> Task :app:analyticsRecordingRelease
> Task :app:mergeReleaseResources
> Task :app:mergeReleaseJniLibFolders
> Task :app:dataBindingGenBaseClassesRelease
> Task :app:mergeReleaseShaders
> Task :app:compileReleaseShaders NO-SOURCE
> Task :app:generateReleaseAssets UP-TO-DATE
> Task :app:mergeReleaseAssets
> Task :app:compressReleaseAssets
> Task :app:processReleaseJavaRes NO-SOURCE
> Task :app:checkReleaseDuplicateClasses
> Task :app:mergeReleaseNativeLibs
> Task :app:collectReleaseDependencies
> Task :app:stripReleaseDebugSymbols
> Task :app:extractReleaseNativeSymbolTables
> Task :app:sdkReleaseDependencyData
> Task :app:processReleaseManifestForPackage
> Task :app:mergeReleaseNativeDebugMetadata NO-SOURCE
> Task :app:writeReleaseAppMetadata
> Task :app:writeReleaseSigningConfigVersions
> Task :app:processReleaseResources
> Task :app:kaptGenerateStubsReleaseKotlin

> Task :app:kaptReleaseKotlin
Note: Version 10.10.0 of Realm is now available: https://static.realm.io/downloads/java/latest
Note: Processing class Feed
Note: Processing class TemporaryFeed
Note: Processing class User
Note: Processing class Item
Note: Processing class Folder
Note: Creating DefaultRealmModule
Note: [1] Wrote GeneratedAppGlideModule with: [com.bumptech.glide.integration.okhttp3.OkHttpLibraryGlideModule]

> Task :app:compileReleaseKotlin
w: /home/vagrant/build/email.schaal.ocreader/app/src/main/java/email/schaal/ocreader/ItemPagerActivity.kt: (45, 30): 'FragmentStatePagerAdapter' is deprecated. Deprecated in Java
w: /home/vagrant/build/email.schaal.ocreader/app/src/main/java/email/schaal/ocreader/ItemPagerActivity.kt: (184, 90): 'FragmentStatePagerAdapter' is deprecated. Deprecated in Java
w: /home/vagrant/build/email.schaal.ocreader/app/src/main/java/email/schaal/ocreader/ManageFeedsActivity.kt: (4, 20): 'ProgressDialog' is deprecated. Deprecated in Java
w: /home/vagrant/build/email.schaal.ocreader/app/src/main/java/email/schaal/ocreader/ManageFeedsActivity.kt: (110, 66): 'ProgressDialog' is deprecated. Deprecated in Java
w: /home/vagrant/build/email.schaal.ocreader/app/src/main/java/email/schaal/ocreader/ManageFeedsActivity.kt: (111, 30): 'constructor ProgressDialog(Context!)' is deprecated. Deprecated in Java
w: /home/vagrant/build/email.schaal.ocreader/app/src/main/java/email/schaal/ocreader/ManageFeedsActivity.kt: (111, 30): 'ProgressDialog' is deprecated. Deprecated in Java
w: /home/vagrant/build/email.schaal.ocreader/app/src/main/java/email/schaal/ocreader/ManageFeedsActivity.kt: (112, 24): 'setter for isIndeterminate: Boolean' is deprecated. Deprecated in Java
w: /home/vagrant/build/email.schaal.ocreader/app/src/main/java/email/schaal/ocreader/ManageFeedsActivity.kt: (113, 24): 'setMessage(CharSequence!): Unit' is deprecated. Deprecated in Java
w: /home/vagrant/build/email.schaal.ocreader/app/src/main/java/email/schaal/ocreader/database/FeedViewModel.kt: (82, 57): Type mismatch: inferred type is String? but String was expected
w: /home/vagrant/build/email.schaal.ocreader/app/src/main/java/email/schaal/ocreader/database/model/Folder.kt: (111, 12): Condition 'name != null' is always 'true'
w: /home/vagrant/build/email.schaal.ocreader/app/src/main/java/email/schaal/ocreader/view/ArticleWebView.kt: (88, 54): Type mismatch: inferred type is String? but String was expected
w: /home/vagrant/build/email.schaal.ocreader/app/src/main/java/email/schaal/ocreader/view/ScrollAwareFABBehavior.kt: (33, 17): Parameter 'context' is never used
w: /home/vagrant/build/email.schaal.ocreader/app/src/main/java/email/schaal/ocreader/view/ScrollAwareFABBehavior.kt: (33, 35): Parameter 'attributeSet' is never used

> Task :app:compileReleaseJavaWithJavac
Note: /home/vagrant/build/email.schaal.ocreader/app/build/generated/source/kapt/release/io/realm/DefaultRealmModuleMediator.java uses unchecked or unsafe operations.
Note: Recompile with -Xlint:unchecked for details.

> Task :app:compileReleaseSources
> Task :app:lintVitalRelease FAILED

FAILURE: Build failed with an exception.

* What went wrong:
Execution failed for task ':app:lintVitalRelease'.
> Could not resolve all artifacts for configuration ':app:debugUnitTestRuntimeClasspath'.
   > Failed to transform bcprov-jdk15on-1.68.jar (org.bouncycastle:bcprov-jdk15on:1.68) to match attributes {artifactType=processed-jar, org.gradle.category=library, org.gradle.libraryelements=jar, org.gradle.status=release, org.gradle.usage=java-runtime}.
      > Execution failed for JetifyTransform: /home/vagrant/.gradle/caches/modules-2/files-2.1/org.bouncycastle/bcprov-jdk15on/1.68/46a080368d38b428d237a59458f9bc915222894d/bcprov-jdk15on-1.68.jar.
         > Failed to transform '/home/vagrant/.gradle/caches/modules-2/files-2.1/org.bouncycastle/bcprov-jdk15on/1.68/46a080368d38b428d237a59458f9bc915222894d/bcprov-jdk15on-1.68.jar' using Jetifier. Reason: IllegalArgumentException, message: Unsupported class file major version 59. (Run with --stacktrace for more details.)
           Suggestions:
            - Check out existing issues at https://issuetracker.google.com/issues?q=componentid:460323&s=modified_time:desc, it's possible that this issue has already been filed there.
            - If this issue has not been filed, please report it at https://issuetracker.google.com/issues/new?component=460323 (run with --stacktrace and provide a stack trace if possible).

* Try:
Run with --stacktrace option to get the stack trace. Run with --info or --debug option to get more log output. Run with --scan to get full insights.

* Get more help at https://help.gradle.org

BUILD FAILED in 1m 36s
35 actionable tasks: 35 executed
==== detail end ====
2022-01-19 01:26:41,821 DEBUG: Error encoutered, stopping by user request.
==== detail end ====