log for eu.faircode.email:1950

Traceback (most recent call last):
  File "/home/fbuild/fdroidserver/fdroidserver/build.py", line 1130, in main
    options.onserver, options.refresh):
  File "/home/fbuild/fdroidserver/fdroidserver/build.py", line 889, in trybuild
    build_server(app, build, vcs, build_dir, output_dir, log_dir, force)
  File "/home/fbuild/fdroidserver/fdroidserver/build.py", line 272, in build_server
    str(output, 'utf-8'))
fdroidserver.exception.BuildException: Build.py failed on server for eu.faircode.email:1.1950
==== detail begin ====
== Installed Android Tools ==

2022-08-15 21:20:11,158 DEBUG: Reading 'config.yml'
2022-08-15 21:20:11,168 DEBUG: Local Android SDK only has outdated apksigner versions
2022-08-15 21:20:11,168 WARNING: apksigner not found! Cannot sign or verify modern APKs
2022-08-15 21:20:11,171 INFO: Creating log directory
2022-08-15 21:20:11,171 INFO: Creating temporary directory
2022-08-15 21:20:11,172 INFO: Creating output directory
2022-08-15 21:20:11,256 DEBUG: Getting git vcs interface for https://github.com/M66B/FairEmail
2022-08-15 21:20:11,256 DEBUG: > git --version
git version 2.11.0
2022-08-15 21:20:11,466 INFO: Using git version 2.11.0
2022-08-15 21:20:11,466 DEBUG: Checking 1.1950
2022-08-15 21:20:11,467 INFO: Building version 1.1950 (1950) of eu.faircode.email
2022-08-15 21:20:11,468 INFO: Running 'sudo' commands in /home/vagrant
2022-08-15 21:20:11,468 DEBUG: > sudo DEBIAN_FRONTEND=noninteractive bash -x -c apt-get update || apt-get update && apt-get install -y openjdk-11-jdk-headless && update-alternatives --auto java
+ apt-get update
Ign:1 http://deb.debian.org/debian stretch InRelease
Get:2 http://security.debian.org/debian-security stretch/updates InRelease [59.1 kB]
Hit:3 http://deb.debian.org/debian stretch-updates InRelease
Hit:4 http://deb.debian.org/debian stretch-backports-sloppy InRelease
Hit:5 http://deb.debian.org/debian stretch-backports InRelease
Hit:6 http://deb.debian.org/debian testing InRelease
Hit:7 http://deb.debian.org/debian stretch Release
Fetched 59.1 kB in 0s (73.0 kB/s)
Reading package lists...
+ apt-get install -y openjdk-11-jdk-headless
Reading package lists...
Building dependency tree...
Reading state information...
The following additional packages will be installed:
  libasound2 libasound2-data openjdk-11-jre-headless
Suggested packages:
  libasound2-plugins alsa-utils openjdk-11-demo openjdk-11-source libnss-mdns
  fonts-dejavu-extra fonts-ipafont-gothic fonts-ipafont-mincho
  fonts-wqy-microhei | fonts-wqy-zenhei fonts-indic
The following NEW packages will be installed:
  libasound2 libasound2-data openjdk-11-jdk-headless openjdk-11-jre-headless
0 upgraded, 4 newly installed, 0 to remove and 2 not upgraded.
Need to get 230 MB of archives.
After this operation, 374 MB of additional disk space will be used.
Get:1 http://deb.debian.org/debian stretch/main amd64 libasound2-data all 1.1.3-5 [173 kB]
Get:2 http://deb.debian.org/debian stretch/main amd64 libasound2 amd64 1.1.3-5 [497 kB]
Get:3 http://deb.debian.org/debian stretch-backports/main amd64 openjdk-11-jre-headless amd64 11.0.6+10-1~bpo9+1 [37.4 MB]
Get:4 http://deb.debian.org/debian stretch-backports/main amd64 openjdk-11-jdk-headless amd64 11.0.6+10-1~bpo9+1 [192 MB]
Fetched 230 MB in 2s (108 MB/s)
Selecting previously unselected package libasound2-data.
(Reading database ... 65038 files and directories currently installed.)
Preparing to unpack .../libasound2-data_1.1.3-5_all.deb ...
Unpacking libasound2-data (1.1.3-5) ...
Selecting previously unselected package libasound2:amd64.
Preparing to unpack .../libasound2_1.1.3-5_amd64.deb ...
Unpacking libasound2:amd64 (1.1.3-5) ...
Selecting previously unselected package openjdk-11-jre-headless:amd64.
Preparing to unpack .../openjdk-11-jre-headless_11.0.6+10-1~bpo9+1_amd64.deb ...
Unpacking openjdk-11-jre-headless:amd64 (11.0.6+10-1~bpo9+1) ...
Selecting previously unselected package openjdk-11-jdk-headless:amd64.
Preparing to unpack .../openjdk-11-jdk-headless_11.0.6+10-1~bpo9+1_amd64.deb ...
Unpacking openjdk-11-jdk-headless:amd64 (11.0.6+10-1~bpo9+1) ...
Setting up libasound2-data (1.1.3-5) ...
Setting up libasound2:amd64 (1.1.3-5) ...
Processing triggers for libc-bin (2.24-11+deb9u4) ...
Setting up openjdk-11-jre-headless:amd64 (11.0.6+10-1~bpo9+1) ...
Setting up openjdk-11-jdk-headless:amd64 (11.0.6+10-1~bpo9+1) ...
update-alternatives: using /usr/lib/jvm/java-11-openjdk-amd64/bin/jdeprscan to provide /usr/bin/jdeprscan (jdeprscan) in auto mode
update-alternatives: using /usr/lib/jvm/java-11-openjdk-amd64/bin/jimage to provide /usr/bin/jimage (jimage) in auto mode
update-alternatives: using /usr/lib/jvm/java-11-openjdk-amd64/bin/jlink to provide /usr/bin/jlink (jlink) in auto mode
update-alternatives: using /usr/lib/jvm/java-11-openjdk-amd64/bin/jmod to provide /usr/bin/jmod (jmod) in auto mode
update-alternatives: using /usr/lib/jvm/java-11-openjdk-amd64/bin/jshell to provide /usr/bin/jshell (jshell) in auto mode
update-alternatives: using /usr/lib/jvm/java-11-openjdk-amd64/bin/jaotc to provide /usr/bin/jaotc (jaotc) in auto mode
update-alternatives: using /usr/lib/jvm/java-11-openjdk-amd64/bin/jhsdb to provide /usr/bin/jhsdb (jhsdb) in auto mode
+ update-alternatives --auto java
update-alternatives: using /usr/lib/jvm/java-11-openjdk-amd64/bin/java to provide /usr/bin/java (java) in auto mode
2022-08-15 21:20:31,001 DEBUG: > sudo passwd --lock root
passwd: password expiry information changed.
2022-08-15 21:20:31,207 DEBUG: > sudo SUDO_FORCE_REMOVE=yes dpkg --purge sudo
(Reading database ... 65695 files and directories currently installed.)
Removing sudo (1.8.19p1-2.1+deb9u3) ...
Purging configuration files for sudo (1.8.19p1-2.1+deb9u3) ...
Processing triggers for systemd (232-25+deb9u14) ...
2022-08-15 21:20:36,218 INFO: Getting source for revision af92c2c75ea521f43efe64a0b7fdbda0acbba6ab
2022-08-15 21:20:36,218 DEBUG: Directory: build/eu.faircode.email
2022-08-15 21:20:36,218 DEBUG: > git rev-parse --show-toplevel
2022-08-15 21:20:36,423 DEBUG: Directory: build/eu.faircode.email
2022-08-15 21:20:36,423 DEBUG: > git submodule foreach --recursive git reset --hard
2022-08-15 21:20:36,528 DEBUG: Directory: build/eu.faircode.email
2022-08-15 21:20:36,529 DEBUG: > git reset --hard
2022-08-15 21:20:39,624 DEBUG: Directory: build/eu.faircode.email
2022-08-15 21:20:39,624 DEBUG: > git submodule foreach --recursive git clean -dffx
2022-08-15 21:20:39,729 DEBUG: Directory: build/eu.faircode.email
2022-08-15 21:20:39,730 DEBUG: > git clean -dffx
2022-08-15 21:20:39,834 DEBUG: Directory: build/eu.faircode.email
2022-08-15 21:20:39,835 DEBUG: > git -c core.askpass=/bin/true -c core.sshCommand=/bin/false -c url.https://.insteadOf=ssh:// -c url.https://u:p@bitbucket.org/.insteadOf=git@bitbucket.org: -c url.https://u:p@bitbucket.org.insteadOf=git://bitbucket.org -c url.https://u:p@bitbucket.org.insteadOf=https://bitbucket.org -c url.https://u:p@github.com/.insteadOf=git@github.com: -c url.https://u:p@github.com.insteadOf=git://github.com -c url.https://u:p@github.com.insteadOf=https://github.com -c url.https://u:p@gitlab.com/.insteadOf=git@gitlab.com: -c url.https://u:p@gitlab.com.insteadOf=git://gitlab.com -c url.https://u:p@gitlab.com.insteadOf=https://gitlab.com fetch origin
2022-08-15 21:20:44,670 DEBUG: Directory: build/eu.faircode.email
2022-08-15 21:20:44,670 DEBUG: > git -c core.askpass=/bin/true -c core.sshCommand=/bin/false -c url.https://.insteadOf=ssh:// -c url.https://u:p@bitbucket.org/.insteadOf=git@bitbucket.org: -c url.https://u:p@bitbucket.org.insteadOf=git://bitbucket.org -c url.https://u:p@bitbucket.org.insteadOf=https://bitbucket.org -c url.https://u:p@github.com/.insteadOf=git@github.com: -c url.https://u:p@github.com.insteadOf=git://github.com -c url.https://u:p@github.com.insteadOf=https://github.com -c url.https://u:p@gitlab.com/.insteadOf=git@gitlab.com: -c url.https://u:p@gitlab.com.insteadOf=git://gitlab.com -c url.https://u:p@gitlab.com.insteadOf=https://gitlab.com remote prune origin
2022-08-15 21:20:45,087 DEBUG: Directory: build/eu.faircode.email
2022-08-15 21:20:45,087 DEBUG: > git -c core.askpass=/bin/true -c core.sshCommand=/bin/false -c url.https://.insteadOf=ssh:// -c url.https://u:p@bitbucket.org/.insteadOf=git@bitbucket.org: -c url.https://u:p@bitbucket.org.insteadOf=git://bitbucket.org -c url.https://u:p@bitbucket.org.insteadOf=https://bitbucket.org -c url.https://u:p@github.com/.insteadOf=git@github.com: -c url.https://u:p@github.com.insteadOf=git://github.com -c url.https://u:p@github.com.insteadOf=https://github.com -c url.https://u:p@gitlab.com/.insteadOf=git@gitlab.com: -c url.https://u:p@gitlab.com.insteadOf=git://gitlab.com -c url.https://u:p@gitlab.com.insteadOf=https://gitlab.com fetch --prune --tags --force origin
2022-08-15 21:20:45,620 DEBUG: Directory: build/eu.faircode.email
2022-08-15 21:20:45,620 DEBUG: > git remote set-head origin --auto
2022-08-15 21:20:46,050 DEBUG: Directory: build/eu.faircode.email
2022-08-15 21:20:46,050 DEBUG: > git checkout -f af92c2c75ea521f43efe64a0b7fdbda0acbba6ab
2022-08-15 21:20:46,666 DEBUG: Directory: build/eu.faircode.email
2022-08-15 21:20:46,666 DEBUG: > git clean -dffx
2022-08-15 21:20:46,925 INFO: Initialising submodules
2022-08-15 21:20:46,926 DEBUG: Directory: build/eu.faircode.email
2022-08-15 21:20:46,926 DEBUG: > git rev-parse --show-toplevel
2022-08-15 21:20:47,133 DEBUG: Directory: build/eu.faircode.email
2022-08-15 21:20:47,133 DEBUG: > git submodule sync
2022-08-15 21:20:47,241 DEBUG: Directory: build/eu.faircode.email
2022-08-15 21:20:47,242 DEBUG: > git -c core.askpass=/bin/true -c core.sshCommand=/bin/false -c url.https://.insteadOf=ssh:// -c url.https://u:p@bitbucket.org/.insteadOf=git@bitbucket.org: -c url.https://u:p@bitbucket.org.insteadOf=git://bitbucket.org -c url.https://u:p@bitbucket.org.insteadOf=https://bitbucket.org -c url.https://u:p@github.com/.insteadOf=git@github.com: -c url.https://u:p@github.com.insteadOf=git://github.com -c url.https://u:p@github.com.insteadOf=https://github.com -c url.https://u:p@gitlab.com/.insteadOf=git@gitlab.com: -c url.https://u:p@gitlab.com.insteadOf=git://gitlab.com -c url.https://u:p@gitlab.com.insteadOf=https://gitlab.com submodule update --init --force --recursive
2022-08-15 21:20:47,412 INFO: Creating local.properties file at build/eu.faircode.email/local.properties
2022-08-15 21:20:47,412 INFO: Creating local.properties file at build/eu.faircode.email/app/local.properties
2022-08-15 21:20:47,413 DEBUG: Removing debuggable flags from build/eu.faircode.email/app
2022-08-15 21:20:47,432 INFO: Cleaned build.gradle of keysigning configs at build/eu.faircode.email/app/build.gradle
2022-08-15 21:20:47,442 INFO: Running 'prebuild' commands in build/eu.faircode.email/app
2022-08-15 21:20:47,442 DEBUG: Directory: build/eu.faircode.email/app
2022-08-15 21:20:47,443 DEBUG: > bash -x -c -- sed -i -e '/keystoreProperties/d' -e '/in-app-purchasing/d' build.gradle
+ sed -i -e /keystoreProperties/d -e /in-app-purchasing/d build.gradle
2022-08-15 21:20:47,647 INFO: Cleaning Gradle project...
2022-08-15 21:20:47,648 DEBUG: Directory: build/eu.faircode.email/app
2022-08-15 21:20:47,648 DEBUG: > /home/vagrant/fdroidserver/gradlew-fdroid clean
Found 7.3.3 via distributionUrl
Downloading missing gradle version 7.3.3
cachedir /home/vagrant/.cache/fdroidserver
/home/vagrant/.cache/fdroidserver/gradle-7.3.3-bin.zip: OK
Running /opt/gradle/versions/7.3.3/bin/gradle clean

Welcome to Gradle 7.3.3!

Here are the highlights of this release:
 - Easily declare new test suites in Java projects
 - Support for Java 17
 - Support for Scala 3

For more details see https://docs.gradle.org/7.3.3/release-notes.html

To honour the JVM settings for this build a single-use Daemon process will be forked. See https://docs.gradle.org/7.3.3/userguide/gradle_daemon.html#sec:disabling_the_daemon.
Daemon will be stopped at the end of the build 

> Configure project :app
[CXX1104] NDK from ndk.dir at /opt/android-sdk/ndk/23.2.8568313 had version [23.2.8568313] which disagrees with android.ndkVersion [25.0.8775105]
[CXX1104] NDK from ndk.dir at /opt/android-sdk/ndk/23.2.8568313 had version [23.2.8568313] which disagrees with android.ndkVersion [25.0.8775105]
[CXX1104] NDK from ndk.dir at /opt/android-sdk/ndk/23.2.8568313 had version [23.2.8568313] which disagrees with android.ndkVersion [25.0.8775105]
[CXX1104] NDK from ndk.dir at /opt/android-sdk/ndk/23.2.8568313 had version [23.2.8568313] which disagrees with android.ndkVersion [25.0.8775105]
[CXX1104] NDK from ndk.dir at /opt/android-sdk/ndk/23.2.8568313 had version [23.2.8568313] which disagrees with android.ndkVersion [25.0.8775105]
[CXX1104] NDK from ndk.dir at /opt/android-sdk/ndk/23.2.8568313 had version [23.2.8568313] which disagrees with android.ndkVersion [25.0.8775105]

FAILURE: Build failed with an exception.

* What went wrong:
A problem occurred configuring project ':app'.
> [CXX1104] NDK from ndk.dir at /opt/android-sdk/ndk/23.2.8568313 had version [23.2.8568313] which disagrees with android.ndkVersion [25.0.8775105]

* Try:
> Run with --stacktrace option to get the stack trace.
> Run with --info or --debug option to get more log output.
> Run with --scan to get full insights.

* Get more help at https://help.gradle.org

BUILD FAILED in 36s
2022-08-15 21:21:28,749 ERROR: Could not build app eu.faircode.email: Error cleaning eu.faircode.email:1.1950
==== detail begin ====
Found 7.3.3 via distributionUrl
Downloading missing gradle version 7.3.3
cachedir /home/vagrant/.cache/fdroidserver
/home/vagrant/.cache/fdroidserver/gradle-7.3.3-bin.zip: OK
Running /opt/gradle/versions/7.3.3/bin/gradle clean

Welcome to Gradle 7.3.3!

Here are the highlights of this release:
 - Easily declare new test suites in Java projects
 - Support for Java 17
 - Support for Scala 3

For more details see https://docs.gradle.org/7.3.3/release-notes.html

To honour the JVM settings for this build a single-use Daemon process will be forked. See https://docs.gradle.org/7.3.3/userguide/gradle_daemon.html#sec:disabling_the_daemon.
Daemon will be stopped at the end of the build 

> Configure project :app
[CXX1104] NDK from ndk.dir at /opt/android-sdk/ndk/23.2.8568313 had version [23.2.8568313] which disagrees with android.ndkVersion [25.0.8775105]
[CXX1104] NDK from ndk.dir at /opt/android-sdk/ndk/23.2.8568313 had version [23.2.8568313] which disagrees with android.ndkVersion [25.0.8775105]
[CXX1104] NDK from ndk.dir at /opt/android-sdk/ndk/23.2.8568313 had version [23.2.8568313] which disagrees with android.ndkVersion [25.0.8775105]
[CXX1104] NDK from ndk.dir at /opt/android-sdk/ndk/23.2.8568313 had version [23.2.8568313] which disagrees with android.ndkVersion [25.0.8775105]
[CXX1104] NDK from ndk.dir at /opt/android-sdk/ndk/23.2.8568313 had version [23.2.8568313] which disagrees with android.ndkVersion [25.0.8775105]
[CXX1104] NDK from ndk.dir at /opt/android-sdk/ndk/23.2.8568313 had version [23.2.8568313] which disagrees with android.ndkVersion [25.0.8775105]

FAILURE: Build failed with an exception.

* What went wrong:
A problem occurred configuring project ':app'.
> [CXX1104] NDK from ndk.dir at /opt/android-sdk/ndk/23.2.8568313 had version [23.2.8568313] which disagrees with android.ndkVersion [25.0.8775105]

* Try:
> Run with --stacktrace option to get the stack trace.
> Run with --info or --debug option to get more log output.
> Run with --scan to get full insights.

* Get more help at https://help.gradle.org

BUILD FAILED in 36s
==== detail end ====
2022-08-15 21:21:28,750 DEBUG: Error encoutered, stopping by user request.
==== detail end ====