log for is.xyz.mpv:25

Traceback (most recent call last):
  File "/home/fbuild/fdroidserver/fdroidserver/build.py", line 1136, in main
    options.onserver, options.refresh):
  File "/home/fbuild/fdroidserver/fdroidserver/build.py", line 886, in trybuild
    build_server(app, build, vcs, build_dir, output_dir, log_dir, force)
  File "/home/fbuild/fdroidserver/fdroidserver/build.py", line 269, in build_server
    str(output, 'utf-8'))
fdroidserver.exception.BuildException: Build.py failed on server for is.xyz.mpv:2021-10-10-release
==== detail begin ====
== Installed Android Tools ==

2021-10-16 06:55:23,268 DEBUG: Reading 'config.yml'
2021-10-16 06:55:23,278 INFO: Using /opt/android-sdk/build-tools/29.0.3/apksigner 
2021-10-16 06:55:23,281 INFO: Creating log directory
2021-10-16 06:55:23,281 INFO: Creating temporary directory
2021-10-16 06:55:23,281 INFO: Creating output directory
2021-10-16 06:55:23,285 DEBUG: Getting git vcs interface for https://github.com/mpv-android/mpv-android.git
2021-10-16 06:55:23,285 DEBUG: > git --version
git version 2.11.0
2021-10-16 06:55:23,520 INFO: Using git version 2.11.0
2021-10-16 06:55:23,520 DEBUG: Checking 2021-10-10-release
2021-10-16 06:55:23,520 INFO: Building version 2021-10-10-release (25) of is.xyz.mpv
2021-10-16 06:55:23,521 WARNING: Android NDK version 'r23' could not be found!
2021-10-16 06:55:23,521 WARNING: Configured versions:
2021-10-16 06:55:23,521 WARNING:   r22b: /opt/android-sdk/ndk/22.1.7171670
2021-10-16 06:55:23,521 WARNING:   r21e: /opt/android-sdk/ndk/21.4.7075529
2021-10-16 06:55:23,522 INFO: Downloading https://dl.google.com/android/repository/android-ndk-r23-linux.zip
2021-10-16 06:55:23,549 DEBUG: Starting new HTTPS connection (1): dl.google.com
2021-10-16 06:55:23,639 DEBUG: https://dl.google.com:443 "GET /android/repository/android-ndk-r23-linux.zip HTTP/1.1" 200 721667870
2021-10-16 06:55:45,579 INFO: Unzipping to /opt/android-sdk/ndk
2021-10-16 06:56:00,693 INFO: Set NDK r23 (23.0.7599858) up
2021-10-16 06:56:00,697 INFO: Running 'sudo' commands in /home/vagrant
2021-10-16 06:56:00,698 DEBUG: > sudo DEBIAN_FRONTEND=noninteractive bash -x -c apt-get update || apt-get update && apt-get install -y openjdk-11-jdk-headless ninja-build && update-alternatives --auto java && pip3 install wheel && pip3 install meson
+ apt-get update
Hit:1 http://security.debian.org/debian-security stretch/updates InRelease
Ign:2 http://deb.debian.org/debian stretch InRelease
Hit:3 http://deb.debian.org/debian stretch-updates InRelease
Get:4 http://deb.debian.org/debian stretch-backports-sloppy InRelease [46.7 kB]
Get:5 http://deb.debian.org/debian stretch-backports InRelease [91.8 kB]
Get:6 http://deb.debian.org/debian testing InRelease [128 kB]
Hit:7 http://deb.debian.org/debian stretch Release
Get:8 http://deb.debian.org/debian testing/main amd64 Packages.diff/Index [63.6 kB]
Get:10 http://deb.debian.org/debian testing/main i386 Packages.diff/Index [63.6 kB]
Get:11 http://deb.debian.org/debian testing/main Translation-en.diff/Index [63.6 kB]
Get:12 http://deb.debian.org/debian testing/main amd64 Packages T-2021-10-16-0202.04-F-2021-10-15-2001.59.pdiff [179 kB]
Get:13 http://deb.debian.org/debian testing/main i386 Packages T-2021-10-16-0202.04-F-2021-10-15-2001.59.pdiff [177 kB]
Get:12 http://deb.debian.org/debian testing/main amd64 Packages T-2021-10-16-0202.04-F-2021-10-15-2001.59.pdiff [179 kB]
Get:13 http://deb.debian.org/debian testing/main i386 Packages T-2021-10-16-0202.04-F-2021-10-15-2001.59.pdiff [177 kB]
Get:14 http://deb.debian.org/debian testing/main Translation-en T-2021-10-16-0202.04-F-2021-10-16-0202.04.pdiff [3,705 B]
Get:14 http://deb.debian.org/debian testing/main Translation-en T-2021-10-16-0202.04-F-2021-10-16-0202.04.pdiff [3,705 B]
Fetched 817 kB in 7s (104 kB/s)
Reading package lists...
+ apt-get install -y openjdk-11-jdk-headless ninja-build
Reading package lists...
Building dependency tree...
Reading state information...
The following additional packages will be installed:
  libasound2 libasound2-data openjdk-11-jre-headless
Suggested packages:
  libasound2-plugins alsa-utils openjdk-11-demo openjdk-11-source libnss-mdns
  fonts-dejavu-extra fonts-ipafont-gothic fonts-ipafont-mincho
  fonts-wqy-microhei | fonts-wqy-zenhei fonts-indic
The following NEW packages will be installed:
  libasound2 libasound2-data ninja-build openjdk-11-jdk-headless
  openjdk-11-jre-headless
0 upgraded, 5 newly installed, 0 to remove and 2 not upgraded.
Need to get 230 MB of archives.
After this operation, 374 MB of additional disk space will be used.
Get:1 http://deb.debian.org/debian stretch/main amd64 libasound2-data all 1.1.3-5 [173 kB]
Get:2 http://deb.debian.org/debian stretch/main amd64 libasound2 amd64 1.1.3-5 [497 kB]
Get:3 http://deb.debian.org/debian stretch/main amd64 ninja-build amd64 1.7.2-1 [92.9 kB]
Get:4 http://deb.debian.org/debian stretch-backports/main amd64 openjdk-11-jre-headless amd64 11.0.6+10-1~bpo9+1 [37.4 MB]
Get:5 http://deb.debian.org/debian stretch-backports/main amd64 openjdk-11-jdk-headless amd64 11.0.6+10-1~bpo9+1 [192 MB]
Fetched 230 MB in 2s (84.2 MB/s)
Selecting previously unselected package libasound2-data.
(Reading database ... 64914 files and directories currently installed.)
Preparing to unpack .../libasound2-data_1.1.3-5_all.deb ...
Unpacking libasound2-data (1.1.3-5) ...
Selecting previously unselected package libasound2:amd64.
Preparing to unpack .../libasound2_1.1.3-5_amd64.deb ...
Unpacking libasound2:amd64 (1.1.3-5) ...
Selecting previously unselected package ninja-build.
Preparing to unpack .../ninja-build_1.7.2-1_amd64.deb ...
Unpacking ninja-build (1.7.2-1) ...
Selecting previously unselected package openjdk-11-jre-headless:amd64.
Preparing to unpack .../openjdk-11-jre-headless_11.0.6+10-1~bpo9+1_amd64.deb ...
Unpacking openjdk-11-jre-headless:amd64 (11.0.6+10-1~bpo9+1) ...
Selecting previously unselected package openjdk-11-jdk-headless:amd64.
Preparing to unpack .../openjdk-11-jdk-headless_11.0.6+10-1~bpo9+1_amd64.deb ...
Unpacking openjdk-11-jdk-headless:amd64 (11.0.6+10-1~bpo9+1) ...
Setting up libasound2-data (1.1.3-5) ...
Setting up libasound2:amd64 (1.1.3-5) ...
Processing triggers for libc-bin (2.24-11+deb9u4) ...
Setting up ninja-build (1.7.2-1) ...
Setting up openjdk-11-jre-headless:amd64 (11.0.6+10-1~bpo9+1) ...
Setting up openjdk-11-jdk-headless:amd64 (11.0.6+10-1~bpo9+1) ...
update-alternatives: using /usr/lib/jvm/java-11-openjdk-amd64/bin/jdeprscan to provide /usr/bin/jdeprscan (jdeprscan) in auto mode
update-alternatives: using /usr/lib/jvm/java-11-openjdk-amd64/bin/jimage to provide /usr/bin/jimage (jimage) in auto mode
update-alternatives: using /usr/lib/jvm/java-11-openjdk-amd64/bin/jlink to provide /usr/bin/jlink (jlink) in auto mode
update-alternatives: using /usr/lib/jvm/java-11-openjdk-amd64/bin/jmod to provide /usr/bin/jmod (jmod) in auto mode
update-alternatives: using /usr/lib/jvm/java-11-openjdk-amd64/bin/jshell to provide /usr/bin/jshell (jshell) in auto mode
update-alternatives: using /usr/lib/jvm/java-11-openjdk-amd64/bin/jaotc to provide /usr/bin/jaotc (jaotc) in auto mode
update-alternatives: using /usr/lib/jvm/java-11-openjdk-amd64/bin/jhsdb to provide /usr/bin/jhsdb (jhsdb) in auto mode
+ update-alternatives --auto java
update-alternatives: using /usr/lib/jvm/java-11-openjdk-amd64/bin/java to provide /usr/bin/java (java) in auto mode
+ pip3 install wheel
Collecting wheel
  Downloading https://files.pythonhosted.org/packages/04/80/cad93b40262f5d09f6de82adbee452fd43cdff60830b56a74c5930f7e277/wheel-0.37.0-py2.py3-none-any.whl
Installing collected packages: wheel
Successfully installed wheel-0.37.0
+ pip3 install meson
Collecting meson
  Downloading https://files.pythonhosted.org/packages/b6/0a/9ae8a4d83263eee8f7357447f1e14f0e39b04a4994aa9884b7e14a91f530/meson-0.56.2.tar.gz (1.8MB)
Building wheels for collected packages: meson
  Running setup.py bdist_wheel for meson: started
  Running setup.py bdist_wheel for meson: finished with status 'done'
  Stored in directory: /root/.cache/pip/wheels/4e/78/33/02b127c55888ef7144372f5d9827799840ae1aa39689a65ef3
Successfully built meson
Installing collected packages: meson
Successfully installed meson-0.56.2
2021-10-16 06:56:47,387 DEBUG: > sudo passwd --lock root
passwd: password expiry information changed.
2021-10-16 06:56:47,600 DEBUG: > sudo SUDO_FORCE_REMOVE=yes dpkg --purge sudo
(Reading database ... 65585 files and directories currently installed.)
Removing sudo (1.8.19p1-2.1+deb9u3) ...
Purging configuration files for sudo (1.8.19p1-2.1+deb9u3) ...
Processing triggers for systemd (232-25+deb9u13) ...
2021-10-16 06:56:52,805 INFO: Getting source for revision mpv-android-2021-10-10
2021-10-16 06:56:52,806 DEBUG: Directory: build/is.xyz.mpv
2021-10-16 06:56:52,806 DEBUG: > git rev-parse --show-toplevel
2021-10-16 06:56:53,010 DEBUG: Directory: build/is.xyz.mpv
2021-10-16 06:56:53,010 DEBUG: > git submodule foreach --recursive git reset --hard
2021-10-16 06:56:53,417 DEBUG: Directory: build/is.xyz.mpv
2021-10-16 06:56:53,418 DEBUG: > git reset --hard
2021-10-16 06:56:53,627 DEBUG: Directory: build/is.xyz.mpv
2021-10-16 06:56:53,627 DEBUG: > git submodule foreach --recursive git clean -dffx
2021-10-16 06:56:53,736 DEBUG: Directory: build/is.xyz.mpv
2021-10-16 06:56:53,737 DEBUG: > git clean -dffx
2021-10-16 06:56:53,842 DEBUG: Directory: build/is.xyz.mpv
2021-10-16 06:56:53,842 DEBUG: > git -c core.askpass=/bin/true -c core.sshCommand=/bin/false -c url.https://.insteadOf=ssh:// -c url.https://u:p@bitbucket.org/.insteadOf=git@bitbucket.org: -c url.https://u:p@bitbucket.org.insteadOf=git://bitbucket.org -c url.https://u:p@bitbucket.org.insteadOf=https://bitbucket.org -c url.https://u:p@github.com/.insteadOf=git@github.com: -c url.https://u:p@github.com.insteadOf=git://github.com -c url.https://u:p@github.com.insteadOf=https://github.com -c url.https://u:p@gitlab.com/.insteadOf=git@gitlab.com: -c url.https://u:p@gitlab.com.insteadOf=git://gitlab.com -c url.https://u:p@gitlab.com.insteadOf=https://gitlab.com fetch origin
2021-10-16 06:56:54,651 DEBUG: Directory: build/is.xyz.mpv
2021-10-16 06:56:54,651 DEBUG: > git -c core.askpass=/bin/true -c core.sshCommand=/bin/false -c url.https://.insteadOf=ssh:// -c url.https://u:p@bitbucket.org/.insteadOf=git@bitbucket.org: -c url.https://u:p@bitbucket.org.insteadOf=git://bitbucket.org -c url.https://u:p@bitbucket.org.insteadOf=https://bitbucket.org -c url.https://u:p@github.com/.insteadOf=git@github.com: -c url.https://u:p@github.com.insteadOf=git://github.com -c url.https://u:p@github.com.insteadOf=https://github.com -c url.https://u:p@gitlab.com/.insteadOf=git@gitlab.com: -c url.https://u:p@gitlab.com.insteadOf=git://gitlab.com -c url.https://u:p@gitlab.com.insteadOf=https://gitlab.com fetch --prune --tags --force origin
2021-10-16 06:56:54,958 DEBUG: Directory: build/is.xyz.mpv
2021-10-16 06:56:54,958 DEBUG: > git remote set-head origin --auto
2021-10-16 06:56:55,365 DEBUG: Directory: build/is.xyz.mpv
2021-10-16 06:56:55,365 DEBUG: > git checkout -f mpv-android-2021-10-10
2021-10-16 06:56:55,588 DEBUG: Directory: build/is.xyz.mpv
2021-10-16 06:56:55,589 DEBUG: > git clean -dffx
2021-10-16 06:56:55,694 INFO: Collecting source libraries
2021-10-16 06:56:55,706 DEBUG: Removing debuggable flags from build/srclib/mbedtls
2021-10-16 06:56:55,713 DEBUG: Removing debuggable flags from build/srclib/dav1d
2021-10-16 06:56:55,726 DEBUG: Removing debuggable flags from build/srclib/FFmpeg
2021-10-16 06:56:55,741 DEBUG: Removing debuggable flags from build/srclib/freetype2
2021-10-16 06:56:55,745 DEBUG: Removing debuggable flags from build/srclib/fribidi
2021-10-16 06:56:55,755 DEBUG: Removing debuggable flags from build/srclib/harfbuzz
2021-10-16 06:56:55,765 DEBUG: Removing debuggable flags from build/srclib/libass
2021-10-16 06:56:55,770 DEBUG: Removing debuggable flags from build/srclib/mpv
2021-10-16 06:56:55,773 INFO: Creating local.properties file at build/is.xyz.mpv/local.properties
2021-10-16 06:56:55,773 INFO: Creating local.properties file at build/is.xyz.mpv/app/local.properties
2021-10-16 06:56:55,773 DEBUG: Removing debuggable flags from build/is.xyz.mpv/app
2021-10-16 06:56:55,781 INFO: Running 'prebuild' commands in build/is.xyz.mpv/app
2021-10-16 06:56:55,781 DEBUG: Directory: build/is.xyz.mpv/app
2021-10-16 06:56:55,781 DEBUG: > bash -x -c -- cd ../buildscripts/ && mkdir -p sdk && ln -s /opt/android-sdk/ndk/23.0.7599858 sdk/android-ndk-r23 && mkdir -p deps && pushd deps/ && cp -r /home/vagrant/build/srclib/mbedtls mbedtls && cp -r /home/vagrant/build/srclib/dav1d dav1d && cp -r /home/vagrant/build/srclib/FFmpeg ffmpeg && cp -r /home/vagrant/build/srclib/freetype2 freetype2 && cp -r /home/vagrant/build/srclib/fribidi fribidi && cp -r /home/vagrant/build/srclib/harfbuzz harfbuzz && cp -r /home/vagrant/build/srclib/libass libass && mkdir lua && wget https://www.lua.org/ftp/lua-5.2.4.tar.gz -O - | tar -xz --strip-components=1 -C lua && cp -r /home/vagrant/build/srclib/mpv mpv && popd && sed -i -e '/gradlew/d' scripts/mpv-android.sh && sed -i -e '/"$target" == "mpv-android"/,/ls -lh/d' buildall.sh
+ cd ../buildscripts/
+ mkdir -p sdk
+ ln -s /opt/android-sdk/ndk/23.0.7599858 sdk/android-ndk-r23
+ mkdir -p deps
+ pushd deps/
~/build/is.xyz.mpv/buildscripts/deps ~/build/is.xyz.mpv/buildscripts
+ cp -r /home/vagrant/build/srclib/mbedtls mbedtls
+ cp -r /home/vagrant/build/srclib/dav1d dav1d
+ cp -r /home/vagrant/build/srclib/FFmpeg ffmpeg
+ cp -r /home/vagrant/build/srclib/freetype2 freetype2
+ cp -r /home/vagrant/build/srclib/fribidi fribidi
+ cp -r /home/vagrant/build/srclib/harfbuzz harfbuzz
+ cp -r /home/vagrant/build/srclib/libass libass
+ mkdir lua
+ wget https://www.lua.org/ftp/lua-5.2.4.tar.gz -O -
+ tar -xz --strip-components=1 -C lua
--2021-10-16 06:56:56--  https://www.lua.org/ftp/lua-5.2.4.tar.gz
Resolving www.lua.org (www.lua.org)... 88.99.213.221, 2a01:4f8:10a:3edc::2
Connecting to www.lua.org (www.lua.org)|88.99.213.221|:443... connected.
HTTP request sent, awaiting response... 200 OK
Length: 252651 (247K) [application/gzip]
Saving to: ‘STDOUT’

     0K .......... .......... .......... .......... .......... 20% 14.8M 0s
    50K .......... .......... .......... .......... .......... 40%  146M 0s
   100K .......... .......... .......... .......... .......... 60% 24.1M 0s
   150K .......... .......... .......... .......... .......... 81% 52.7M 0s
   200K .......... .......... .......... .......... ......    100% 25.5M=0.008s

2021-10-16 06:56:56 (28.8 MB/s) - written to stdout [252651/252651]

+ cp -r /home/vagrant/build/srclib/mpv mpv
+ popd
~/build/is.xyz.mpv/buildscripts
+ sed -i -e /gradlew/d scripts/mpv-android.sh
+ sed -i -e '/"$target" == "mpv-android"/,/ls -lh/d' buildall.sh
2021-10-16 06:56:57,091 INFO: Cleaning Gradle project...
2021-10-16 06:56:57,091 DEBUG: Directory: build/is.xyz.mpv/app
2021-10-16 06:56:57,091 DEBUG: > /home/vagrant/fdroidserver/gradlew-fdroid clean
Found 7.2 via distributionUrl
Downloading missing gradle version 7.2
cachedir /home/vagrant/.cache/fdroidserver
/home/vagrant/.cache/fdroidserver/gradle-7.2-bin.zip: OK
Running /opt/gradle/versions/7.2/bin/gradle clean

Welcome to Gradle 7.2!

Here are the highlights of this release:
 - Toolchain support for Scala
 - More cache hits when Java source files have platform-specific line endings
 - More resilient remote HTTP build cache behavior

For more details see https://docs.gradle.org/7.2/release-notes.html

To honour the JVM settings for this build a single-use Daemon process will be forked. See https://docs.gradle.org/7.2/userguide/gradle_daemon.html#sec:disabling_the_daemon.
Daemon will be stopped at the end of the build 
> Task :app:clean UP-TO-DATE

BUILD SUCCESSFUL in 24s
1 actionable task: 1 up-to-date
2021-10-16 06:57:24,584 INFO: Scanning source for common problems...
2021-10-16 06:57:24,590 INFO: Removing gradle-wrapper.jar at gradle/wrapper/gradle-wrapper.jar
2021-10-16 06:57:24,651 WARNING: Found binary at buildscripts/deps/harfbuzz/test/api/fonts/clusterfuzz-testcase-minimized-hb-shape-fuzzer-5753845452636160
2021-10-16 06:57:24,700 WARNING: Found binary at buildscripts/deps/harfbuzz/test/fuzzing/sets/union_01
2021-10-16 06:57:24,701 WARNING: Found binary at buildscripts/deps/harfbuzz/test/fuzzing/sets/symmetric_diff_01
2021-10-16 06:57:24,701 WARNING: Found binary at buildscripts/deps/harfbuzz/test/fuzzing/sets/intersect_01
2021-10-16 06:57:24,701 WARNING: Found binary at buildscripts/deps/harfbuzz/test/fuzzing/sets/subtract_01
2021-10-16 06:57:24,702 WARNING: Found binary at buildscripts/deps/harfbuzz/test/fuzzing/fonts/clusterfuzz-testcase-minimized-hb-subset-get-codepoints-fuzzer-6136125075750912
2021-10-16 06:57:24,702 WARNING: Found binary at buildscripts/deps/harfbuzz/test/fuzzing/fonts/clusterfuzz-testcase-minimized-hb-subset-fuzzer-5708623339323392
2021-10-16 06:57:24,702 WARNING: Found binary at buildscripts/deps/harfbuzz/test/fuzzing/fonts/clusterfuzz-testcase-minimized-hb-subset-fuzzer-5641053680173056
2021-10-16 06:57:24,702 WARNING: Found binary at buildscripts/deps/harfbuzz/test/fuzzing/fonts/clusterfuzz-testcase-minimized-hb-fuzzer-6023178755244032
2021-10-16 06:57:24,703 WARNING: Found binary at buildscripts/deps/harfbuzz/test/fuzzing/fonts/clusterfuzz-testcase-minimized-hb-shape-fuzzer-5722888989048832
2021-10-16 06:57:24,703 WARNING: Found binary at buildscripts/deps/harfbuzz/test/fuzzing/fonts/crash-e4e0bb1458a91b692eba492c907ae1f94e635480
2021-10-16 06:57:24,703 WARNING: Found binary at buildscripts/deps/harfbuzz/test/fuzzing/fonts/clusterfuzz-testcase-hb-shape-fuzzer-5688420752424960
2021-10-16 06:57:24,703 WARNING: Found binary at buildscripts/deps/harfbuzz/test/fuzzing/fonts/clusterfuzz-testcase-minimized-hb-subset-fuzzer-5629878397829120
2021-10-16 06:57:24,703 WARNING: Found binary at buildscripts/deps/harfbuzz/test/fuzzing/fonts/clusterfuzz-testcase-minimized-hb-subset-fuzzer-5160311461511168
2021-10-16 06:57:24,703 WARNING: Found binary at buildscripts/deps/harfbuzz/test/fuzzing/fonts/clusterfuzz-testcase-minimized-hb-subset-fuzzer-5684542900535296
2021-10-16 06:57:24,704 WARNING: Found binary at buildscripts/deps/harfbuzz/test/fuzzing/fonts/clusterfuzz-testcase-minimized-hb-shape-fuzzer-5750379279548416
2021-10-16 06:57:24,704 WARNING: Found binary at buildscripts/deps/harfbuzz/test/fuzzing/fonts/clusterfuzz-testcase-minimized-hb-subset-fuzzer-5674228796358656
2021-10-16 06:57:24,704 WARNING: Found binary at buildscripts/deps/harfbuzz/test/fuzzing/fonts/clusterfuzz-testcase-minimized-harfbuzz_fuzzer-6107935408390144
2021-10-16 06:57:24,704 WARNING: Found binary at buildscripts/deps/harfbuzz/test/fuzzing/fonts/clusterfuzz-testcase-minimized-hb-fuzzer-6576177596596224
2021-10-16 06:57:24,704 WARNING: Found binary at buildscripts/deps/harfbuzz/test/fuzzing/fonts/clusterfuzz-testcase-minimized-hb-subset-fuzzer-4961171477233664
2021-10-16 06:57:24,704 WARNING: Found binary at buildscripts/deps/harfbuzz/test/fuzzing/fonts/clusterfuzz-testcase-minimized-hb-fuzzer-6595199411159040
2021-10-16 06:57:24,705 WARNING: Found binary at buildscripts/deps/harfbuzz/test/fuzzing/fonts/clusterfuzz-testcase-minimized-5924299061854208
2021-10-16 06:57:24,705 WARNING: Found binary at buildscripts/deps/harfbuzz/test/fuzzing/fonts/clusterfuzz-testcase-minimized-hb-subset-fuzzer-5754526379802624
2021-10-16 06:57:24,705 WARNING: Found binary at buildscripts/deps/harfbuzz/test/fuzzing/fonts/clusterfuzz-testcase-minimized-hb-subset-fuzzer-6382598554255360
2021-10-16 06:57:24,705 WARNING: Found binary at buildscripts/deps/harfbuzz/test/fuzzing/fonts/clusterfuzz-testcase-hb-shape-fuzzer-5689920685867008
2021-10-16 06:57:24,705 WARNING: Found binary at buildscripts/deps/harfbuzz/test/fuzzing/fonts/5a5daf5eb5a4db77a2baa3ad9c7a6ed6e0655fa8
2021-10-16 06:57:24,705 WARNING: Found binary at buildscripts/deps/harfbuzz/test/fuzzing/fonts/clusterfuzz-testcase-minimized-harfbuzz_fuzzer-6603291950841856
2021-10-16 06:57:24,706 WARNING: Found binary at buildscripts/deps/harfbuzz/test/fuzzing/fonts/clusterfuzz-testcase-minimized-5720051798769664
2021-10-16 06:57:24,706 WARNING: Found binary at buildscripts/deps/harfbuzz/test/fuzzing/fonts/clusterfuzz-testcase-minimized-hb-shape-fuzzer-5648999235715072
2021-10-16 06:57:24,706 WARNING: Found binary at buildscripts/deps/harfbuzz/test/fuzzing/fonts/clusterfuzz-testcase-minimized-hb-subset-fuzzer-5269686781607936
2021-10-16 06:57:24,706 WARNING: Found binary at buildscripts/deps/harfbuzz/test/fuzzing/fonts/clusterfuzz-testcase-minimized-hb-subset-fuzzer-5241922561114112
2021-10-16 06:57:24,706 WARNING: Found binary at buildscripts/deps/harfbuzz/test/fuzzing/fonts/clusterfuzz-testcase-minimized-harfbuzz_fuzzer-4684060812378112
2021-10-16 06:57:24,706 WARNING: Found binary at buildscripts/deps/harfbuzz/test/fuzzing/fonts/clusterfuzz-testcase-minimized-hb-subset-fuzzer-5710107829075968
2021-10-16 06:57:24,707 WARNING: Found binary at buildscripts/deps/harfbuzz/test/fuzzing/fonts/clusterfuzz-testcase-minimized-hb-subset-fuzzer-5416421032067072
2021-10-16 06:57:24,707 WARNING: Found binary at buildscripts/deps/harfbuzz/test/fuzzing/fonts/clusterfuzz-testcase-minimized-hb-subset-fuzzer-5721073428987904
2021-10-16 06:57:24,707 WARNING: Found binary at buildscripts/deps/harfbuzz/test/fuzzing/fonts/crash-ccc61c92d589f895174cdef6ff2e3b20e9999a1a
2021-10-16 06:57:24,707 WARNING: Found binary at buildscripts/deps/harfbuzz/test/fuzzing/fonts/clusterfuzz-testcase-minimized-hb-subset-fuzzer-5672006905757696
2021-10-16 06:57:24,707 WARNING: Found binary at buildscripts/deps/harfbuzz/test/fuzzing/fonts/clusterfuzz-testcase-minimized-hb-fuzzer-5388906574905344
2021-10-16 06:57:24,707 WARNING: Found binary at buildscripts/deps/harfbuzz/test/fuzzing/fonts/clusterfuzz-testcase-hb-shape-fuzzer-5643643755429888
2021-10-16 06:57:24,708 WARNING: Found binary at buildscripts/deps/harfbuzz/test/fuzzing/fonts/clusterfuzz-testcase-minimized-hb-shape-fuzzer-5695615258853376
2021-10-16 06:57:24,708 WARNING: Found binary at buildscripts/deps/harfbuzz/test/fuzzing/fonts/clusterfuzz-testcase-minimized-hb-shape-fuzzer-5138182937772032
2021-10-16 06:57:24,708 WARNING: Found binary at buildscripts/deps/harfbuzz/test/fuzzing/fonts/clusterfuzz-testcase-minimized-hb-subset-get-codepoints-fuzzer-5736539338833920
2021-10-16 06:57:24,708 WARNING: Found binary at buildscripts/deps/harfbuzz/test/fuzzing/fonts/clusterfuzz-testcase-minimized-hb-fuzzer-6278851874258944
2021-10-16 06:57:24,708 WARNING: Found binary at buildscripts/deps/harfbuzz/test/fuzzing/fonts/clusterfuzz-testcase-minimized-hb-subset-fuzzer-5362189182566400
2021-10-16 06:57:24,708 WARNING: Found binary at buildscripts/deps/harfbuzz/test/fuzzing/fonts/clusterfuzz-testcase-minimized-harfbuzz_fuzzer-5662548265009152
2021-10-16 06:57:24,708 WARNING: Found binary at buildscripts/deps/harfbuzz/test/fuzzing/fonts/clusterfuzz-testcase-minimized-harfbuzz_fuzzer-6252118652092416
2021-10-16 06:57:24,709 WARNING: Found binary at buildscripts/deps/harfbuzz/test/fuzzing/fonts/clusterfuzz-testcase-minimized-hb-shape-fuzzer-5711096049041408
2021-10-16 06:57:24,709 WARNING: Found binary at buildscripts/deps/harfbuzz/test/fuzzing/fonts/clusterfuzz-testcase-minimized-hb-fuzzer-6210176798425088
2021-10-16 06:57:24,709 WARNING: Found binary at buildscripts/deps/harfbuzz/test/fuzzing/fonts/1746cad6bc3fb2b355db50a5af37c9b58d9ad376
2021-10-16 06:57:24,709 WARNING: Found binary at buildscripts/deps/harfbuzz/test/fuzzing/fonts/clusterfuzz-testcase-minimized-harfbuzz_fuzzer-4977194146988032
2021-10-16 06:57:24,709 WARNING: Found binary at buildscripts/deps/harfbuzz/test/fuzzing/fonts/clusterfuzz-testcase-6107935408390144
2021-10-16 06:57:24,709 WARNING: Found binary at buildscripts/deps/harfbuzz/test/fuzzing/fonts/clusterfuzz-testcase-minimized-hb-fuzzer-4827735151083520
2021-10-16 06:57:24,709 WARNING: Found binary at buildscripts/deps/harfbuzz/test/fuzzing/fonts/clusterfuzz-testcase-minimized-hb-subset-fuzzer-5747280156295168
2021-10-16 06:57:24,710 WARNING: Found binary at buildscripts/deps/harfbuzz/test/fuzzing/fonts/clusterfuzz-testcase-minimized-hb-shape-fuzzer-5691469793329152
2021-10-16 06:57:24,710 WARNING: Found binary at buildscripts/deps/harfbuzz/test/fuzzing/fonts/clusterfuzz-testcase-minimized-hb-subset-fuzzer-5067936541179904
2021-10-16 06:57:24,710 WARNING: Found binary at buildscripts/deps/harfbuzz/test/fuzzing/fonts/clusterfuzz-testcase-minimized-hb-shape-fuzzer-5677421274071040
2021-10-16 06:57:24,710 WARNING: Found binary at buildscripts/deps/harfbuzz/test/fuzzing/fonts/clusterfuzz-testcase-minimized-hb-shape-fuzzer-5764636557705216
2021-10-16 06:57:24,710 WARNING: Found binary at buildscripts/deps/harfbuzz/test/fuzzing/fonts/clusterfuzz-testcase-minimized-hb-shape-fuzzer-5650286710882304
2021-10-16 06:57:24,710 WARNING: Found binary at buildscripts/deps/harfbuzz/test/fuzzing/fonts/clusterfuzz-testcase-minimized-hb-fuzzer-6424351550210048
2021-10-16 06:57:24,710 WARNING: Found binary at buildscripts/deps/harfbuzz/test/fuzzing/fonts/clusterfuzz-testcase-minimized-hb-subset-fuzzer-6316256152780800
2021-10-16 06:57:24,711 WARNING: Found binary at buildscripts/deps/harfbuzz/test/fuzzing/fonts/clusterfuzz-testcase-hb-shape-fuzzer-5750379279548416
2021-10-16 06:57:24,711 WARNING: Found binary at buildscripts/deps/harfbuzz/test/fuzzing/fonts/fuzz-1-harfbuzz_fuzzer(1)
2021-10-16 06:57:24,711 WARNING: Found binary at buildscripts/deps/harfbuzz/test/fuzzing/fonts/clusterfuzz-testcase-hb-subset-fuzzer-5762137968869376
2021-10-16 06:57:24,711 WARNING: Found binary at buildscripts/deps/harfbuzz/test/fuzzing/fonts/clusterfuzz-testcase-minimized-hb-shape-fuzzer-5668791174823936
2021-10-16 06:57:24,711 WARNING: Found binary at buildscripts/deps/harfbuzz/test/fuzzing/fonts/clusterfuzz-testcase-minimized-hb-subset-fuzzer-5765071062958080
2021-10-16 06:57:24,711 WARNING: Found binary at buildscripts/deps/harfbuzz/test/fuzzing/fonts/clusterfuzz-testcase-minimized-hb-subset-fuzzer-5758358618898432
2021-10-16 06:57:24,711 WARNING: Found binary at buildscripts/deps/harfbuzz/test/fuzzing/fonts/fuzz-3-harfbuzz_fuzzer(3)
2021-10-16 06:57:24,712 WARNING: Found binary at buildscripts/deps/harfbuzz/test/fuzzing/fonts/clusterfuzz-testcase-minimized-hb-subset-fuzzer-6651660668502016
2021-10-16 06:57:24,712 WARNING: Found binary at buildscripts/deps/harfbuzz/test/fuzzing/fonts/clusterfuzz-testcase-minimized-hb-subset-fuzzer-5927551890096128
2021-10-16 06:57:24,712 WARNING: Found binary at buildscripts/deps/harfbuzz/test/fuzzing/fonts/clusterfuzz-testcase-minimized-hb-subset-fuzzer-5678476148867072
2021-10-16 06:57:24,712 WARNING: Found binary at buildscripts/deps/harfbuzz/test/fuzzing/fonts/clusterfuzz-testcase-minimized-hb-subset-fuzzer-5725847365877760
2021-10-16 06:57:24,712 WARNING: Found binary at buildscripts/deps/harfbuzz/test/fuzzing/fonts/clusterfuzz-testcase-minimized-hb-fuzzer-6460279560863744
2021-10-16 06:57:24,712 WARNING: Found binary at buildscripts/deps/harfbuzz/test/fuzzing/fonts/clusterfuzz-testcase-minimized-hb-subset-fuzzer-6372147008241664
2021-10-16 06:57:24,712 WARNING: Found binary at buildscripts/deps/harfbuzz/test/fuzzing/fonts/clusterfuzz-testcase-minimized-hb-subset-fuzzer-5923632099885056
2021-10-16 06:57:24,712 WARNING: Found binary at buildscripts/deps/harfbuzz/test/fuzzing/fonts/clusterfuzz-testcase-minimized-hb-shape-fuzzer-5768046065483776
2021-10-16 06:57:24,713 WARNING: Found binary at buildscripts/deps/harfbuzz/test/fuzzing/fonts/clusterfuzz-testcase-minimized-hb-subset-fuzzer-6173520787800064
2021-10-16 06:57:24,713 WARNING: Found binary at buildscripts/deps/harfbuzz/test/fuzzing/fonts/clusterfuzz-testcase-minimized-hb-shape-fuzzer-5679244475105280
2021-10-16 06:57:24,713 WARNING: Found binary at buildscripts/deps/harfbuzz/test/fuzzing/fonts/clusterfuzz-testcase-minimized-hb-shape-fuzzer-5647267827023872
2021-10-16 06:57:24,713 WARNING: Found binary at buildscripts/deps/harfbuzz/test/fuzzing/fonts/clusterfuzz-testcase-minimized-hb-shape-fuzzer-5664873493561344
2021-10-16 06:57:24,713 WARNING: Found binary at buildscripts/deps/harfbuzz/test/fuzzing/fonts/clusterfuzz-testcase-minimized-hb-subset-fuzzer-5179935334465536
2021-10-16 06:57:24,713 WARNING: Found binary at buildscripts/deps/harfbuzz/test/fuzzing/fonts/clusterfuzz-testcase-minimized-hb-shape-fuzzer-5158673602314240
2021-10-16 06:57:24,714 WARNING: Found binary at buildscripts/deps/harfbuzz/test/fuzzing/fonts/clusterfuzz-testcase-minimized-hb-fuzzer-4595692015190016
2021-10-16 06:57:24,714 WARNING: Found binary at buildscripts/deps/harfbuzz/test/fuzzing/fonts/clusterfuzz-testcase-minimized-hb-shape-fuzzer-5642666339991552
2021-10-16 06:57:24,714 WARNING: Found binary at buildscripts/deps/harfbuzz/test/fuzzing/fonts/clusterfuzz-testcase-hb-shape-fuzzer-5097734906839040
2021-10-16 06:57:24,714 WARNING: Found binary at buildscripts/deps/harfbuzz/test/fuzzing/fonts/clusterfuzz-testcase-minimized-harfbuzz_fuzzer-5163560220753920
2021-10-16 06:57:24,714 WARNING: Found binary at buildscripts/deps/harfbuzz/test/fuzzing/fonts/clusterfuzz-testcase-minimized-harfbuzz_fuzzer-5719356528656384
2021-10-16 06:57:24,714 WARNING: Found binary at buildscripts/deps/harfbuzz/test/fuzzing/fonts/clusterfuzz-testcase-minimized-hb-fuzzer-5672141338968064
2021-10-16 06:57:24,715 WARNING: Found binary at buildscripts/deps/harfbuzz/test/fuzzing/fonts/clusterfuzz-testcase-minimized-harfbuzz_fuzzer-5103148350963712
2021-10-16 06:57:24,715 WARNING: Found binary at buildscripts/deps/harfbuzz/test/fuzzing/fonts/clusterfuzz-testcase-minimized-hb-shape-fuzzer-5634620935110656
2021-10-16 06:57:24,715 WARNING: Found binary at buildscripts/deps/harfbuzz/test/fuzzing/fonts/clusterfuzz-testcase-hb-shape-fuzzer-5072750494875648
2021-10-16 06:57:24,715 WARNING: Found binary at buildscripts/deps/harfbuzz/test/fuzzing/fonts/3511ff5c1647150595846ac414c595cccac34f18
2021-10-16 06:57:24,715 WARNING: Found binary at buildscripts/deps/harfbuzz/test/fuzzing/fonts/clusterfuzz-testcase-minimized-hb-shape-fuzzer-5658272078495744
2021-10-16 06:57:24,715 WARNING: Found binary at buildscripts/deps/harfbuzz/test/fuzzing/fonts/clusterfuzz-testcase-minimized-hb-fuzzer-4884742786777088
2021-10-16 06:57:24,715 WARNING: Found binary at buildscripts/deps/harfbuzz/test/fuzzing/fonts/clusterfuzz-testcase-minimized-hb-draw-fuzzer-5668491560747008
2021-10-16 06:57:24,716 WARNING: Found binary at buildscripts/deps/harfbuzz/test/fuzzing/fonts/clusterfuzz-testcase-hb-shape-fuzzer-5728971283496960
2021-10-16 06:57:24,716 WARNING: Found binary at buildscripts/deps/harfbuzz/test/fuzzing/fonts/fuzz-3-harfbuzz_fuzzer(2)
2021-10-16 06:57:24,716 WARNING: Found binary at buildscripts/deps/harfbuzz/test/fuzzing/fonts/clusterfuzz-testcase-hb-subset-fuzzer-5717414645334016
2021-10-16 06:57:24,716 WARNING: Found binary at buildscripts/deps/harfbuzz/test/fuzzing/fonts/clusterfuzz-testcase-minimized-hb-subset-fuzzer-5121706490593280
2021-10-16 06:57:24,716 WARNING: Found binary at buildscripts/deps/harfbuzz/test/fuzzing/fonts/clusterfuzz-testcase-minimized-hb-subset-fuzzer-5758598970343424
2021-10-16 06:57:24,716 WARNING: Found binary at buildscripts/deps/harfbuzz/test/fuzzing/fonts/43979b90b2dd929723cf4fe1715990bcb9c9a56b
2021-10-16 06:57:24,717 WARNING: Found binary at buildscripts/deps/harfbuzz/test/fuzzing/fonts/clusterfuzz-testcase-minimized-hb-subset-fuzzer-5670861909524480
2021-10-16 06:57:24,717 WARNING: Found binary at buildscripts/deps/harfbuzz/test/fuzzing/fonts/clusterfuzz-testcase-minimized-hb-fuzzer-5216838347653120
2021-10-16 06:57:24,717 WARNING: Found binary at buildscripts/deps/harfbuzz/test/fuzzing/fonts/clusterfuzz-testcase-minimized-hb-shape-fuzzer-5674361600606208
2021-10-16 06:57:24,717 WARNING: Found binary at buildscripts/deps/harfbuzz/test/fuzzing/fonts/clusterfuzz-testcase-minimized-hb-shape-fuzzer-5634443633491968
2021-10-16 06:57:24,717 WARNING: Found binary at buildscripts/deps/harfbuzz/test/fuzzing/fonts/clusterfuzz-testcase-minimized-hb-subset-fuzzer-4880059756969984
2021-10-16 06:57:24,717 WARNING: Found binary at buildscripts/deps/harfbuzz/test/fuzzing/fonts/clusterfuzz-testcase-minimized-hb-subset-fuzzer-5711951464759296
2021-10-16 06:57:24,718 WARNING: Found binary at buildscripts/deps/harfbuzz/test/fuzzing/fonts/clusterfuzz-testcase-minimized-hb-subset-fuzzer-5640889218629632
2021-10-16 06:57:24,718 WARNING: Found binary at buildscripts/deps/harfbuzz/test/fuzzing/fonts/clusterfuzz-testcase-minimized-harfbuzz_fuzzer-5017946948370432
2021-10-16 06:57:24,718 WARNING: Found binary at buildscripts/deps/harfbuzz/test/fuzzing/fonts/clusterfuzz-testcase-minimized-hb-subset-fuzzer-5858518134554624
2021-10-16 06:57:24,718 WARNING: Found binary at buildscripts/deps/harfbuzz/test/fuzzing/fonts/clusterfuzz-testcase-minimized-hb-subset-fuzzer-5759725666041856
2021-10-16 06:57:24,718 WARNING: Found binary at buildscripts/deps/harfbuzz/test/fuzzing/fonts/clusterfuzz-testcase-minimized-hb_shape_fuzzer-5633785895911424
2021-10-16 06:57:24,718 WARNING: Found binary at buildscripts/deps/harfbuzz/test/fuzzing/fonts/clusterfuzz-testcase-minimized-harfbuzz_fuzzer-6462232674959360
2021-10-16 06:57:24,719 WARNING: Found binary at buildscripts/deps/harfbuzz/test/fuzzing/fonts/clusterfuzz-testcase-minimized-hb-subset-fuzzer-5229304507138048
2021-10-16 06:57:24,719 WARNING: Found binary at buildscripts/deps/harfbuzz/test/fuzzing/fonts/clusterfuzz-testcase-minimized-hb-fuzzer-5720051798769664
2021-10-16 06:57:24,719 WARNING: Found binary at buildscripts/deps/harfbuzz/test/fuzzing/fonts/clusterfuzz-testcase-hb-shape-fuzzer-5746142327865344
2021-10-16 06:57:24,719 WARNING: Found binary at buildscripts/deps/harfbuzz/test/fuzzing/fonts/clusterfuzz-testcase-minimized-hb-subset-fuzzer-5750420593442816
2021-10-16 06:57:24,719 WARNING: Found binary at buildscripts/deps/harfbuzz/test/fuzzing/fonts/clusterfuzz-testcase-minimized-hb-subset-fuzzer-5359635656605696
2021-10-16 06:57:24,719 WARNING: Found binary at buildscripts/deps/harfbuzz/test/fuzzing/fonts/clusterfuzz-testcase-minimized-hb-subset-fuzzer-5677906231033856
2021-10-16 06:57:24,720 WARNING: Found binary at buildscripts/deps/harfbuzz/test/fuzzing/fonts/fuzz-2-harfbuzz_fuzzer(1)
2021-10-16 06:57:24,720 WARNING: Found binary at buildscripts/deps/harfbuzz/test/fuzzing/fonts/clusterfuzz-testcase-minimized-hb-subset-fuzzer-5965777994907648
2021-10-16 06:57:24,720 WARNING: Found binary at buildscripts/deps/harfbuzz/test/fuzzing/fonts/clusterfuzz-testcase-minimized-harfbuzz_fuzzer-5702671124791296
2021-10-16 06:57:24,720 WARNING: Found binary at buildscripts/deps/harfbuzz/test/fuzzing/fonts/clusterfuzz-testcase-hb-shape-fuzzer-5644258942386176
2021-10-16 06:57:24,720 WARNING: Found binary at buildscripts/deps/harfbuzz/test/fuzzing/fonts/clusterfuzz-testcase-minimized-harfbuzz_fuzzer-5012913062150144
2021-10-16 06:57:24,720 WARNING: Found binary at buildscripts/deps/harfbuzz/test/fuzzing/fonts/clusterfuzz-testcase-hb-shape-fuzzer-5680362806575104
2021-10-16 06:57:24,720 WARNING: Found binary at buildscripts/deps/harfbuzz/test/fuzzing/fonts/clusterfuzz-testcase-minimized-harfbuzz_fuzzer-6120104833843200
2021-10-16 06:57:24,721 WARNING: Found binary at buildscripts/deps/harfbuzz/test/fuzzing/fonts/clusterfuzz-testcase-hb-fuzzer-4666056377368576
2021-10-16 06:57:24,721 WARNING: Found binary at buildscripts/deps/harfbuzz/test/fuzzing/fonts/clusterfuzz-testcase-minimized-hb-fuzzer-6160439919509504
2021-10-16 06:57:24,721 WARNING: Found binary at buildscripts/deps/harfbuzz/test/fuzzing/fonts/clusterfuzz-testcase-minimized-hb-fuzzer-6624904746106880
2021-10-16 06:57:24,721 WARNING: Found binary at buildscripts/deps/harfbuzz/test/fuzzing/fonts/clusterfuzz-testcase-minimized-hb-subset-fuzzer-5747028458209280
2021-10-16 06:57:24,721 WARNING: Found binary at buildscripts/deps/harfbuzz/test/fuzzing/fonts/a34a9191d9376bda419836effeef7e75c1386016
2021-10-16 06:57:24,721 WARNING: Found binary at buildscripts/deps/harfbuzz/test/fuzzing/fonts/clusterfuzz-testcase-minimized-hb-subset-fuzzer-5167653459329024
2021-10-16 06:57:24,722 WARNING: Found binary at buildscripts/deps/harfbuzz/test/fuzzing/fonts/clusterfuzz-testcase-minimized-harfbuzz_fuzzer-5126525414014976
2021-10-16 06:57:24,722 WARNING: Found binary at buildscripts/deps/harfbuzz/test/fuzzing/fonts/clusterfuzz-testcase-minimized-hb-shape-fuzzer-5740171484463104
2021-10-16 06:57:24,722 WARNING: Found binary at buildscripts/deps/harfbuzz/test/fuzzing/fonts/clusterfuzz-testcase-minimized-hb-shape-fuzzer-5672261407735808
2021-10-16 06:57:24,722 WARNING: Found binary at buildscripts/deps/harfbuzz/test/fuzzing/fonts/clusterfuzz-testcase-minimized-hb-shape-fuzzer-5742079188140032
2021-10-16 06:57:24,722 WARNING: Found binary at buildscripts/deps/harfbuzz/test/fuzzing/fonts/clusterfuzz-testcase-minimized-hb-fuzzer-4523479581851648
2021-10-16 06:57:24,722 WARNING: Found binary at buildscripts/deps/harfbuzz/test/fuzzing/fonts/clusterfuzz-testcase-minimized-hb-subset-fuzzer-5643107869917184
2021-10-16 06:57:24,723 WARNING: Found binary at buildscripts/deps/harfbuzz/test/fuzzing/fonts/clusterfuzz-testcase-minimized-hb-subset-get-codepoints-fuzzer-5973295416475648
2021-10-16 06:57:24,723 WARNING: Found binary at buildscripts/deps/harfbuzz/test/fuzzing/fonts/clusterfuzz-testcase-minimized-hb-subset-fuzzer-5708063625969664
2021-10-16 06:57:24,723 WARNING: Found binary at buildscripts/deps/harfbuzz/test/fuzzing/fonts/clusterfuzz-testcase-minimized-hb-subset-fuzzer-5696825891225600
2021-10-16 06:57:24,723 WARNING: Found binary at buildscripts/deps/harfbuzz/test/fuzzing/fonts/clusterfuzz-testcase-minimized-hb-subset-fuzzer-5250795600740352
2021-10-16 06:57:24,723 WARNING: Found binary at buildscripts/deps/harfbuzz/test/fuzzing/fonts/clusterfuzz-testcase-minimized-hb-fuzzer-6723367514144768
2021-10-16 06:57:24,723 WARNING: Found binary at buildscripts/deps/harfbuzz/test/fuzzing/fonts/clusterfuzz-testcase-minimized-hb-shape-fuzzer-5700264032468992
2021-10-16 06:57:24,723 WARNING: Found binary at buildscripts/deps/harfbuzz/test/fuzzing/fonts/0509e80afb379d16560e9e47bdd7d888bebdebc6
2021-10-16 06:57:24,724 WARNING: Found binary at buildscripts/deps/harfbuzz/test/fuzzing/fonts/clusterfuzz-testcase-minimized-hb-subset-get-codepoints-fuzzer-5687638085337088
2021-10-16 06:57:24,724 WARNING: Found binary at buildscripts/deps/harfbuzz/test/fuzzing/fonts/clusterfuzz-testcase-minimized-hb-shape-fuzzer-5735679418433536
2021-10-16 06:57:24,724 WARNING: Found binary at buildscripts/deps/harfbuzz/test/fuzzing/fonts/clusterfuzz-testcase-minimized-hb-subset-fuzzer-5739000398086144
2021-10-16 06:57:24,724 WARNING: Found binary at buildscripts/deps/harfbuzz/test/fuzzing/fonts/clusterfuzz-testcase-minimized-hb-subset-fuzzer-5137462782066688
2021-10-16 06:57:24,724 WARNING: Found binary at buildscripts/deps/harfbuzz/test/fuzzing/fonts/clusterfuzz-testcase-minimized-hb-subset-fuzzer-5641892164009984
2021-10-16 06:57:24,724 WARNING: Found binary at buildscripts/deps/harfbuzz/test/fuzzing/fonts/clusterfuzz-testcase-minimized-hb-subset-fuzzer-5747265633779712
2021-10-16 06:57:24,725 WARNING: Found binary at buildscripts/deps/harfbuzz/test/fuzzing/fonts/205edd09bd3d141cc9580f650109556cc28b22cb
2021-10-16 06:57:24,725 WARNING: Found binary at buildscripts/deps/harfbuzz/test/fuzzing/fonts/clusterfuzz-testcase-hb-subset-fuzzer-5756332481708032
2021-10-16 06:57:24,725 WARNING: Found binary at buildscripts/deps/harfbuzz/test/fuzzing/fonts/clusterfuzz-testcase-minimized-hb-subset-fuzzer-5609911946838016
2021-10-16 06:57:24,725 WARNING: Found binary at buildscripts/deps/harfbuzz/test/fuzzing/fonts/clusterfuzz-testcase-minimized-hb-subset-fuzzer-5206191479455744
2021-10-16 06:57:24,725 WARNING: Found binary at buildscripts/deps/harfbuzz/test/fuzzing/fonts/clusterfuzz-testcase-minimized-hb-shape-fuzzer-5762490181353472
2021-10-16 06:57:24,725 WARNING: Found binary at buildscripts/deps/harfbuzz/test/fuzzing/fonts/clusterfuzz-testcase-minimized-hb-fuzzer-5924299061854208
2021-10-16 06:57:24,726 WARNING: Found binary at buildscripts/deps/harfbuzz/test/fuzzing/fonts/clusterfuzz-testcase-minimized-hb-shape-fuzzer-5652700541222912
2021-10-16 06:57:24,726 WARNING: Found binary at buildscripts/deps/harfbuzz/test/fuzzing/fonts/clusterfuzz-testcase-minimized-hb-subset-fuzzer-5715464591376384
2021-10-16 06:57:24,726 WARNING: Found binary at buildscripts/deps/harfbuzz/test/fuzzing/fonts/clusterfuzz-testcase-minimized-harfbuzz_fuzzer-6712347260092416
2021-10-16 06:57:24,726 WARNING: Found binary at buildscripts/deps/harfbuzz/test/fuzzing/fonts/clusterfuzz-testcase-hb-fuzzer-6696647723581440
2021-10-16 06:57:24,726 WARNING: Found binary at buildscripts/deps/harfbuzz/test/fuzzing/fonts/clusterfuzz-testcase-hb-subset-fuzzer-5686186874503168
2021-10-16 06:57:24,726 WARNING: Found binary at buildscripts/deps/harfbuzz/test/fuzzing/fonts/clusterfuzz-testcase-minimized-hb-subset-fuzzer-5148388450631680
2021-10-16 06:57:24,727 WARNING: Found binary at buildscripts/deps/harfbuzz/test/fuzzing/fonts/clusterfuzz-testcase-minimized-hb-subset-fuzzer-5697351339999232
2021-10-16 06:57:24,727 WARNING: Found binary at buildscripts/deps/harfbuzz/test/fuzzing/fonts/e88c339237f52d21e01c55f01b9c1b4cc14a0467
2021-10-16 06:57:24,727 WARNING: Found binary at buildscripts/deps/harfbuzz/test/fuzzing/fonts/clusterfuzz-testcase-minimized-hb-subset-get-codepoints-fuzzer-5630904853069824
2021-10-16 06:57:24,727 WARNING: Found binary at buildscripts/deps/harfbuzz/test/fuzzing/fonts/clusterfuzz-testcase-minimized-hb-subset-fuzzer-5684014636859392
2021-10-16 06:57:24,727 WARNING: Found binary at buildscripts/deps/harfbuzz/test/fuzzing/fonts/clusterfuzz-testcase-minimized-hb-subset-fuzzer-5542653037903872
2021-10-16 06:57:24,727 WARNING: Found binary at buildscripts/deps/harfbuzz/test/fuzzing/fonts/clusterfuzz-testcase-minimized-harfbuzz_fuzzer-6600932143136768
2021-10-16 06:57:24,727 WARNING: Found binary at buildscripts/deps/harfbuzz/test/fuzzing/fonts/558661aa659912f4d30ecd27bd09835171a8e2b0
2021-10-16 06:57:24,728 WARNING: Found binary at buildscripts/deps/harfbuzz/test/fuzzing/fonts/clusterfuzz-testcase-minimized-hb-fuzzer-4687441845813248
2021-10-16 06:57:24,728 WARNING: Found binary at buildscripts/deps/harfbuzz/test/fuzzing/fonts/clusterfuzz-testcase-minimized-hb-subset-fuzzer-5733203291144192
2021-10-16 06:57:24,728 WARNING: Found binary at buildscripts/deps/harfbuzz/test/fuzzing/fonts/clusterfuzz-testcase-minimized-hb-shape-fuzzer-5733166795456512
2021-10-16 06:57:24,728 WARNING: Found binary at buildscripts/deps/harfbuzz/test/fuzzing/fonts/clusterfuzz-testcase-minimized-hb-subset-fuzzer-5764020596899840
2021-10-16 06:57:24,728 WARNING: Found binary at buildscripts/deps/harfbuzz/test/fuzzing/fonts/clusterfuzz-testcase-hb-fuzzer-6303297511096320
2021-10-16 06:57:24,728 WARNING: Found binary at buildscripts/deps/harfbuzz/test/fuzzing/fonts/clusterfuzz-testcase-minimized-hb-subset-fuzzer-5001604901240832
2021-10-16 06:57:24,729 WARNING: Found binary at buildscripts/deps/harfbuzz/test/fuzzing/fonts/clusterfuzz-testcase-minimized-harfbuzz_fuzzer-5748102301614080
2021-10-16 06:57:24,729 WARNING: Found binary at buildscripts/deps/harfbuzz/test/fuzzing/fonts/clusterfuzz-testcase-minimized-hb-fuzzer-5517117891805184
2021-10-16 06:57:24,729 WARNING: Found binary at buildscripts/deps/harfbuzz/test/fuzzing/fonts/clusterfuzz-testcase-minimized-hb-fuzzer-5713868010553344
2021-10-16 06:57:24,729 WARNING: Found binary at buildscripts/deps/harfbuzz/test/fuzzing/fonts/clusterfuzz-testcase-minimized-harfbuzz_fuzzer-4850271066914816
2021-10-16 06:57:24,729 WARNING: Found binary at buildscripts/deps/harfbuzz/test/fuzzing/fonts/clusterfuzz-testcase-minimized-hb-shape-fuzzer-5749627240841216
2021-10-16 06:57:24,729 WARNING: Found binary at buildscripts/deps/harfbuzz/test/fuzzing/fonts/clusterfuzz-testcase-minimized-hb-shape-fuzzer-5630246225707008
2021-10-16 06:57:24,730 WARNING: Found binary at buildscripts/deps/harfbuzz/test/fuzzing/fonts/clusterfuzz-testcase-harfbuzz_fuzzer-5598263003840512
2021-10-16 06:57:24,730 WARNING: Found binary at buildscripts/deps/harfbuzz/test/fuzzing/fonts/fuzz-0-harfbuzz_hb-fuzzer
2021-10-16 06:57:24,730 WARNING: Found binary at buildscripts/deps/harfbuzz/test/fuzzing/fonts/clusterfuzz-testcase-minimized-hb-subset-fuzzer-5642531954229248
2021-10-16 06:57:24,730 WARNING: Found binary at buildscripts/deps/harfbuzz/test/fuzzing/fonts/clusterfuzz-testcase-minimized-hb-subset-get-codepoints-fuzzer-5930139383758848
2021-10-16 06:57:24,730 WARNING: Found binary at buildscripts/deps/harfbuzz/test/fuzzing/fonts/clusterfuzz-testcase-minimized-hb-subset-fuzzer-5690658895953920
2021-10-16 06:57:24,730 WARNING: Found binary at buildscripts/deps/harfbuzz/test/fuzzing/fonts/clusterfuzz-testcase-minimized-hb-shape-fuzzer-5754863779053568
2021-10-16 06:57:24,731 WARNING: Found binary at buildscripts/deps/harfbuzz/test/fuzzing/fonts/clusterfuzz-testcase-minimized-hb-subset-fuzzer-5521982557782016
2021-10-16 06:57:24,731 WARNING: Found binary at buildscripts/deps/harfbuzz/test/fuzzing/fonts/clusterfuzz-testcase-minimized-6460279560863744
2021-10-16 06:57:24,731 WARNING: Found binary at buildscripts/deps/harfbuzz/test/fuzzing/fonts/clusterfuzz-testcase-minimized-hb-subset-fuzzer-5077547978588160
2021-10-16 06:57:24,731 WARNING: Found binary at buildscripts/deps/harfbuzz/test/fuzzing/fonts/clusterfuzz-testcase-minimized-hb-shape-fuzzer-5649959857160192
2021-10-16 06:57:24,731 WARNING: Found binary at buildscripts/deps/harfbuzz/test/fuzzing/fonts/clusterfuzz-testcase-minimized-hb-shape-fuzzer-5154718402215936
2021-10-16 06:57:24,731 WARNING: Found binary at buildscripts/deps/harfbuzz/test/fuzzing/fonts/clusterfuzz-testcase-minimized-hb-shape-fuzzer-5686369209286656
2021-10-16 06:57:24,732 WARNING: Found binary at buildscripts/deps/harfbuzz/test/fuzzing/fonts/clusterfuzz-testcase-minimized-harfbuzz_fuzzer-6198448785981440
2021-10-16 06:57:24,732 WARNING: Found binary at buildscripts/deps/harfbuzz/test/fuzzing/fonts/clusterfuzz-testcase-minimized-hb-shape-fuzzer-5632586529898496
2021-10-16 06:57:24,732 WARNING: Found binary at buildscripts/deps/harfbuzz/test/fuzzing/fonts/clusterfuzz-testcase-minimized-hb-shape-fuzzer-5725855502827520
2021-10-16 06:57:24,732 WARNING: Found binary at buildscripts/deps/harfbuzz/test/fuzzing/fonts/375d6ae32a3cbe52fbf81a4e5777e3377675d5a3
2021-10-16 06:57:24,732 WARNING: Found binary at buildscripts/deps/harfbuzz/test/fuzzing/fonts/clusterfuzz-testcase-minimized-hb-shape-fuzzer-6306977171374080
2021-10-16 06:57:24,732 WARNING: Found binary at buildscripts/deps/harfbuzz/test/fuzzing/fonts/clusterfuzz-testcase-minimized-harfbuzz_fuzzer-5170405903695872
2021-10-16 06:57:24,732 WARNING: Found binary at buildscripts/deps/harfbuzz/test/fuzzing/fonts/clusterfuzz-testcase-minimized-hb-subset-fuzzer-5708764082864128
2021-10-16 06:57:24,733 WARNING: Found binary at buildscripts/deps/harfbuzz/test/fuzzing/fonts/clusterfuzz-testcase-minimized-hb-subset-fuzzer-5669437462544384
2021-10-16 06:57:24,733 WARNING: Found binary at buildscripts/deps/harfbuzz/test/fuzzing/fonts/clusterfuzz-testcase-minimized-hb-subset-fuzzer-5719588814979072
2021-10-16 06:57:24,733 WARNING: Found binary at buildscripts/deps/harfbuzz/test/fuzzing/fonts/clusterfuzz-testcase-minimized-hb-subset-fuzzer-5676773460672512
2021-10-16 06:57:24,733 WARNING: Found binary at buildscripts/deps/harfbuzz/test/fuzzing/fonts/clusterfuzz-testcase-minimized-harfbuzz_fuzzer-5221177988743168
2021-10-16 06:57:24,733 WARNING: Found binary at buildscripts/deps/harfbuzz/test/fuzzing/fonts/fuzz-3-harfbuzz_fuzzer(4)
2021-10-16 06:57:24,733 WARNING: Found binary at buildscripts/deps/harfbuzz/test/fuzzing/fonts/clusterfuzz-testcase-minimized-hb-subset-fuzzer-5659903036751872
2021-10-16 06:57:24,734 WARNING: Found binary at buildscripts/deps/harfbuzz/test/fuzzing/fonts/clusterfuzz-testcase-minimized-hb-subset-get-codepoints-fuzzer-5203067375976448
2021-10-16 06:57:24,734 WARNING: Found binary at buildscripts/deps/harfbuzz/test/fuzzing/fonts/clusterfuzz-testcase-5517117891805184
2021-10-16 06:57:24,734 WARNING: Found binary at buildscripts/deps/harfbuzz/test/fuzzing/fonts/clusterfuzz-testcase-minimized-hb-subset-fuzzer-5169035432165376
2021-10-16 06:57:24,734 WARNING: Found binary at buildscripts/deps/harfbuzz/test/fuzzing/fonts/clusterfuzz-testcase-minimized-hb-subset-fuzzer-5745268385906688
2021-10-16 06:57:24,734 WARNING: Found binary at buildscripts/deps/harfbuzz/test/fuzzing/fonts/8240789f6d12d4cfc4b5e8e6f246c3701bcf861f
2021-10-16 06:57:24,734 WARNING: Found binary at buildscripts/deps/harfbuzz/test/fuzzing/fonts/clusterfuzz-testcase-minimized-hb-fuzzer-4548492505645056
2021-10-16 06:57:24,734 WARNING: Found binary at buildscripts/deps/harfbuzz/test/fuzzing/fonts/clusterfuzz-testcase-minimized-hb-subset-fuzzer-5715299773186048
2021-10-16 06:57:24,735 WARNING: Found binary at buildscripts/deps/harfbuzz/test/fuzzing/fonts/clusterfuzz-testcase-minimized-hb-shape-fuzzer-5635082459545600
2021-10-16 06:57:24,735 WARNING: Found binary at buildscripts/deps/harfbuzz/test/fuzzing/fonts/clusterfuzz-testcase-minimized-hb-shape-fuzzer-5666162551029760
2021-10-16 06:57:24,735 WARNING: Found binary at buildscripts/deps/harfbuzz/test/fuzzing/fonts/clusterfuzz-testcase-minimized-harfbuzz_fuzzer-5677289226108928
2021-10-16 06:57:24,735 WARNING: Found binary at buildscripts/deps/harfbuzz/test/fuzzing/fonts/fuzz-3-harfbuzz_fuzzer(1)
2021-10-16 06:57:24,735 WARNING: Found binary at buildscripts/deps/harfbuzz/test/fuzzing/fonts/clusterfuzz-testcase-hb-fuzzer-6243458541944832
2021-10-16 06:57:24,735 WARNING: Found binary at buildscripts/deps/harfbuzz/test/fuzzing/fonts/clusterfuzz-testcase-harfbuzz_fuzzer-6327734241591296
2021-10-16 06:57:24,735 WARNING: Found binary at buildscripts/deps/harfbuzz/test/fuzzing/fonts/clusterfuzz-testcase-minimized-hb-subset-fuzzer-5689082504806400
2021-10-16 06:57:24,736 WARNING: Found binary at buildscripts/deps/harfbuzz/test/fuzzing/fonts/clusterfuzz-testcase-minimized-hb-subset-fuzzer-5041767803125760
2021-10-16 06:57:24,736 WARNING: Found binary at buildscripts/deps/harfbuzz/test/fuzzing/fonts/clusterfuzz-testcase-minimized-hb-subset-fuzzer-5761434614497280
2021-10-16 06:57:24,736 WARNING: Found binary at buildscripts/deps/harfbuzz/test/fuzzing/fonts/clusterfuzz-testcase-minimized-hb-shape-fuzzer-5659641787187200
2021-10-16 06:57:24,736 WARNING: Found binary at buildscripts/deps/harfbuzz/test/fuzzing/fonts/clusterfuzz-testcase-minimized-hb-shape-fuzzer-5769590820044800
2021-10-16 06:57:24,736 WARNING: Found binary at buildscripts/deps/harfbuzz/test/fuzzing/fonts/clusterfuzz-testcase-minimized-hb-subset-fuzzer-5991762219892736
2021-10-16 06:57:24,736 WARNING: Found binary at buildscripts/deps/harfbuzz/test/fuzzing/fonts/clusterfuzz-testcase-minimized-hb-subset-fuzzer-5685097303375872
2021-10-16 06:57:24,736 WARNING: Found binary at buildscripts/deps/harfbuzz/test/fuzzing/fonts/clusterfuzz-testcase-minimized-harfbuzz_fuzzer-5157039562162176
2021-10-16 06:57:24,737 WARNING: Found binary at buildscripts/deps/harfbuzz/test/fuzzing/fonts/clusterfuzz-testcase-minimized-hb-subset-get-codepoints-fuzzer-6394290358976512
2021-10-16 06:57:24,737 WARNING: Found binary at buildscripts/deps/harfbuzz/test/fuzzing/fonts/clusterfuzz-testcase-minimized-hb-subset-fuzzer-5711849555755008
2021-10-16 06:57:24,737 WARNING: Found binary at buildscripts/deps/harfbuzz/test/fuzzing/fonts/clusterfuzz-testcase-minimized-hb-subset-fuzzer-5738978499624960
2021-10-16 06:57:24,737 WARNING: Found binary at buildscripts/deps/harfbuzz/test/fuzzing/fonts/clusterfuzz-testcase-minimized-hb-shape-fuzzer-5696686572175360
2021-10-16 06:57:24,737 WARNING: Found binary at buildscripts/deps/harfbuzz/test/fuzzing/fonts/clusterfuzz-testcase-minimized-hb-subset-fuzzer-5695279609675776
2021-10-16 06:57:24,737 WARNING: Found binary at buildscripts/deps/harfbuzz/test/fuzzing/fonts/clusterfuzz-testcase-minimized-hb-draw-fuzzer-5750654771658752
2021-10-16 06:57:24,738 WARNING: Found binary at buildscripts/deps/harfbuzz/test/fuzzing/fonts/clusterfuzz-testcase-minimized-hb-fuzzer-5294584596791296
2021-10-16 06:57:24,738 WARNING: Found binary at buildscripts/deps/harfbuzz/test/fuzzing/fonts/clusterfuzz-testcase-minimized-hb-subset-fuzzer-5707809174585344
2021-10-16 06:57:24,738 WARNING: Found binary at buildscripts/deps/harfbuzz/test/fuzzing/fonts/clusterfuzz-testcase-minimized-hb-subset-fuzzer-5764268627066880
2021-10-16 06:57:24,738 WARNING: Found binary at buildscripts/deps/harfbuzz/test/fuzzing/fonts/clusterfuzz-testcase-minimized-hb-fuzzer-5255344882188288
2021-10-16 06:57:24,738 WARNING: Found binary at buildscripts/deps/harfbuzz/test/fuzzing/fonts/clusterfuzz-testcase-minimized-harfbuzz_fuzzer-4601449528688640
2021-10-16 06:57:24,738 WARNING: Found binary at buildscripts/deps/harfbuzz/test/fuzzing/fonts/clusterfuzz-testcase-minimized-hb-shape-fuzzer-5685596677210112
2021-10-16 06:57:24,739 WARNING: Found binary at buildscripts/deps/harfbuzz/test/fuzzing/fonts/clusterfuzz-testcase-minimized-harfbuzz_fuzzer-5659690013556736
2021-10-16 06:57:24,739 WARNING: Found binary at buildscripts/deps/harfbuzz/test/fuzzing/fonts/clusterfuzz-testcase-minimized-hb-subset-fuzzer-5522792714993664
2021-10-16 06:57:24,739 WARNING: Found binary at buildscripts/deps/harfbuzz/test/fuzzing/fonts/clusterfuzz-testcase-minimized-harfbuzz_fuzzer-5334300410773504
2021-10-16 06:57:24,739 WARNING: Found binary at buildscripts/deps/harfbuzz/test/fuzzing/fonts/clusterfuzz-testcase-minimized-hb-fuzzer-6264625609834496
2021-10-16 06:57:24,739 WARNING: Found binary at buildscripts/deps/harfbuzz/test/fuzzing/fonts/clusterfuzz-testcase-minimized-hb-shape-fuzzer-5768601332613120
2021-10-16 06:57:24,739 WARNING: Found binary at buildscripts/deps/harfbuzz/test/fuzzing/fonts/clusterfuzz-testcase-minimized-harfbuzz_fuzzer-6142466903506944
2021-10-16 06:57:24,739 WARNING: Found binary at buildscripts/deps/harfbuzz/test/fuzzing/fonts/clusterfuzz-testcase-minimized-harfbuzz_fuzzer-5740518101090304
2021-10-16 06:57:24,740 WARNING: Found binary at buildscripts/deps/harfbuzz/test/fuzzing/fonts/clusterfuzz-testcase-minimized-hb-subset-fuzzer-5695925913911296
2021-10-16 06:57:24,740 WARNING: Found binary at buildscripts/deps/harfbuzz/test/fuzzing/fonts/b9e2aaa0d75fcef6971ec3a96d806ba4a6b31fe2
2021-10-16 06:57:24,740 WARNING: Found binary at buildscripts/deps/harfbuzz/test/fuzzing/fonts/clusterfuzz-testcase-minimized-hb-shape-fuzzer-5633985665826816
2021-10-16 06:57:24,740 WARNING: Found binary at buildscripts/deps/harfbuzz/test/fuzzing/fonts/clusterfuzz-testcase-minimized-hb-shape-fuzzer-5706010589659136
2021-10-16 06:57:24,740 WARNING: Found binary at buildscripts/deps/harfbuzz/test/fuzzing/fonts/fab39d60d758cb586db5a504f218442cd1395725
2021-10-16 06:57:24,740 WARNING: Found binary at buildscripts/deps/harfbuzz/test/fuzzing/fonts/clusterfuzz-testcase-minimized-hb-shape-fuzzer-5738888765636608
2021-10-16 06:57:24,741 WARNING: Found binary at buildscripts/deps/harfbuzz/test/fuzzing/fonts/clusterfuzz-testcase-minimized-hb-shape-fuzzer-5711472756260864
2021-10-16 06:57:24,741 WARNING: Found binary at buildscripts/deps/harfbuzz/test/fuzzing/fonts/clusterfuzz-testcase-minimized-hb-draw-fuzzer-6231698648596480
2021-10-16 06:57:24,741 WARNING: Found binary at buildscripts/deps/harfbuzz/test/fuzzing/fonts/clusterfuzz-testcase-minimized-5255344882188288
2021-10-16 06:57:24,741 WARNING: Found binary at buildscripts/deps/harfbuzz/test/fuzzing/fonts/clusterfuzz-testcase-minimized-hb-subset-fuzzer-6246465148813312
2021-10-16 06:57:24,741 WARNING: Found binary at buildscripts/deps/harfbuzz/test/fuzzing/fonts/clusterfuzz-testcase-minimized-hb-subset-fuzzer-5417934246772736
2021-10-16 06:57:24,741 WARNING: Found binary at buildscripts/deps/harfbuzz/test/fuzzing/fonts/clusterfuzz-testcase-minimized-hb-shape-fuzzer-5656511058018304
2021-10-16 06:57:24,742 WARNING: Found binary at buildscripts/deps/harfbuzz/test/fuzzing/fonts/clusterfuzz-testcase-harfbuzz_fuzzer-4822416500195328
2021-10-16 06:57:24,742 WARNING: Found binary at buildscripts/deps/harfbuzz/test/fuzzing/fonts/crash-b577db318b30f2851828a4c9ef97cb30678b1b54
2021-10-16 06:57:24,742 WARNING: Found binary at buildscripts/deps/harfbuzz/test/fuzzing/fonts/clusterfuzz-testcase-minimized-hb-subset-fuzzer-5741735372914688
2021-10-16 06:57:24,742 WARNING: Found binary at buildscripts/deps/harfbuzz/test/fuzzing/fonts/clusterfuzz-testcase-minimized-4884742786777088
2021-10-16 06:57:24,742 WARNING: Found binary at buildscripts/deps/harfbuzz/test/fuzzing/fonts/clusterfuzz-testcase-minimized-hb-subset-fuzzer-5716947896893440
2021-10-16 06:57:24,742 WARNING: Found binary at buildscripts/deps/harfbuzz/test/fuzzing/fonts/clusterfuzz-testcase-minimized-hb-subset-fuzzer-6421315436281856
2021-10-16 06:57:24,743 WARNING: Found binary at buildscripts/deps/harfbuzz/test/fuzzing/fonts/clusterfuzz-testcase-minimized-hb-subset-fuzzer-4901143794810880
2021-10-16 06:57:24,743 WARNING: Found binary at buildscripts/deps/harfbuzz/test/fuzzing/fonts/clusterfuzz-testcase-minimized-harfbuzz_fuzzer-6223034666713088
2021-10-16 06:57:24,743 WARNING: Found binary at buildscripts/deps/harfbuzz/test/fuzzing/fonts/clusterfuzz-testcase-minimized-hb-subset-fuzzer-6231212713312256
2021-10-16 06:57:24,743 WARNING: Found binary at buildscripts/deps/harfbuzz/test/fuzzing/fonts/clusterfuzz-testcase-minimized-hb-shape-fuzzer-5667182741028864
2021-10-16 06:57:24,743 WARNING: Found binary at buildscripts/deps/harfbuzz/test/fuzzing/fonts/clusterfuzz-testcase-hb-shape-fuzzer-5634395566768128
2021-10-16 06:57:24,743 WARNING: Found binary at buildscripts/deps/harfbuzz/test/fuzzing/fonts/clusterfuzz-testcase-minimized-hb-draw-fuzzer-5703524300357632
2021-10-16 06:57:24,744 WARNING: Found binary at buildscripts/deps/harfbuzz/test/fuzzing/fonts/clusterfuzz-testcase-minimized-hb-subset-fuzzer-5363902507515904
2021-10-16 06:57:24,744 WARNING: Found binary at buildscripts/deps/harfbuzz/test/fuzzing/fonts/clusterfuzz-testcase-minimized-hb-subset-fuzzer-5641370503217152
2021-10-16 06:57:24,744 WARNING: Found binary at buildscripts/deps/harfbuzz/test/fuzzing/fonts/clusterfuzz-testcase-minimized-hb-subset-fuzzer-5750092395970560
2021-10-16 06:57:24,744 WARNING: Found binary at buildscripts/deps/harfbuzz/test/fuzzing/fonts/fuzz-2-harfbuzz_fuzzer
2021-10-16 06:57:24,744 WARNING: Found binary at buildscripts/deps/harfbuzz/test/fuzzing/fonts/clusterfuzz-testcase-minimized-hb-subset-fuzzer-5181909018345472
2021-10-16 06:57:24,744 WARNING: Found binary at buildscripts/deps/harfbuzz/test/fuzzing/fonts/clusterfuzz-testcase-minimized-hb-subset-fuzzer-5704307501694976
2021-10-16 06:57:24,744 WARNING: Found binary at buildscripts/deps/harfbuzz/test/fuzzing/fonts/clusterfuzz-testcase-minimized-hb-draw-fuzzer-5712313459146752
2021-10-16 06:57:24,745 WARNING: Found binary at buildscripts/deps/harfbuzz/test/fuzzing/fonts/fuzz-0-harfbuzz_fuzzer
2021-10-16 06:57:24,745 WARNING: Found binary at buildscripts/deps/harfbuzz/test/fuzzing/fonts/clusterfuzz-testcase-minimized-hb-subset-fuzzer-6276691949518848
2021-10-16 06:57:24,745 WARNING: Found binary at buildscripts/deps/harfbuzz/test/fuzzing/fonts/clusterfuzz-testcase-hb-subset-fuzzer-5641053680173056
2021-10-16 06:57:24,745 WARNING: Found binary at buildscripts/deps/harfbuzz/test/fuzzing/fonts/clusterfuzz-testcase-minimized-hb-subset-fuzzer-5728664968232960
2021-10-16 06:57:24,745 WARNING: Found binary at buildscripts/deps/harfbuzz/test/fuzzing/fonts/fuzz-1-harfbuzz_fuzzer
2021-10-16 06:57:24,746 WARNING: Found binary at buildscripts/deps/harfbuzz/test/fuzzing/fonts/clusterfuzz-testcase-minimized-hb-shape-fuzzer-5726089628876800
2021-10-16 06:57:24,746 WARNING: Found binary at buildscripts/deps/harfbuzz/test/fuzzing/fonts/clusterfuzz-testcase-minimized-hb-subset-fuzzer-5887968763052032
2021-10-16 06:57:24,746 WARNING: Found binary at buildscripts/deps/harfbuzz/test/fuzzing/fonts/clusterfuzz-testcase-minimized-hb-subset-fuzzer-5760768497156096
2021-10-16 06:57:24,746 WARNING: Found binary at buildscripts/deps/harfbuzz/test/fuzzing/fonts/clusterfuzz-testcase-hb-shape-fuzzer-5657878543728640
2021-10-16 06:57:24,746 WARNING: Found binary at buildscripts/deps/harfbuzz/test/fuzzing/fonts/oom-ccc61c92d589f895174cdef6ff2e3b20e9999a1a
2021-10-16 06:57:24,746 WARNING: Found binary at buildscripts/deps/harfbuzz/test/fuzzing/fonts/clusterfuzz-testcase-hb-shape-fuzzer-5638729035677696
2021-10-16 06:57:24,746 WARNING: Found binary at buildscripts/deps/harfbuzz/test/fuzzing/fonts/clusterfuzz-testcase-minimized-hb-shape-fuzzer-5729361857085440
2021-10-16 06:57:24,747 WARNING: Found binary at buildscripts/deps/harfbuzz/test/fuzzing/fonts/clusterfuzz-testcase-minimized-hb-subset-fuzzer-5634197349203968
2021-10-16 06:57:24,747 WARNING: Found binary at buildscripts/deps/harfbuzz/test/fuzzing/fonts/clusterfuzz-testcase-minimized-hb-fuzzer-4535496598355968
2021-10-16 06:57:24,747 WARNING: Found binary at buildscripts/deps/harfbuzz/test/fuzzing/fonts/clusterfuzz-testcase-minimized-hb-subset-fuzzer-5651059347816448
2021-10-16 06:57:24,747 WARNING: Found binary at buildscripts/deps/harfbuzz/test/fuzzing/fonts/clusterfuzz-testcase-minimized-hb-subset-fuzzer-5713850117914624
2021-10-16 06:57:24,747 WARNING: Found binary at buildscripts/deps/harfbuzz/test/fuzzing/fonts/clusterfuzz-testcase-minimized-hb-subset-fuzzer-5672913680728064
2021-10-16 06:57:24,747 WARNING: Found binary at buildscripts/deps/harfbuzz/test/fuzzing/fonts/clusterfuzz-testcase-minimized-hb-shape-fuzzer-5175735354916864
2021-10-16 06:57:24,748 WARNING: Found binary at buildscripts/deps/harfbuzz/test/fuzzing/fonts/clusterfuzz-testcase-minimized-hb-subset-fuzzer-5661567174311936
2021-10-16 06:57:24,748 WARNING: Found binary at buildscripts/deps/harfbuzz/test/fuzzing/fonts/clusterfuzz-testcase-minimized-hb-shape-fuzzer-5762953198960640
2021-10-16 06:57:24,748 WARNING: Found binary at buildscripts/deps/harfbuzz/test/fuzzing/fonts/clusterfuzz-testcase-minimized-hb-fuzzer-4706238090706944
2021-10-16 06:57:24,748 WARNING: Found binary at buildscripts/deps/harfbuzz/test/fuzzing/fonts/clusterfuzz-testcase-minimized-hb-shape-fuzzer-5734736291430400
2021-10-16 06:57:24,748 WARNING: Found binary at buildscripts/deps/harfbuzz/test/fuzzing/fonts/clusterfuzz-testcase-minimized-hb-shape-fuzzer-5712050577211392
2021-10-16 06:57:24,748 WARNING: Found binary at buildscripts/deps/harfbuzz/test/fuzzing/fonts/clusterfuzz-testcase-minimized-harfbuzz_fuzzer-5180622648770560
2021-10-16 06:57:24,749 WARNING: Found binary at buildscripts/deps/harfbuzz/test/fuzzing/fonts/clusterfuzz-testcase-minimized-hb-shape-fuzzer-5688420752424960
2021-10-16 06:57:24,749 WARNING: Found binary at buildscripts/deps/harfbuzz/test/fuzzing/fonts/clusterfuzz-testcase-minimized-hb-draw-fuzzer-5641612227772416
2021-10-16 06:57:24,749 WARNING: Found binary at buildscripts/deps/harfbuzz/test/fuzzing/fonts/clusterfuzz-testcase-minimized-hb-subset-fuzzer-5718215406125056
2021-10-16 06:57:24,749 WARNING: Found binary at buildscripts/deps/harfbuzz/test/fuzzing/fonts/clusterfuzz-testcase-minimized-hb-shape-fuzzer-5652019562414080
2021-10-16 06:57:24,749 WARNING: Found binary at buildscripts/deps/harfbuzz/test/fuzzing/fonts/clusterfuzz-testcase-minimized-hb-draw-fuzzer-5686960406659072
2021-10-16 06:57:24,749 WARNING: Found binary at buildscripts/deps/harfbuzz/test/fuzzing/fonts/clusterfuzz-testcase-minimized-harfbuzz_fuzzer-5093685255077888
2021-10-16 06:57:24,749 WARNING: Found binary at buildscripts/deps/harfbuzz/test/fuzzing/fonts/clusterfuzz-testcase-minimized-hb-subset-fuzzer-5640452927127552
2021-10-16 06:57:24,750 WARNING: Found binary at buildscripts/deps/harfbuzz/test/fuzzing/fonts/clusterfuzz-testcase-minimized-hb-fuzzer-5700697074958336
2021-10-16 06:57:24,750 WARNING: Found binary at buildscripts/deps/harfbuzz/test/fuzzing/fonts/clusterfuzz-testcase-minimized-hb-subset-fuzzer-5609112151916544
2021-10-16 06:57:24,750 WARNING: Found binary at buildscripts/deps/harfbuzz/test/fuzzing/fonts/clusterfuzz-testcase-hb-fuzzer-5662671558934528
2021-10-16 06:57:24,750 WARNING: Found binary at buildscripts/deps/harfbuzz/test/fuzzing/fonts/clusterfuzz-testcase-minimized-hb-fuzzer-6111685556305920
2021-10-16 06:57:24,750 WARNING: Found binary at buildscripts/deps/harfbuzz/test/fuzzing/fonts/clusterfuzz-testcase-minimized-hb-subset-fuzzer-5759783999635456
2021-10-16 06:57:24,750 WARNING: Found binary at buildscripts/deps/harfbuzz/test/fuzzing/fonts/clusterfuzz-testcase-hb-subset-fuzzer-5643036478930944
2021-10-16 06:57:24,751 WARNING: Found binary at buildscripts/deps/harfbuzz/test/fuzzing/fonts/clusterfuzz-testcase-minimized-hb-fuzzer-5617496443846656
2021-10-16 06:57:24,751 WARNING: Found binary at buildscripts/deps/harfbuzz/test/fuzzing/fonts/clusterfuzz-testcase-minimized-hb-subset-fuzzer-5743250149736448
2021-10-16 06:57:24,751 WARNING: Found binary at buildscripts/deps/harfbuzz/test/fuzzing/fonts/clusterfuzz-testcase-minimized-hb-fuzzer-5303930168803328
2021-10-16 06:57:24,751 WARNING: Found binary at buildscripts/deps/harfbuzz/test/fuzzing/fonts/clusterfuzz-testcase-minimized-hb-subset-fuzzer-5616763250278400
2021-10-16 06:57:24,751 WARNING: Found binary at buildscripts/deps/harfbuzz/test/fuzzing/fonts/crash-4b60576767ee4d9fe1cc10959d89baf73d4e8249
2021-10-16 06:57:24,751 WARNING: Found binary at buildscripts/deps/harfbuzz/test/fuzzing/fonts/clusterfuzz-testcase-minimized-hb-subset-fuzzer-5695865298092032
2021-10-16 06:57:24,752 WARNING: Found binary at buildscripts/deps/harfbuzz/test/fuzzing/fonts/fuzz-3-harfbuzz_fuzzer
2021-10-16 06:57:24,752 WARNING: Found binary at buildscripts/deps/harfbuzz/test/fuzzing/fonts/a69118c2c2ada48ff803d9149daa54c9ebdae30e
2021-10-16 06:57:24,752 WARNING: Found binary at buildscripts/deps/harfbuzz/test/fuzzing/fonts/clusterfuzz-testcase-minimized-hb-shape-fuzzer-5629524117553152
2021-10-16 06:57:24,752 WARNING: Found binary at buildscripts/deps/harfbuzz/test/fuzzing/fonts/clusterfuzz-testcase-minimized-hb-draw-fuzzer-5103082208493568
2021-10-16 06:57:24,752 WARNING: Found binary at buildscripts/deps/harfbuzz/test/fuzzing/fonts/clusterfuzz-testcase-minimized-harfbuzz_fuzzer-6128803416637440
2021-10-16 06:57:24,752 WARNING: Found binary at buildscripts/deps/harfbuzz/test/fuzzing/fonts/clusterfuzz-testcase-minimized-harfbuzz_fuzzer-5166320261529600
2021-10-16 06:57:24,752 WARNING: Found binary at buildscripts/deps/harfbuzz/test/fuzzing/fonts/clusterfuzz-testcase-minimized-hb-subset-fuzzer-5072358514753536
2021-10-16 06:57:24,753 WARNING: Found binary at buildscripts/deps/harfbuzz/test/fuzzing/fonts/clusterfuzz-testcase-minimized-hb-subset-fuzzer-5660711141769216
2021-10-16 06:57:24,753 WARNING: Found binary at buildscripts/deps/harfbuzz/test/fuzzing/fonts/clusterfuzz-testcase-minimized-hb-shape-fuzzer-5716208469409792
2021-10-16 06:57:24,753 WARNING: Found binary at buildscripts/deps/harfbuzz/test/fuzzing/fonts/clusterfuzz-testcase-minimized-harfbuzz_fuzzer-5973566991106048
2021-10-16 06:57:24,753 WARNING: Found binary at buildscripts/deps/harfbuzz/test/fuzzing/fonts/clusterfuzz-testcase-minimized-hb-subset-fuzzer-5696607199166464
2021-10-16 06:57:24,753 WARNING: Found binary at buildscripts/deps/harfbuzz/test/fuzzing/fonts/clusterfuzz-testcase-hb-subset-fuzzer-5686749313892352
2021-10-16 06:57:24,754 WARNING: Found binary at buildscripts/deps/harfbuzz/test/fuzzing/fonts/clusterfuzz-testcase-minimized-hb-subset-fuzzer-5763024094232576
2021-10-16 06:57:24,754 WARNING: Found binary at buildscripts/deps/harfbuzz/test/fuzzing/fonts/clusterfuzz-testcase-minimized-hb-subset-fuzzer-5667673584697344
2021-10-16 06:57:24,754 WARNING: Found binary at buildscripts/deps/harfbuzz/test/fuzzing/fonts/clusterfuzz-testcase-minimized-hb-shape-fuzzer-5719982789361664
2021-10-16 06:57:24,754 WARNING: Found binary at buildscripts/deps/harfbuzz/test/fuzzing/fonts/clusterfuzz-testcase-minimized-hb-fuzzer-5331901587914752
2021-10-16 06:57:24,754 WARNING: Found binary at buildscripts/deps/harfbuzz/test/fuzzing/fonts/clusterfuzz-testcase-minimized-hb-subset-fuzzer-6543700493598720
2021-10-16 06:57:24,754 WARNING: Found binary at buildscripts/deps/harfbuzz/test/fuzzing/fonts/clusterfuzz-testcase-minimized-harfbuzz_fuzzer-5644474732249088
2021-10-16 06:57:24,755 WARNING: Found binary at buildscripts/deps/harfbuzz/test/fuzzing/fonts/clusterfuzz-testcase-minimized-hb-draw-fuzzer-5681465586352128
2021-10-16 06:57:24,755 WARNING: Found binary at buildscripts/deps/harfbuzz/test/fuzzing/fonts/clusterfuzz-testcase-minimized-hb-subset-fuzzer-5662792105590784
2021-10-16 06:57:24,755 WARNING: Found binary at buildscripts/deps/harfbuzz/test/fuzzing/fonts/clusterfuzz-testcase-minimized-hb-shape-fuzzer-5196560812474368
2021-10-16 06:57:24,755 WARNING: Found binary at buildscripts/deps/harfbuzz/test/fuzzing/fonts/clusterfuzz-testcase-minimized-hb-subset-fuzzer-5650879734874112
2021-10-16 06:57:24,755 WARNING: Found binary at buildscripts/deps/harfbuzz/test/fuzzing/fonts/fuzz-3-harfbuzz_fuzzer(5)
2021-10-16 06:57:24,755 WARNING: Found binary at buildscripts/deps/harfbuzz/test/fuzzing/fonts/clusterfuzz-testcase-minimized-hb-subset-fuzzer-5753173985984512
2021-10-16 06:57:24,755 WARNING: Found binary at buildscripts/deps/harfbuzz/test/fuzzing/fonts/clusterfuzz-testcase-minimized-hb-subset-fuzzer-5345734743031808
2021-10-16 06:57:24,756 WARNING: Found binary at buildscripts/deps/harfbuzz/test/fuzzing/fonts/clusterfuzz-testcase-minimized-hb-shape-fuzzer-5642899625082880
2021-10-16 06:57:24,756 WARNING: Found binary at buildscripts/deps/harfbuzz/test/fuzzing/fonts/clusterfuzz-testcase-minimized-hb-subset-fuzzer-5735719311507456
2021-10-16 06:57:24,756 WARNING: Found binary at buildscripts/deps/harfbuzz/test/fuzzing/fonts/clusterfuzz-testcase-minimized-hb-draw-fuzzer-5088336521986048
2021-10-16 06:57:24,756 WARNING: Found binary at buildscripts/deps/harfbuzz/test/fuzzing/fonts/217a934cfe15c548b572c203dceb2befdf026462
2021-10-16 06:57:24,756 WARNING: Found binary at buildscripts/deps/harfbuzz/test/fuzzing/fonts/clusterfuzz-testcase-minimized-hb-subset-fuzzer-4681956043390976
2021-10-16 06:57:24,756 WARNING: Found binary at buildscripts/deps/harfbuzz/test/fuzzing/fonts/clusterfuzz-testcase-minimized-hb-fuzzer-4769173588672512
2021-10-16 06:57:24,757 WARNING: Found binary at buildscripts/deps/harfbuzz/test/fuzzing/fonts/clusterfuzz-testcase-minimized-hb-subset-fuzzer-5617065093365760
2021-10-16 06:57:24,757 WARNING: Found binary at buildscripts/deps/harfbuzz/test/fuzzing/fonts/clusterfuzz-testcase-minimized-hb-fuzzer-6260579246276608
2021-10-16 06:57:24,757 WARNING: Found binary at buildscripts/deps/harfbuzz/test/fuzzing/fonts/clusterfuzz-testcase-minimized-hb-shape-fuzzer-5061207689134080
2021-10-16 06:57:24,757 WARNING: Found binary at buildscripts/deps/harfbuzz/test/fuzzing/fonts/clusterfuzz-testcase-minimized-hb-shape-fuzzer-5718464350650368
2021-10-16 06:57:24,757 WARNING: Found binary at buildscripts/deps/harfbuzz/test/fuzzing/fonts/clusterfuzz-testcase-minimized-hb-shape-fuzzer-5736657639178240
2021-10-16 06:57:24,757 WARNING: Found binary at buildscripts/deps/harfbuzz/test/fuzzing/fonts/clusterfuzz-testcase-minimized-hb-subset-fuzzer-5675720390475776
2021-10-16 06:57:24,757 WARNING: Found binary at buildscripts/deps/harfbuzz/test/fuzzing/fonts/1a6f1687b7a221f9f2c834b0b360d3c8463b6daf
2021-10-16 06:57:24,758 WARNING: Found binary at buildscripts/deps/harfbuzz/test/fuzzing/fonts/clusterfuzz-testcase-minimized-harfbuzz_fuzzer-4710179695493120
2021-10-16 06:57:24,758 WARNING: Found binary at buildscripts/deps/harfbuzz/test/fuzzing/fonts/clusterfuzz-testcase-minimized-harfbuzz_fuzzer-5754958982021120
2021-10-16 06:57:24,758 WARNING: Found binary at buildscripts/deps/harfbuzz/test/fuzzing/fonts/oom-6ef8c96d3710262511bcc730dce9c00e722cb653
2021-10-16 06:57:24,758 WARNING: Found binary at buildscripts/deps/harfbuzz/test/fuzzing/fonts/clusterfuzz-testcase-minimized-hb-subset-fuzzer-6241118484955136
2021-10-16 06:57:24,758 WARNING: Found binary at buildscripts/deps/harfbuzz/test/fuzzing/fonts/clusterfuzz-testcase-minimized-harfbuzz_fuzzer-5151890782027776
2021-10-16 06:57:24,758 WARNING: Found binary at buildscripts/deps/harfbuzz/test/fuzzing/fonts/clusterfuzz-testcase-minimized-hb-shape-fuzzer-5725129603022848
2021-10-16 06:57:24,758 WARNING: Found binary at buildscripts/deps/harfbuzz/test/fuzzing/fonts/clusterfuzz-testcase-minimized-hb-shape-fuzzer-5718889451749376
2021-10-16 06:57:24,759 WARNING: Found binary at buildscripts/deps/harfbuzz/test/fuzzing/fonts/clusterfuzz-testcase-minimized-hb-fuzzer-4841745322868736
2021-10-16 06:57:24,759 WARNING: Found binary at buildscripts/deps/harfbuzz/test/fuzzing/fonts/clusterfuzz-testcase-minimized-hb-shape-fuzzer-5631444412530688
2021-10-16 06:57:24,759 WARNING: Found binary at buildscripts/deps/harfbuzz/test/fuzzing/fonts/clusterfuzz-testcase-minimized-hb-subset-fuzzer-5680398559870976
2021-10-16 06:57:24,759 WARNING: Found binary at buildscripts/deps/harfbuzz/test/fuzzing/fonts/clusterfuzz-testcase-minimized-hb-subset-fuzzer-5756658848890880
2021-10-16 06:57:24,759 WARNING: Found binary at buildscripts/deps/harfbuzz/test/fuzzing/fonts/clusterfuzz-testcase-minimized-hb-subset-fuzzer-5768186323009536
2021-10-16 06:57:24,759 WARNING: Found binary at buildscripts/deps/harfbuzz/test/fuzzing/fonts/641bd9db850193064d17575053ae2bf8ec149ddc
2021-10-16 06:57:25,156 INFO: Removing binary at buildscripts/deps/mbedtls/programs/fuzz/corpuses/server
2021-10-16 06:57:25,156 INFO: Removing binary at buildscripts/deps/mbedtls/programs/fuzz/corpuses/client
2021-10-16 06:57:25,156 INFO: Removing binary at buildscripts/deps/mbedtls/programs/fuzz/corpuses/dtlsserver
2021-10-16 06:57:25,156 INFO: Removing binary at buildscripts/deps/mbedtls/programs/fuzz/corpuses/dtlsclient
2021-10-16 06:57:25,178 INFO: Removing binary at buildscripts/deps/mbedtls/tests/data_files/hash_file_3
2021-10-16 06:57:25,178 INFO: Removing binary at buildscripts/deps/mbedtls/tests/data_files/hash_file_2
2021-10-16 06:57:25,181 INFO: Removing binary at buildscripts/deps/mbedtls/tests/data_files/hash_file_1
2021-10-16 06:57:25,287 INFO: Creating source tarball...
2021-10-16 06:57:46,048 INFO: Running 'build' commands in build/is.xyz.mpv/app
2021-10-16 06:57:46,049 DEBUG: Directory: build/is.xyz.mpv/app
2021-10-16 06:57:46,049 DEBUG: > bash -x -c cd ../buildscripts/ && ./buildall.sh --arch arm64 mpv && ./buildall.sh
+ cd ../buildscripts/
+ ./buildall.sh --arch arm64 mpv
Building mpv...
Dependencies: ffmpeg libass lua
Building ffmpeg...
Dependencies: mbedtls dav1d
Building mbedtls...
Dependencies: 
~/build/is.xyz.mpv/buildscripts/deps/mbedtls ~/build/is.xyz.mpv/buildscripts
  CC    aes.c
  CC    aesni.c
  CC    arc4.c
  CC    aria.c
  CC    asn1parse.c
clang-12: error: no input files
clang-12: error: no input files
clang-12: error: no input files
Makefile:274: recipe for target 'aesni.o' failed
make[1]: *** [aesni.o] Error 1
make[1]: *** Waiting for unfinished jobs....
clang-12: error: no input files
clang-12: error: no input files
Makefile:274: recipe for target 'aes.o' failed
make[1]: *** [aes.o] Error 1
Makefile:274: recipe for target 'arc4.o' failed
make[1]: *** [arc4.o] Error 1
Makefile:274: recipe for target 'aria.o' failed
make[1]: *** [aria.o] Error 1
Makefile:274: recipe for target 'asn1parse.o' failed
make[1]: *** [asn1parse.o] Error 1
Makefile:17: recipe for target 'lib' failed
make: *** [lib] Error 2
make: *** Waiting for unfinished jobs....
  CC    src/helpers.c
  CC    src/asn1_helpers.c
  CC    src/psa_crypto_helpers.c
  CC    src/psa_exercise_key.c
  CC    src/threading_helpers.c
  CC    src/random.c
clang-12: error: no input files
clang-12: error: no input files
clang-12clang-12: : errorerror: : no input filesno input files

Makefile:96: recipe for target 'src/psa_exercise_key.o' failed
make[1]: *** [src/psa_exercise_key.o] Error 1
make[1]: *** Waiting for unfinished jobs....
Makefile:96: recipe for target 'src/threading_helpers.o' failed
make[1]: *** [src/threading_helpers.o] Error 1
Makefile:96: recipe for target 'src/helpers.o' failed
make[1]: *** [src/helpers.o] Error 1
Makefile:96: recipe for target 'src/asn1_helpers.o' failed
make[1]: *** [src/asn1_helpers.o] Error 1
clang-12: error: no input files
clang-12: error: no input files
Makefile:96: recipe for target 'src/psa_crypto_helpers.o' failed
make[1]: *** [src/psa_crypto_helpers.o] Error 1
Makefile:96: recipe for target 'src/random.o' failed
make[1]: *** [src/random.o] Error 1
Makefile:23: recipe for target 'mbedtls_test' failed
make: *** [mbedtls_test] Error 2
2021-10-16 06:57:46,356 ERROR: Could not build app is.xyz.mpv: Error running build command for is.xyz.mpv:2021-10-10-release
==== detail begin ====
+ cd ../buildscripts/
+ ./buildall.sh --arch arm64 mpv
Building mpv...
Dependencies: ffmpeg libass lua
Building ffmpeg...
Dependencies: mbedtls dav1d
Building mbedtls...
Dependencies: 
~/build/is.xyz.mpv/buildscripts/deps/mbedtls ~/build/is.xyz.mpv/buildscripts
  CC    aes.c
  CC    aesni.c
  CC    arc4.c
  CC    aria.c
  CC    asn1parse.c
clang-12: error: no input files
clang-12: error: no input files
clang-12: error: no input files
Makefile:274: recipe for target 'aesni.o' failed
make[1]: *** [aesni.o] Error 1
make[1]: *** Waiting for unfinished jobs....
clang-12: error: no input files
clang-12: error: no input files
Makefile:274: recipe for target 'aes.o' failed
make[1]: *** [aes.o] Error 1
Makefile:274: recipe for target 'arc4.o' failed
make[1]: *** [arc4.o] Error 1
Makefile:274: recipe for target 'aria.o' failed
make[1]: *** [aria.o] Error 1
Makefile:274: recipe for target 'asn1parse.o' failed
make[1]: *** [asn1parse.o] Error 1
Makefile:17: recipe for target 'lib' failed
make: *** [lib] Error 2
make: *** Waiting for unfinished jobs....
  CC    src/helpers.c
  CC    src/asn1_helpers.c
  CC    src/psa_crypto_helpers.c
  CC    src/psa_exercise_key.c
  CC    src/threading_helpers.c
  CC    src/random.c
clang-12: error: no input files
clang-12: error: no input files
clang-12clang-12: : errorerror: : no input filesno input files

Makefile:96: recipe for target 'src/psa_exercise_key.o' failed
make[1]: *** [src/psa_exercise_key.o] Error 1
make[1]: *** Waiting for unfinished jobs....
Makefile:96: recipe for target 'src/threading_helpers.o' failed
make[1]: *** [src/threading_helpers.o] Error 1
Makefile:96: recipe for target 'src/helpers.o' failed
make[1]: *** [src/helpers.o] Error 1
Makefile:96: recipe for target 'src/asn1_helpers.o' failed
make[1]: *** [src/asn1_helpers.o] Error 1
clang-12: error: no input files
clang-12: error: no input files
Makefile:96: recipe for target 'src/psa_crypto_helpers.o' failed
make[1]: *** [src/psa_crypto_helpers.o] Error 1
Makefile:96: recipe for target 'src/random.o' failed
make[1]: *** [src/random.o] Error 1
Makefile:23: recipe for target 'mbedtls_test' failed
make: *** [mbedtls_test] Error 2
==== detail end ====
2021-10-16 06:57:46,356 DEBUG: Error encoutered, stopping by user request.
==== detail end ====