log for net.opendasharchive.openarchive.release:20440

Traceback (most recent call last):
  File "/home/fbuild/fdroidserver/fdroidserver/build.py", line 1130, in main
    options.onserver, options.refresh):
  File "/home/fbuild/fdroidserver/fdroidserver/build.py", line 889, in trybuild
    build_server(app, build, vcs, build_dir, output_dir, log_dir, force)
  File "/home/fbuild/fdroidserver/fdroidserver/build.py", line 272, in build_server
    str(output, 'utf-8'))
fdroidserver.exception.BuildException: Build.py failed on server for net.opendasharchive.openarchive.release:0.2.4-RC-10
==== detail begin ====
== Installed Android Tools ==

2022-08-03 14:31:34,818 DEBUG: Reading 'config.yml'
2022-08-03 14:31:34,827 DEBUG: Local Android SDK only has outdated apksigner versions
2022-08-03 14:31:34,827 WARNING: apksigner not found! Cannot sign or verify modern APKs
2022-08-03 14:31:34,830 INFO: Creating log directory
2022-08-03 14:31:34,830 INFO: Creating temporary directory
2022-08-03 14:31:34,831 INFO: Creating output directory
2022-08-03 14:31:34,834 DEBUG: Getting git vcs interface for https://github.com/OpenArchive/Save-app-android
2022-08-03 14:31:34,834 DEBUG: > git --version
git version 2.11.0
2022-08-03 14:31:35,073 INFO: Using git version 2.11.0
2022-08-03 14:31:35,073 DEBUG: Checking 0.2.4-RC-10
2022-08-03 14:31:35,074 INFO: Building version 0.2.4-RC-10 (20440) of net.opendasharchive.openarchive.release
2022-08-03 14:31:35,074 INFO: Running 'sudo' commands in /home/vagrant
2022-08-03 14:31:35,074 DEBUG: > sudo DEBIAN_FRONTEND=noninteractive bash -x -c apt-get update || apt-get update && apt-get install -y openjdk-11-jdk-headless && update-alternatives --auto java
+ apt-get update
Ign:1 http://deb.debian.org/debian stretch InRelease
Hit:2 http://security.debian.org/debian-security stretch/updates InRelease
Hit:3 http://deb.debian.org/debian stretch-updates InRelease
Hit:4 http://deb.debian.org/debian stretch-backports-sloppy InRelease
Hit:5 http://deb.debian.org/debian stretch-backports InRelease
Hit:6 http://deb.debian.org/debian testing InRelease
Hit:7 http://deb.debian.org/debian stretch Release
Reading package lists...
+ apt-get install -y openjdk-11-jdk-headless
Reading package lists...
Building dependency tree...
Reading state information...
The following additional packages will be installed:
  libasound2 libasound2-data openjdk-11-jre-headless
Suggested packages:
  libasound2-plugins alsa-utils openjdk-11-demo openjdk-11-source libnss-mdns
  fonts-dejavu-extra fonts-ipafont-gothic fonts-ipafont-mincho
  fonts-wqy-microhei | fonts-wqy-zenhei fonts-indic
The following NEW packages will be installed:
  libasound2 libasound2-data openjdk-11-jdk-headless openjdk-11-jre-headless
0 upgraded, 4 newly installed, 0 to remove and 2 not upgraded.
Need to get 230 MB of archives.
After this operation, 374 MB of additional disk space will be used.
Get:1 http://deb.debian.org/debian stretch/main amd64 libasound2-data all 1.1.3-5 [173 kB]
Get:2 http://deb.debian.org/debian stretch/main amd64 libasound2 amd64 1.1.3-5 [497 kB]
Get:3 http://deb.debian.org/debian stretch-backports/main amd64 openjdk-11-jre-headless amd64 11.0.6+10-1~bpo9+1 [37.4 MB]
Get:4 http://deb.debian.org/debian stretch-backports/main amd64 openjdk-11-jdk-headless amd64 11.0.6+10-1~bpo9+1 [192 MB]
Fetched 230 MB in 6s (37.5 MB/s)
Selecting previously unselected package libasound2-data.
(Reading database ... 65038 files and directories currently installed.)
Preparing to unpack .../libasound2-data_1.1.3-5_all.deb ...
Unpacking libasound2-data (1.1.3-5) ...
Selecting previously unselected package libasound2:amd64.
Preparing to unpack .../libasound2_1.1.3-5_amd64.deb ...
Unpacking libasound2:amd64 (1.1.3-5) ...
Selecting previously unselected package openjdk-11-jre-headless:amd64.
Preparing to unpack .../openjdk-11-jre-headless_11.0.6+10-1~bpo9+1_amd64.deb ...
Unpacking openjdk-11-jre-headless:amd64 (11.0.6+10-1~bpo9+1) ...
Selecting previously unselected package openjdk-11-jdk-headless:amd64.
Preparing to unpack .../openjdk-11-jdk-headless_11.0.6+10-1~bpo9+1_amd64.deb ...
Unpacking openjdk-11-jdk-headless:amd64 (11.0.6+10-1~bpo9+1) ...
Setting up libasound2-data (1.1.3-5) ...
Setting up libasound2:amd64 (1.1.3-5) ...
Processing triggers for libc-bin (2.24-11+deb9u4) ...
Setting up openjdk-11-jre-headless:amd64 (11.0.6+10-1~bpo9+1) ...
Setting up openjdk-11-jdk-headless:amd64 (11.0.6+10-1~bpo9+1) ...
update-alternatives: using /usr/lib/jvm/java-11-openjdk-amd64/bin/jdeprscan to provide /usr/bin/jdeprscan (jdeprscan) in auto mode
update-alternatives: using /usr/lib/jvm/java-11-openjdk-amd64/bin/jimage to provide /usr/bin/jimage (jimage) in auto mode
update-alternatives: using /usr/lib/jvm/java-11-openjdk-amd64/bin/jlink to provide /usr/bin/jlink (jlink) in auto mode
update-alternatives: using /usr/lib/jvm/java-11-openjdk-amd64/bin/jmod to provide /usr/bin/jmod (jmod) in auto mode
update-alternatives: using /usr/lib/jvm/java-11-openjdk-amd64/bin/jshell to provide /usr/bin/jshell (jshell) in auto mode
update-alternatives: using /usr/lib/jvm/java-11-openjdk-amd64/bin/jaotc to provide /usr/bin/jaotc (jaotc) in auto mode
update-alternatives: using /usr/lib/jvm/java-11-openjdk-amd64/bin/jhsdb to provide /usr/bin/jhsdb (jhsdb) in auto mode
+ update-alternatives --auto java
update-alternatives: using /usr/lib/jvm/java-11-openjdk-amd64/bin/java to provide /usr/bin/java (java) in auto mode
2022-08-03 14:31:58,082 DEBUG: > sudo passwd --lock root
passwd: password expiry information changed.
2022-08-03 14:31:58,297 DEBUG: > sudo SUDO_FORCE_REMOVE=yes dpkg --purge sudo
(Reading database ... 65695 files and directories currently installed.)
Removing sudo (1.8.19p1-2.1+deb9u3) ...
Purging configuration files for sudo (1.8.19p1-2.1+deb9u3) ...
Processing triggers for systemd (232-25+deb9u14) ...
2022-08-03 14:32:03,626 INFO: Getting source for revision 04d069fbb133370e1bd152e47f130fd6deab2d59
2022-08-03 14:32:03,626 DEBUG: Directory: build/net.opendasharchive.openarchive.release
2022-08-03 14:32:03,626 DEBUG: > git rev-parse --show-toplevel
2022-08-03 14:32:03,833 DEBUG: Directory: build/net.opendasharchive.openarchive.release
2022-08-03 14:32:03,834 DEBUG: > git submodule foreach --recursive git reset --hard
2022-08-03 14:32:03,938 DEBUG: Directory: build/net.opendasharchive.openarchive.release
2022-08-03 14:32:03,938 DEBUG: > git reset --hard
2022-08-03 14:32:04,144 DEBUG: Directory: build/net.opendasharchive.openarchive.release
2022-08-03 14:32:04,144 DEBUG: > git submodule foreach --recursive git clean -dffx
2022-08-03 14:32:04,248 DEBUG: Directory: build/net.opendasharchive.openarchive.release
2022-08-03 14:32:04,248 DEBUG: > git clean -dffx
2022-08-03 14:32:04,353 DEBUG: Directory: build/net.opendasharchive.openarchive.release
2022-08-03 14:32:04,353 DEBUG: > git -c core.askpass=/bin/true -c core.sshCommand=/bin/false -c url.https://.insteadOf=ssh:// -c url.https://u:p@bitbucket.org/.insteadOf=git@bitbucket.org: -c url.https://u:p@bitbucket.org.insteadOf=git://bitbucket.org -c url.https://u:p@bitbucket.org.insteadOf=https://bitbucket.org -c url.https://u:p@github.com/.insteadOf=git@github.com: -c url.https://u:p@github.com.insteadOf=git://github.com -c url.https://u:p@github.com.insteadOf=https://github.com -c url.https://u:p@gitlab.com/.insteadOf=git@gitlab.com: -c url.https://u:p@gitlab.com.insteadOf=git://gitlab.com -c url.https://u:p@gitlab.com.insteadOf=https://gitlab.com fetch origin
2022-08-03 14:32:04,764 DEBUG: Directory: build/net.opendasharchive.openarchive.release
2022-08-03 14:32:04,764 DEBUG: > git -c core.askpass=/bin/true -c core.sshCommand=/bin/false -c url.https://.insteadOf=ssh:// -c url.https://u:p@bitbucket.org/.insteadOf=git@bitbucket.org: -c url.https://u:p@bitbucket.org.insteadOf=git://bitbucket.org -c url.https://u:p@bitbucket.org.insteadOf=https://bitbucket.org -c url.https://u:p@github.com/.insteadOf=git@github.com: -c url.https://u:p@github.com.insteadOf=git://github.com -c url.https://u:p@github.com.insteadOf=https://github.com -c url.https://u:p@gitlab.com/.insteadOf=git@gitlab.com: -c url.https://u:p@gitlab.com.insteadOf=git://gitlab.com -c url.https://u:p@gitlab.com.insteadOf=https://gitlab.com remote prune origin
2022-08-03 14:32:05,070 DEBUG: Directory: build/net.opendasharchive.openarchive.release
2022-08-03 14:32:05,071 DEBUG: > git -c core.askpass=/bin/true -c core.sshCommand=/bin/false -c url.https://.insteadOf=ssh:// -c url.https://u:p@bitbucket.org/.insteadOf=git@bitbucket.org: -c url.https://u:p@bitbucket.org.insteadOf=git://bitbucket.org -c url.https://u:p@bitbucket.org.insteadOf=https://bitbucket.org -c url.https://u:p@github.com/.insteadOf=git@github.com: -c url.https://u:p@github.com.insteadOf=git://github.com -c url.https://u:p@github.com.insteadOf=https://github.com -c url.https://u:p@gitlab.com/.insteadOf=git@gitlab.com: -c url.https://u:p@gitlab.com.insteadOf=git://gitlab.com -c url.https://u:p@gitlab.com.insteadOf=https://gitlab.com fetch --prune --tags --force origin
2022-08-03 14:32:05,487 DEBUG: Directory: build/net.opendasharchive.openarchive.release
2022-08-03 14:32:05,487 DEBUG: > git remote set-head origin --auto
2022-08-03 14:32:05,895 DEBUG: Directory: build/net.opendasharchive.openarchive.release
2022-08-03 14:32:05,895 DEBUG: > git checkout -f 04d069fbb133370e1bd152e47f130fd6deab2d59
2022-08-03 14:32:06,101 DEBUG: Directory: build/net.opendasharchive.openarchive.release
2022-08-03 14:32:06,102 DEBUG: > git clean -dffx
2022-08-03 14:32:06,214 INFO: Creating local.properties file at build/net.opendasharchive.openarchive.release/local.properties
2022-08-03 14:32:06,216 INFO: Creating local.properties file at build/net.opendasharchive.openarchive.release/app/local.properties
2022-08-03 14:32:06,216 DEBUG: Removing debuggable flags from build/net.opendasharchive.openarchive.release/app
2022-08-03 14:32:06,224 INFO: Cleaned build.gradle of keysigning configs at build/net.opendasharchive.openarchive.release/app/build.gradle
2022-08-03 14:32:06,228 INFO: Running 'prebuild' commands in build/net.opendasharchive.openarchive.release/app
2022-08-03 14:32:06,229 DEBUG: Directory: build/net.opendasharchive.openarchive.release/app
2022-08-03 14:32:06,229 DEBUG: > bash -x -c -- sed -i -e 's/getDropboxKey()$/""/' build.gradle
+ sed -i -e 's/getDropboxKey()$/""/' build.gradle
2022-08-03 14:32:06,434 INFO: Cleaning Gradle project...
2022-08-03 14:32:06,434 DEBUG: Directory: build/net.opendasharchive.openarchive.release/app
2022-08-03 14:32:06,435 DEBUG: > /home/vagrant/fdroidserver/gradlew-fdroid clean
Found 7.0.2 via distributionUrl
Running /opt/gradle/versions/7.0.2/bin/gradle clean

Welcome to Gradle 7.0.2!

Here are the highlights of this release:
 - File system watching enabled by default
 - Support for running with and building Java 16 projects
 - Native support for Apple Silicon processors
 - Dependency catalog feature preview

For more details see https://docs.gradle.org/7.0.2/release-notes.html

To honour the JVM settings for this build a single-use Daemon process will be forked. See https://docs.gradle.org/7.0.2/userguide/gradle_daemon.html#sec:disabling_the_daemon.
Daemon will be stopped at the end of the build 
> Task :app:clean UP-TO-DATE

Deprecated Gradle features were used in this build, making it incompatible with Gradle 8.0.
Use '--warning-mode all' to show the individual deprecation warnings.
See https://docs.gradle.org/7.0.2/userguide/command_line_interface.html#sec:command_line_warnings

BUILD SUCCESSFUL in 32s
1 actionable task: 1 up-to-date
2022-08-03 14:32:39,598 INFO: Scanning source for common problems...
2022-08-03 14:32:39,606 INFO: Removing ZIP file archive at art/ic_launcher.zip
2022-08-03 14:32:39,608 INFO: Removing gradle-wrapper.jar at gradle/wrapper/gradle-wrapper.jar
2022-08-03 14:32:39,632 INFO: Creating source tarball...
2022-08-03 14:32:40,231 INFO: Building Gradle project...
2022-08-03 14:32:40,232 DEBUG: Directory: build/net.opendasharchive.openarchive.release/app
2022-08-03 14:32:40,232 DEBUG: > /home/vagrant/fdroidserver/gradlew-fdroid assembleRelease
Found 7.0.2 via distributionUrl
Running /opt/gradle/versions/7.0.2/bin/gradle assembleRelease
To honour the JVM settings for this build a single-use Daemon process will be forked. See https://docs.gradle.org/7.0.2/userguide/gradle_daemon.html#sec:disabling_the_daemon.
Daemon will be stopped at the end of the build 
Checking the license for package Android SDK Build-Tools 31 in /opt/android-sdk/licenses
License for package Android SDK Build-Tools 31 accepted.
Preparing "Install Android SDK Build-Tools 31 (revision: 31.0.0)".
"Install Android SDK Build-Tools 31 (revision: 31.0.0)" ready.
Installing Android SDK Build-Tools 31 in /opt/android-sdk/build-tools/31.0.0
"Install Android SDK Build-Tools 31 (revision: 31.0.0)" complete.
"Install Android SDK Build-Tools 31 (revision: 31.0.0)" finished.
Checking the license for package Android SDK Platform 31 in /opt/android-sdk/licenses
License for package Android SDK Platform 31 accepted.
Preparing "Install Android SDK Platform 31 (revision: 1)".
"Install Android SDK Platform 31 (revision: 1)" ready.
Installing Android SDK Platform 31 in /opt/android-sdk/platforms/android-31
"Install Android SDK Platform 31 (revision: 1)" complete.
"Install Android SDK Platform 31 (revision: 1)" finished.
> Task :app:preBuild UP-TO-DATE
> Task :app:preReleaseflavorReleaseBuild UP-TO-DATE
> Task :app:compileReleaseflavorReleaseAidl NO-SOURCE
> Task :app:compileReleaseflavorReleaseRenderscript NO-SOURCE
> Task :app:dataBindingMergeDependencyArtifactsReleaseflavorRelease
> Task :app:dataBindingMergeGenClassesReleaseflavorRelease
> Task :app:generateReleaseflavorReleaseResValues
> Task :app:generateReleaseflavorReleaseResources
> Task :app:generateReleaseflavorReleaseBuildConfig
> Task :app:checkReleaseflavorReleaseAarMetadata
> Task :app:createReleaseflavorReleaseCompatibleScreenManifests
> Task :app:extractDeepLinksReleaseflavorRelease

> Task :app:processReleaseflavorReleaseMainManifest
/home/vagrant/build/net.opendasharchive.openarchive.release/app/src/main/AndroidManifest.xml:11:5-79 Warning:
	Element uses-permission#android.permission.ACCESS_NETWORK_STATE at AndroidManifest.xml:11:5-79 duplicated with element declared at AndroidManifest.xml:7:5-79
/home/vagrant/build/net.opendasharchive.openarchive.release/app/src/main/AndroidManifest.xml:225:5-79 Warning:
	Element uses-permission#android.permission.ACCESS_NETWORK_STATE at AndroidManifest.xml:225:5-79 duplicated with element declared at AndroidManifest.xml:11:5-79
/home/vagrant/build/net.opendasharchive.openarchive.release/app/src/main/AndroidManifest.xml:7:5-79 Warning:
	uses-permission#android.permission.ACCESS_NETWORK_STATE@android:maxSdkVersion was tagged at AndroidManifest.xml:7 to remove other declarations but no other declaration present
/home/vagrant/build/net.opendasharchive.openarchive.release/app/src/main/AndroidManifest.xml:8:5-80 Warning:
	uses-permission#android.permission.READ_EXTERNAL_STORAGE@android:maxSdkVersion was tagged at AndroidManifest.xml:8 to remove other declarations but no other declaration present
/home/vagrant/build/net.opendasharchive.openarchive.release/app/src/main/AndroidManifest.xml:9:5-81 Warning:
	uses-permission#android.permission.ACCESS_COARSE_LOCATION@android:maxSdkVersion was tagged at AndroidManifest.xml:9 to remove other declarations but no other declaration present
/home/vagrant/build/net.opendasharchive.openarchive.release/app/src/main/AndroidManifest.xml:10:5-79 Warning:
	uses-permission#android.permission.ACCESS_FINE_LOCATION@android:maxSdkVersion was tagged at AndroidManifest.xml:10 to remove other declarations but no other declaration present
/home/vagrant/build/net.opendasharchive.openarchive.release/app/src/main/AndroidManifest.xml:12:5-75 Warning:
	uses-permission#android.permission.READ_PHONE_STATE@android:maxSdkVersion was tagged at AndroidManifest.xml:12 to remove other declarations but no other declaration present
/home/vagrant/build/net.opendasharchive.openarchive.release/app/src/main/AndroidManifest.xml:18:5-220:19 Warning:
	application@android:icon was tagged at AndroidManifest.xml:18 to replace other declarations but no other declaration present
/home/vagrant/build/net.opendasharchive.openarchive.release/app/src/main/AndroidManifest.xml:39:9-45:51 Warning:
	provider#org.acra.attachment.AcraContentProvider@android:authorities was tagged at AndroidManifest.xml:39 to replace other declarations but no other declaration present
/home/vagrant/build/net.opendasharchive.openarchive.release/app/src/main/AndroidManifest.xml:222:5-67 Warning:
	uses-permission#android.permission.INTERNET@android:maxSdkVersion was tagged at AndroidManifest.xml:222 to remove other declarations but no other declaration present
/home/vagrant/build/net.opendasharchive.openarchive.release/app/src/main/AndroidManifest.xml:19:5-21:48 Warning:
	uses-permission#android.permission.ACCESS_BACKGROUND_LOCATION@android:maxSdkVersion was tagged at AndroidManifest.xml:19 to remove other declarations but no other declaration present

> Task :app:mergeReleaseflavorReleaseResources
> Task :app:processReleaseflavorReleaseManifest
> Task :app:dataBindingGenBaseClassesReleaseflavorRelease
> Task :app:javaPreCompileReleaseflavorRelease
> Task :app:buildKotlinToolingMetadata
> Task :app:extractProguardFiles
> Task :app:mergeReleaseflavorReleaseJniLibFolders
> Task :app:mergeReleaseflavorReleaseNativeLibs
> Task :app:checkReleaseflavorReleaseDuplicateClasses

> Task :app:stripReleaseflavorReleaseDebugSymbols
Unable to strip the following libraries, packaging them as they are: libimagepipeline.so.

> Task :app:extractReleaseflavorReleaseNativeSymbolTables
Unable to extract native debug metadata from /home/vagrant/build/net.opendasharchive.openarchive.release/app/build/intermediates/merged_native_libs/releaseflavorRelease/out/lib/x86_64/libimagepipeline.so because unable to locate the objcopy executable for the x86_64 ABI.
Unable to extract native debug metadata from /home/vagrant/build/net.opendasharchive.openarchive.release/app/build/intermediates/merged_native_libs/releaseflavorRelease/out/lib/armeabi-v7a/libimagepipeline.so because unable to locate the objcopy executable for the armeabi-v7a ABI.
Unable to extract native debug metadata from /home/vagrant/build/net.opendasharchive.openarchive.release/app/build/intermediates/merged_native_libs/releaseflavorRelease/out/lib/x86/libimagepipeline.so because unable to locate the objcopy executable for the x86 ABI.
Unable to extract native debug metadata from /home/vagrant/build/net.opendasharchive.openarchive.release/app/build/intermediates/merged_native_libs/releaseflavorRelease/out/lib/arm64-v8a/libimagepipeline.so because unable to locate the objcopy executable for the arm64-v8a ABI.

> Task :app:desugarReleaseflavorReleaseFileDependencies
> Task :app:mergeReleaseflavorReleaseNativeDebugMetadata NO-SOURCE
> Task :app:processReleaseflavorReleaseManifestForPackage
> Task :app:mergeExtDexReleaseflavorRelease
> Task :app:mergeReleaseflavorReleaseShaders
> Task :app:compileReleaseflavorReleaseShaders NO-SOURCE
> Task :app:generateReleaseflavorReleaseAssets UP-TO-DATE
> Task :app:mergeReleaseflavorReleaseAssets
> Task :app:mergeReleaseflavorReleaseArtProfile
> Task :app:processReleaseflavorReleaseJavaRes NO-SOURCE
> Task :app:compressReleaseflavorReleaseAssets
> Task :app:collectReleaseflavorReleaseDependencies
> Task :app:sdkReleaseflavorReleaseDependencyData
> Task :app:writeReleaseflavorReleaseAppMetadata
> Task :app:writeReleaseflavorReleaseSigningConfigVersions
warn: removing resource net.opendasharchive.openarchive.release:plurals/error_over_count without required default value.
warn: removing resource net.opendasharchive.openarchive.release:string/delete_local without required default value.
warn: removing resource net.opendasharchive.openarchive.release:string/delete_remote without required default value.

> Task :app:processReleaseflavorReleaseResources
> Task :app:compileReleaseflavorReleaseKotlin
w: /home/vagrant/build/net.opendasharchive.openarchive.release/app/src/main/java/io/scal/secureshareui/controller/ArchiveSiteController.kt: (7, 19): 'AsyncTask<Params : Any!, Progress : Any!, Result : Any!>' is deprecated. Deprecated in Java
w: /home/vagrant/build/net.opendasharchive.openarchive.release/app/src/main/java/io/scal/secureshareui/controller/ArchiveSiteController.kt: (42, 28): Parameter 'context' is never used
w: /home/vagrant/build/net.opendasharchive.openarchive.release/app/src/main/java/io/scal/secureshareui/controller/ArchiveSiteController.kt: (90, 17): Variable 'sharedPref' is never used
w: /home/vagrant/build/net.opendasharchive.openarchive.release/app/src/main/java/io/scal/secureshareui/controller/ArchiveSiteController.kt: (467, 33): Variable 'mediaUrl' initializer is redundant
w: /home/vagrant/build/net.opendasharchive.openarchive.release/app/src/main/java/io/scal/secureshareui/controller/ArchiveSiteController.kt: (484, 24): 'execute(vararg String?): AsyncTask<String?, String?, String!>!' is deprecated. Deprecated in Java
w: /home/vagrant/build/net.opendasharchive.openarchive.release/app/src/main/java/io/scal/secureshareui/controller/ArchiveSiteController.kt: (507, 9): 'AsyncTask<Params : Any!, Progress : Any!, Result : Any!>' is deprecated. Deprecated in Java
w: /home/vagrant/build/net.opendasharchive.openarchive.release/app/src/main/java/io/scal/secureshareui/controller/ArchiveSiteController.kt: (507, 9): 'constructor AsyncTask<Params : Any!, Progress : Any!, Result : Any!>()' is deprecated. Deprecated in Java
w: /home/vagrant/build/net.opendasharchive.openarchive.release/app/src/main/java/net/opendasharchive/openarchive/CleanInsightsManager.kt: (46, 60): Unnecessary non-null assertion (!!) on a non-null receiver of type String
w: /home/vagrant/build/net.opendasharchive.openarchive.release/app/src/main/java/net/opendasharchive/openarchive/CleanInsightsManager.kt: (48, 17): The corresponding parameter in the supertype 'JavaConsentRequestUi' is named 'campaignId'. This may cause problems when calling this function with named arguments.
w: /home/vagrant/build/net.opendasharchive.openarchive.release/app/src/main/java/net/opendasharchive/openarchive/CleanInsightsManager.kt: (50, 17): The corresponding parameter in the supertype 'JavaConsentRequestUi' is named 'handler'. This may cause problems when calling this function with named arguments.
w: /home/vagrant/build/net.opendasharchive.openarchive.release/app/src/main/java/net/opendasharchive/openarchive/CleanInsightsManager.kt: (73, 17): The corresponding parameter in the supertype 'JavaConsentRequestUi' is named 'handler'. This may cause problems when calling this function with named arguments.
w: /home/vagrant/build/net.opendasharchive.openarchive.release/app/src/main/java/net/opendasharchive/openarchive/MainActivity.kt: (235, 9): 'startActivityForResult(Intent!, Int): Unit' is deprecated. Deprecated in Java
w: /home/vagrant/build/net.opendasharchive.openarchive.release/app/src/main/java/net/opendasharchive/openarchive/MainActivity.kt: (294, 35): 'getColor(Int): Int' is deprecated. Deprecated in Java
w: /home/vagrant/build/net.opendasharchive.openarchive.release/app/src/main/java/net/opendasharchive/openarchive/MainActivity.kt: (392, 31): Type mismatch: inferred type is String? but String was expected
w: /home/vagrant/build/net.opendasharchive.openarchive.release/app/src/main/java/net/opendasharchive/openarchive/MainActivity.kt: (565, 15): 'onActivityResult(Int, Int, Intent?): Unit' is deprecated. Overrides deprecated member in 'androidx.activity.ComponentActivity'. Deprecated in Java
w: /home/vagrant/build/net.opendasharchive.openarchive.release/app/src/main/java/net/opendasharchive/openarchive/db/MediaAdapter.kt: (88, 49): Parameter 'v' is never used, could be renamed to _
w: /home/vagrant/build/net.opendasharchive.openarchive.release/app/src/main/java/net/opendasharchive/openarchive/db/MediaAdapter.kt: (89, 35): 'getActionMasked(MotionEvent!): Int' is deprecated. Deprecated in Java
w: /home/vagrant/build/net.opendasharchive.openarchive.release/app/src/main/java/net/opendasharchive/openarchive/db/MediaAdapter.kt: (91, 35): Unnecessary safe call on a non-null receiver of type MediaListFragment.OnStartDragListener. This expression will have nullable type in future releases
w: /home/vagrant/build/net.opendasharchive.openarchive.release/app/src/main/java/net/opendasharchive/openarchive/db/MediaViewHolder.kt: (186, 34): Type mismatch: inferred type is String? but String was expected
w: /home/vagrant/build/net.opendasharchive.openarchive.release/app/src/main/java/net/opendasharchive/openarchive/db/Space.kt: (57, 17): Condition 'spaceId != null' is always 'true'
w: /home/vagrant/build/net.opendasharchive.openarchive.release/app/src/main/java/net/opendasharchive/openarchive/db/Space.kt: (60, 25): Condition 'space != null' is always 'true'
w: /home/vagrant/build/net.opendasharchive.openarchive.release/app/src/main/java/net/opendasharchive/openarchive/features/media/MediaReviewListFragment.kt: (47, 44): Type mismatch: inferred type is List<Media>? but (MutableCollection<out Media!>..Collection<Media!>) was expected
w: /home/vagrant/build/net.opendasharchive.openarchive.release/app/src/main/java/net/opendasharchive/openarchive/features/media/MediaReviewListFragment.kt: (73, 44): Type mismatch: inferred type is List<Media>? but (MutableCollection<out Media!>..Collection<Media!>) was expected
w: /home/vagrant/build/net.opendasharchive.openarchive.release/app/src/main/java/net/opendasharchive/openarchive/features/media/MediaWorker.kt: (34, 13): Variable 'results' is never used
w: /home/vagrant/build/net.opendasharchive.openarchive.release/app/src/main/java/net/opendasharchive/openarchive/features/media/MediaWorker.kt: (41, 13): Variable 'outputData' is never used
w: /home/vagrant/build/net.opendasharchive.openarchive.release/app/src/main/java/net/opendasharchive/openarchive/features/media/MediaWorker.kt: (44, 17): Name shadowed: results
w: /home/vagrant/build/net.opendasharchive.openarchive.release/app/src/main/java/net/opendasharchive/openarchive/features/media/NavigationDrawerFragment.kt: (70, 15): 'onActivityCreated(Bundle?): Unit' is deprecated. Deprecated in Java
w: /home/vagrant/build/net.opendasharchive.openarchive.release/app/src/main/java/net/opendasharchive/openarchive/features/media/NavigationDrawerFragment.kt: (93, 58): Parameter 'parent' is never used, could be renamed to _
w: /home/vagrant/build/net.opendasharchive.openarchive.release/app/src/main/java/net/opendasharchive/openarchive/features/media/NavigationDrawerFragment.kt: (93, 66): Parameter 'view' is never used, could be renamed to _
w: /home/vagrant/build/net.opendasharchive.openarchive.release/app/src/main/java/net/opendasharchive/openarchive/features/media/NavigationDrawerFragment.kt: (93, 82): Parameter 'id' is never used, could be renamed to _
w: /home/vagrant/build/net.opendasharchive.openarchive.release/app/src/main/java/net/opendasharchive/openarchive/features/media/NavigationDrawerFragment.kt: (136, 24): 'setDrawerListener(DrawerLayout.DrawerListener!): Unit' is deprecated. Deprecated in Java
w: /home/vagrant/build/net.opendasharchive.openarchive.release/app/src/main/java/net/opendasharchive/openarchive/features/media/NavigationDrawerFragment.kt: (174, 23): 'setter for navigationMode: Int' is deprecated. Deprecated in Java
w: /home/vagrant/build/net.opendasharchive.openarchive.release/app/src/main/java/net/opendasharchive/openarchive/features/media/NavigationDrawerFragment.kt: (174, 50): 'NAVIGATION_MODE_STANDARD: Int' is deprecated. Deprecated in Java
w: /home/vagrant/build/net.opendasharchive.openarchive.release/app/src/main/java/net/opendasharchive/openarchive/features/media/NewProjectFragment.kt: (36, 23): 'startActivityForResult(Intent!, Int): Unit' is deprecated. Deprecated in Java
w: /home/vagrant/build/net.opendasharchive.openarchive.release/app/src/main/java/net/opendasharchive/openarchive/features/media/batch/BatchReviewMediaActivity.kt: (261, 21): Condition 'space != null' is always 'true'
w: /home/vagrant/build/net.opendasharchive.openarchive.release/app/src/main/java/net/opendasharchive/openarchive/features/media/batch/BatchReviewMediaActivity.kt: (274, 17): Condition 'space != null' is always 'true'
w: /home/vagrant/build/net.opendasharchive.openarchive.release/app/src/main/java/net/opendasharchive/openarchive/features/media/batch/BatchReviewMediaActivity.kt: (296, 13): Variable 'sharedPref' is never used
w: /home/vagrant/build/net.opendasharchive.openarchive.release/app/src/main/java/net/opendasharchive/openarchive/features/media/grid/MediaGridFragment.kt: (126, 44): Type mismatch: inferred type is List<Media>? but (MutableCollection<out Media!>..Collection<Media!>) was expected
w: /home/vagrant/build/net.opendasharchive.openarchive.release/app/src/main/java/net/opendasharchive/openarchive/features/media/grid/MediaGridFragment.kt: (192, 48): 'toLocaleString(): String!' is deprecated. Deprecated in Java
w: /home/vagrant/build/net.opendasharchive.openarchive.release/app/src/main/java/net/opendasharchive/openarchive/features/media/grid/MediaGridFragment.kt: (208, 48): 'toLocaleString(): String!' is deprecated. Deprecated in Java
w: /home/vagrant/build/net.opendasharchive.openarchive.release/app/src/main/java/net/opendasharchive/openarchive/features/media/grid/MediaGridFragment.kt: (216, 48): 'toLocaleString(): String!' is deprecated. Deprecated in Java
w: /home/vagrant/build/net.opendasharchive.openarchive.release/app/src/main/java/net/opendasharchive/openarchive/features/media/preview/PreviewMediaListViewModelFactory.kt: (14, 55): Unchecked cast: PreviewMediaListViewModel to T
w: /home/vagrant/build/net.opendasharchive.openarchive.release/app/src/main/java/net/opendasharchive/openarchive/features/media/review/ReviewMediaActivity.kt: (116, 72): Parameter 'buttonView' is never used, could be renamed to _
w: /home/vagrant/build/net.opendasharchive.openarchive.release/app/src/main/java/net/opendasharchive/openarchive/features/media/review/ReviewMediaActivity.kt: (116, 84): Parameter 'isChecked' is never used, could be renamed to _
w: /home/vagrant/build/net.opendasharchive.openarchive.release/app/src/main/java/net/opendasharchive/openarchive/features/media/review/ReviewMediaActivity.kt: (117, 77): Parameter 'buttonView' is never used, could be renamed to _
w: /home/vagrant/build/net.opendasharchive.openarchive.release/app/src/main/java/net/opendasharchive/openarchive/features/media/review/ReviewMediaActivity.kt: (117, 89): Parameter 'isChecked' is never used, could be renamed to _
w: /home/vagrant/build/net.opendasharchive.openarchive.release/app/src/main/java/net/opendasharchive/openarchive/features/media/review/ReviewMediaActivity.kt: (118, 71): Parameter 'buttonView' is never used, could be renamed to _
w: /home/vagrant/build/net.opendasharchive.openarchive.release/app/src/main/java/net/opendasharchive/openarchive/features/media/review/ReviewMediaActivity.kt: (118, 83): Parameter 'isChecked' is never used, could be renamed to _
w: /home/vagrant/build/net.opendasharchive.openarchive.release/app/src/main/java/net/opendasharchive/openarchive/features/media/review/ReviewMediaActivity.kt: (238, 13): Condition 'mMedia == null' is always 'false'
w: /home/vagrant/build/net.opendasharchive.openarchive.release/app/src/main/java/net/opendasharchive/openarchive/features/media/review/ReviewMediaActivity.kt: (389, 13): Variable 'sbTorrentUrl' is never used
w: /home/vagrant/build/net.opendasharchive.openarchive.release/app/src/main/java/net/opendasharchive/openarchive/features/media/review/ReviewMediaActivity.kt: (419, 35): Variable 'sharedFileUri' initializer is redundant
w: /home/vagrant/build/net.opendasharchive.openarchive.release/app/src/main/java/net/opendasharchive/openarchive/features/media/review/ReviewMediaActivity.kt: (455, 48): Parameter 'dialog' is never used, could be renamed to _
w: /home/vagrant/build/net.opendasharchive.openarchive.release/app/src/main/java/net/opendasharchive/openarchive/features/media/review/ReviewMediaActivity.kt: (455, 56): Parameter 'which' is never used, could be renamed to _
w: /home/vagrant/build/net.opendasharchive.openarchive.release/app/src/main/java/net/opendasharchive/openarchive/features/media/review/ReviewMediaActivity.kt: (470, 75): Parameter 'dialogInterface' is never used, could be renamed to _
w: /home/vagrant/build/net.opendasharchive.openarchive.release/app/src/main/java/net/opendasharchive/openarchive/features/media/review/ReviewMediaActivity.kt: (470, 92): Parameter 'i' is never used, could be renamed to _
w: /home/vagrant/build/net.opendasharchive.openarchive.release/app/src/main/java/net/opendasharchive/openarchive/features/media/review/ReviewMediaActivity.kt: (473, 51): Parameter 'dialog' is never used, could be renamed to _
w: /home/vagrant/build/net.opendasharchive.openarchive.release/app/src/main/java/net/opendasharchive/openarchive/features/media/review/ReviewMediaActivity.kt: (473, 59): Parameter 'which' is never used, could be renamed to _
w: /home/vagrant/build/net.opendasharchive.openarchive.release/app/src/main/java/net/opendasharchive/openarchive/features/media/review/ReviewMediaViewModelFactory.kt: (14, 54): Unchecked cast: ReviewMediaViewModel to T
w: /home/vagrant/build/net.opendasharchive.openarchive.release/app/src/main/java/net/opendasharchive/openarchive/features/onboarding/EulaActivity.kt: (57, 63): Parameter 'dialog' is never used, could be renamed to _
w: /home/vagrant/build/net.opendasharchive.openarchive.release/app/src/main/java/net/opendasharchive/openarchive/features/onboarding/EulaActivity.kt: (57, 71): Parameter 'which' is never used, could be renamed to _
w: /home/vagrant/build/net.opendasharchive.openarchive.release/app/src/main/java/net/opendasharchive/openarchive/features/onboarding/EulaActivity.kt: (63, 63): Parameter 'dialog' is never used, could be renamed to _
w: /home/vagrant/build/net.opendasharchive.openarchive.release/app/src/main/java/net/opendasharchive/openarchive/features/onboarding/EulaActivity.kt: (63, 71): Parameter 'which' is never used, could be renamed to _
w: /home/vagrant/build/net.opendasharchive.openarchive.release/app/src/main/java/net/opendasharchive/openarchive/features/onboarding/SpaceSetupActivity.kt: (46, 36): Parameter 'v' is never used
w: /home/vagrant/build/net.opendasharchive.openarchive.release/app/src/main/java/net/opendasharchive/openarchive/features/onboarding/SpaceSetupActivity.kt: (52, 36): Parameter 'v' is never used
w: /home/vagrant/build/net.opendasharchive.openarchive.release/app/src/main/java/net/opendasharchive/openarchive/features/onboarding/SpaceSetupActivity.kt: (57, 35): Parameter 'v' is never used
w: /home/vagrant/build/net.opendasharchive.openarchive.release/app/src/main/java/net/opendasharchive/openarchive/features/projects/AddProjectActivity.kt: (35, 29): Parameter 'view' is never used
w: /home/vagrant/build/net.opendasharchive.openarchive.release/app/src/main/java/net/opendasharchive/openarchive/features/projects/AddProjectActivity.kt: (39, 13): 'startActivityForResult(Intent!, Int): Unit' is deprecated. Deprecated in Java
w: /home/vagrant/build/net.opendasharchive.openarchive.release/app/src/main/java/net/opendasharchive/openarchive/features/projects/AddProjectActivity.kt: (46, 26): Parameter 'view' is never used
w: /home/vagrant/build/net.opendasharchive.openarchive.release/app/src/main/java/net/opendasharchive/openarchive/features/projects/AddProjectActivity.kt: (50, 13): 'startActivityForResult(Intent!, Int): Unit' is deprecated. Deprecated in Java
w: /home/vagrant/build/net.opendasharchive.openarchive.release/app/src/main/java/net/opendasharchive/openarchive/features/projects/AddProjectActivity.kt: (68, 15): 'onActivityResult(Int, Int, Intent?): Unit' is deprecated. Overrides deprecated member in 'androidx.activity.ComponentActivity'. Deprecated in Java
w: /home/vagrant/build/net.opendasharchive.openarchive.release/app/src/main/java/net/opendasharchive/openarchive/features/projects/CreateNewProjectActivity.kt: (34, 83): Parameter 'v' is never used, could be renamed to _
w: /home/vagrant/build/net.opendasharchive.openarchive.release/app/src/main/java/net/opendasharchive/openarchive/features/projects/CreateNewProjectActivity.kt: (34, 96): Parameter 'event' is never used, could be renamed to _
w: /home/vagrant/build/net.opendasharchive.openarchive.release/app/src/main/java/net/opendasharchive/openarchive/features/projects/EditProjectActivity.kt: (65, 82): Parameter 'v' is never used, could be renamed to _
w: /home/vagrant/build/net.opendasharchive.openarchive.release/app/src/main/java/net/opendasharchive/openarchive/features/projects/EditProjectActivity.kt: (65, 95): Parameter 'event' is never used, could be renamed to _
w: /home/vagrant/build/net.opendasharchive.openarchive.release/app/src/main/java/net/opendasharchive/openarchive/features/projects/EditProjectActivity.kt: (94, 80): Parameter 'buttonView' is never used, could be renamed to _
w: /home/vagrant/build/net.opendasharchive.openarchive.release/app/src/main/java/net/opendasharchive/openarchive/features/projects/EditProjectActivity.kt: (119, 74): Parameter 'buttonView' is never used, could be renamed to _
w: /home/vagrant/build/net.opendasharchive.openarchive.release/app/src/main/java/net/opendasharchive/openarchive/features/projects/EditProjectActivity.kt: (124, 73): Parameter 'buttonView' is never used, could be renamed to _
w: /home/vagrant/build/net.opendasharchive.openarchive.release/app/src/main/java/net/opendasharchive/openarchive/features/projects/EditProjectActivity.kt: (124, 85): Parameter 'isChecked' is never used, could be renamed to _
w: /home/vagrant/build/net.opendasharchive.openarchive.release/app/src/main/java/net/opendasharchive/openarchive/features/projects/EditProjectActivity.kt: (125, 79): Parameter 'buttonView' is never used, could be renamed to _
w: /home/vagrant/build/net.opendasharchive.openarchive.release/app/src/main/java/net/opendasharchive/openarchive/features/projects/EditProjectActivity.kt: (125, 91): Parameter 'isChecked' is never used, could be renamed to _
w: /home/vagrant/build/net.opendasharchive.openarchive.release/app/src/main/java/net/opendasharchive/openarchive/features/projects/EditProjectActivity.kt: (166, 23): Parameter 'view' is never used
w: /home/vagrant/build/net.opendasharchive.openarchive.release/app/src/main/java/net/opendasharchive/openarchive/features/projects/EditProjectActivity.kt: (168, 47): Parameter 'dialog' is never used, could be renamed to _
w: /home/vagrant/build/net.opendasharchive.openarchive.release/app/src/main/java/net/opendasharchive/openarchive/features/projects/EditProjectActivity.kt: (186, 24): Parameter 'view' is never used
w: /home/vagrant/build/net.opendasharchive.openarchive.release/app/src/main/java/net/opendasharchive/openarchive/features/projects/EditProjectActivity.kt: (212, 15): 'onActivityResult(Int, Int, Intent?): Unit' is deprecated. Overrides deprecated member in 'androidx.activity.ComponentActivity'. Deprecated in Java
w: /home/vagrant/build/net.opendasharchive.openarchive.release/app/src/main/java/net/opendasharchive/openarchive/features/settings/SpaceSettingsActivity.kt: (141, 54): 'toUpperCase(): String' is deprecated. Use uppercase() instead.
w: /home/vagrant/build/net.opendasharchive.openarchive.release/app/src/main/java/net/opendasharchive/openarchive/features/settings/SpaceSettingsActivity.kt: (194, 47): 'toUpperCase(Locale): String' is deprecated. Use uppercase() instead.
w: /home/vagrant/build/net.opendasharchive.openarchive.release/app/src/main/java/net/opendasharchive/openarchive/features/settings/SpaceSettingsActivity.kt: (198, 74): Parameter 'v' is never used, could be renamed to _
w: /home/vagrant/build/net.opendasharchive.openarchive.release/app/src/main/java/net/opendasharchive/openarchive/features/settings/SpaceSettingsActivity.kt: (228, 22): Parameter 'view' is never used
w: /home/vagrant/build/net.opendasharchive.openarchive.release/app/src/main/java/net/opendasharchive/openarchive/features/settings/SpaceSettingsActivity.kt: (233, 24): Parameter 'view' is never used
w: /home/vagrant/build/net.opendasharchive.openarchive.release/app/src/main/java/net/opendasharchive/openarchive/features/settings/SpaceSettingsActivity.kt: (261, 27): Parameter 'view' is never used
w: /home/vagrant/build/net.opendasharchive.openarchive.release/app/src/main/java/net/opendasharchive/openarchive/features/settings/SpaceSettingsViewModel.kt: (47, 17): Variable 'spaces' is never used
w: /home/vagrant/build/net.opendasharchive.openarchive.release/app/src/main/java/net/opendasharchive/openarchive/publish/UploaderListenerV2.kt: (44, 13): Variable 'jobId' is never used
w: /home/vagrant/build/net.opendasharchive.openarchive.release/app/src/main/java/net/opendasharchive/openarchive/publish/UploaderListenerV2.kt: (46, 13): Variable 'messageType' is never used
w: /home/vagrant/build/net.opendasharchive.openarchive.release/app/src/main/java/net/opendasharchive/openarchive/services/archivedotorg/ArchiveOrgLoginActivity.kt: (69, 55): Parameter 'textView' is never used, could be renamed to _
w: /home/vagrant/build/net.opendasharchive.openarchive.release/app/src/main/java/net/opendasharchive/openarchive/services/archivedotorg/ArchiveOrgLoginActivity.kt: (69, 85): Parameter 'keyEvent' is never used, could be renamed to _
w: /home/vagrant/build/net.opendasharchive.openarchive.release/app/src/main/java/net/opendasharchive/openarchive/services/archivedotorg/ArchiveOrgLoginActivity.kt: (88, 23): Parameter 'view' is never used
w: /home/vagrant/build/net.opendasharchive.openarchive.release/app/src/main/java/net/opendasharchive/openarchive/services/archivedotorg/ArchiveOrgLoginActivity.kt: (139, 15): 'onActivityResult(Int, Int, Intent?): Unit' is deprecated. Overrides deprecated member in 'androidx.activity.ComponentActivity'. Deprecated in Java
w: /home/vagrant/build/net.opendasharchive.openarchive.release/app/src/main/java/net/opendasharchive/openarchive/services/archivedotorg/ArchiveOrgLoginActivity.kt: (173, 23): Parameter 'v' is never used
w: /home/vagrant/build/net.opendasharchive.openarchive.release/app/src/main/java/net/opendasharchive/openarchive/services/archivedotorg/ArchiveOrgLoginActivity.kt: (175, 47): Parameter 'dialog' is never used, could be renamed to _
w: /home/vagrant/build/net.opendasharchive.openarchive.release/app/src/main/java/net/opendasharchive/openarchive/services/dropbox/DropboxLoginActivity.kt: (174, 23): Parameter 'view' is never used
w: /home/vagrant/build/net.opendasharchive.openarchive.release/app/src/main/java/net/opendasharchive/openarchive/services/dropbox/DropboxLoginActivity.kt: (176, 51): Parameter 'dialog' is never used, could be renamed to _
w: /home/vagrant/build/net.opendasharchive.openarchive.release/app/src/main/java/net/opendasharchive/openarchive/services/dropbox/DropboxSiteController.kt: (118, 13): Variable 'url' is never used
w: /home/vagrant/build/net.opendasharchive.openarchive.release/app/src/main/java/net/opendasharchive/openarchive/services/dropbox/DropboxSiteController.kt: (134, 34): Unnecessary safe call on a non-null receiver of type DropboxClientFactory. This expression will have nullable type in future releases
w: /home/vagrant/build/net.opendasharchive.openarchive.release/app/src/main/java/net/opendasharchive/openarchive/services/dropbox/DropboxSiteController.kt: (178, 17): Condition 'media.mediaHash != null' is always 'true'
w: /home/vagrant/build/net.opendasharchive.openarchive.release/app/src/main/java/net/opendasharchive/openarchive/services/dropbox/UploadFileTask.kt: (124, 13): Variable 'thrown' is assigned but never accessed
w: /home/vagrant/build/net.opendasharchive.openarchive.release/app/src/main/java/net/opendasharchive/openarchive/services/dropbox/UploadFileTask.kt: (190, 17): The value 'ex' assigned to 'var thrown: DbxException? defined in net.opendasharchive.openarchive.services.dropbox.UploadFileTask.chunkedUploadFile' is never used
w: /home/vagrant/build/net.opendasharchive.openarchive.release/app/src/main/java/net/opendasharchive/openarchive/services/dropbox/UploadFileTask.kt: (196, 17): The value 'ex' assigned to 'var thrown: DbxException? defined in net.opendasharchive.openarchive.services.dropbox.UploadFileTask.chunkedUploadFile' is never used
w: /home/vagrant/build/net.opendasharchive.openarchive.release/app/src/main/java/net/opendasharchive/openarchive/services/dropbox/UploadFileTask.kt: (201, 21): The value 'ex' assigned to 'var thrown: DbxException? defined in net.opendasharchive.openarchive.services.dropbox.UploadFileTask.chunkedUploadFile' is never used
w: /home/vagrant/build/net.opendasharchive.openarchive.release/app/src/main/java/net/opendasharchive/openarchive/services/dropbox/UploadFileTask.kt: (215, 21): The value 'ex' assigned to 'var thrown: DbxException? defined in net.opendasharchive.openarchive.services.dropbox.UploadFileTask.chunkedUploadFile' is never used
w: /home/vagrant/build/net.opendasharchive.openarchive.release/app/src/main/java/net/opendasharchive/openarchive/services/dropbox/UriHelpers.kt: (28, 5): 'open' has no effect in an object
w: /home/vagrant/build/net.opendasharchive.openarchive.release/app/src/main/java/net/opendasharchive/openarchive/services/dropbox/UriHelpers.kt: (38, 43): 'getExternalStorageDirectory(): File!' is deprecated. Deprecated in Java
w: /home/vagrant/build/net.opendasharchive.openarchive.release/app/src/main/java/net/opendasharchive/openarchive/services/webdav/WebDAVLoginActivity.kt: (96, 54): Parameter 'v' is never used, could be renamed to _
w: /home/vagrant/build/net.opendasharchive.openarchive.release/app/src/main/java/net/opendasharchive/openarchive/services/webdav/WebDAVLoginActivity.kt: (96, 67): Parameter 'event' is never used, could be renamed to _
w: /home/vagrant/build/net.opendasharchive.openarchive.release/app/src/main/java/net/opendasharchive/openarchive/services/webdav/WebDAVLoginActivity.kt: (99, 17): The expression is unused
w: /home/vagrant/build/net.opendasharchive.openarchive.release/app/src/main/java/net/opendasharchive/openarchive/services/webdav/WebDAVLoginActivity.kt: (170, 29): 'toLowerCase(): String' is deprecated. Use lowercase() instead.
w: /home/vagrant/build/net.opendasharchive.openarchive.release/app/src/main/java/net/opendasharchive/openarchive/services/webdav/WebDAVLoginActivity.kt: (193, 14): 'constructor Handler()' is deprecated. Deprecated in Java
w: /home/vagrant/build/net.opendasharchive.openarchive.release/app/src/main/java/net/opendasharchive/openarchive/services/webdav/WebDAVLoginActivity.kt: (333, 23): Parameter 'view' is never used
w: /home/vagrant/build/net.opendasharchive.openarchive.release/app/src/main/java/net/opendasharchive/openarchive/services/webdav/WebDAVLoginActivity.kt: (334, 69): Parameter 'dialog' is never used, could be renamed to _
w: /home/vagrant/build/net.opendasharchive.openarchive.release/app/src/main/java/net/opendasharchive/openarchive/services/webdav/WebDAVSiteController.kt: (59, 75): Parameter 'jobId' is never used
w: /home/vagrant/build/net.opendasharchive.openarchive.release/app/src/main/java/net/opendasharchive/openarchive/util/FileUtils.kt: (126, 25): Type mismatch: inferred type is String? but String was expected
w: /home/vagrant/build/net.opendasharchive.openarchive.release/app/src/main/java/net/opendasharchive/openarchive/util/FileUtils.kt: (280, 94): Unnecessary non-null assertion (!!) on a non-null receiver of type Context
w: /home/vagrant/build/net.opendasharchive.openarchive.release/app/src/main/java/net/opendasharchive/openarchive/util/FileUtils.kt: (389, 47): 'Thumbnails' is deprecated. Deprecated in Java
w: /home/vagrant/build/net.opendasharchive.openarchive.release/app/src/main/java/net/opendasharchive/openarchive/util/FileUtils.kt: (389, 58): 'getThumbnail(ContentResolver!, Long, Int, BitmapFactory.Options!): Bitmap!' is deprecated. Deprecated in Java
w: /home/vagrant/build/net.opendasharchive.openarchive.release/app/src/main/java/net/opendasharchive/openarchive/util/FileUtils.kt: (392, 50): 'Thumbnails' is deprecated. Deprecated in Java
w: /home/vagrant/build/net.opendasharchive.openarchive.release/app/src/main/java/net/opendasharchive/openarchive/util/FileUtils.kt: (392, 61): 'MINI_KIND: Int' is deprecated. Deprecated in Java
w: /home/vagrant/build/net.opendasharchive.openarchive.release/app/src/main/java/net/opendasharchive/openarchive/util/FileUtils.kt: (395, 48): 'Thumbnails' is deprecated. Deprecated in Java
w: /home/vagrant/build/net.opendasharchive.openarchive.release/app/src/main/java/net/opendasharchive/openarchive/util/FileUtils.kt: (395, 59): 'getThumbnail(ContentResolver!, Long, Int, BitmapFactory.Options!): Bitmap!' is deprecated. Deprecated in Java
w: /home/vagrant/build/net.opendasharchive.openarchive.release/app/src/main/java/net/opendasharchive/openarchive/util/FileUtils.kt: (398, 51): 'Thumbnails' is deprecated. Deprecated in Java
w: /home/vagrant/build/net.opendasharchive.openarchive.release/app/src/main/java/net/opendasharchive/openarchive/util/FileUtils.kt: (398, 62): 'MINI_KIND: Int' is deprecated. Deprecated in Java
w: /home/vagrant/build/net.opendasharchive.openarchive.release/app/src/main/java/net/opendasharchive/openarchive/util/FileUtils.kt: (417, 17): 'toLowerCase(): String' is deprecated. Use lowercase() instead.
w: /home/vagrant/build/net.opendasharchive.openarchive.release/app/src/main/java/net/opendasharchive/openarchive/util/FileUtils.kt: (418, 25): 'toLowerCase(): String' is deprecated. Use lowercase() instead.
w: /home/vagrant/build/net.opendasharchive.openarchive.release/app/src/main/java/net/opendasharchive/openarchive/util/FileUtils.kt: (462, 58): 'DATA: String' is deprecated. Deprecated in Java
w: /home/vagrant/build/net.opendasharchive.openarchive.release/app/src/main/java/net/opendasharchive/openarchive/util/FileUtils.kt: (466, 21): Variable 'curColumn' is never used
w: /home/vagrant/build/net.opendasharchive.openarchive.release/app/src/main/java/net/opendasharchive/openarchive/util/SmartFragmentStatePagerAdapter.kt: (7, 30): 'FragmentStatePagerAdapter' is deprecated. Deprecated in Java
w: /home/vagrant/build/net.opendasharchive.openarchive.release/app/src/main/java/net/opendasharchive/openarchive/util/SmartFragmentStatePagerAdapter.kt: (14, 79): 'FragmentStatePagerAdapter' is deprecated. Deprecated in Java
w: /home/vagrant/build/net.opendasharchive.openarchive.release/app/src/main/java/net/opendasharchive/openarchive/util/Utility.kt: (13, 23): 'CookieSyncManager' is deprecated. Deprecated in Java
w: /home/vagrant/build/net.opendasharchive.openarchive.release/app/src/main/java/net/opendasharchive/openarchive/util/Utility.kt: (28, 13): Name shadowed: mediaPath
w: /home/vagrant/build/net.opendasharchive.openarchive.release/app/src/main/java/net/opendasharchive/openarchive/util/Utility.kt: (28, 35): 'toLowerCase(): String' is deprecated. Use lowercase() instead.
w: /home/vagrant/build/net.opendasharchive.openarchive.release/app/src/main/java/net/opendasharchive/openarchive/util/Utility.kt: (35, 34): 'toLowerCase(): String' is deprecated. Use lowercase() instead.
w: /home/vagrant/build/net.opendasharchive.openarchive.release/app/src/main/java/net/opendasharchive/openarchive/util/Utility.kt: (54, 9): 'CookieSyncManager' is deprecated. Deprecated in Java
w: /home/vagrant/build/net.opendasharchive.openarchive.release/app/src/main/java/net/opendasharchive/openarchive/util/Utility.kt: (54, 27): 'createInstance(Context!): CookieSyncManager!' is deprecated. Deprecated in Java
w: /home/vagrant/build/net.opendasharchive.openarchive.release/app/src/main/java/net/opendasharchive/openarchive/util/Utility.kt: (56, 23): 'removeAllCookie(): Unit' is deprecated. Deprecated in Java
w: /home/vagrant/build/net.opendasharchive.openarchive.release/app/src/main/java/net/opendasharchive/openarchive/util/Utility.kt: (122, 34): Type mismatch: inferred type is ByteArray? but ByteArray was expected
w: /home/vagrant/build/net.opendasharchive.openarchive.release/app/src/main/java/net/opendasharchive/openarchive/util/Utility.kt: (200, 13): Variable 'mime' is never used
w: /home/vagrant/build/net.opendasharchive.openarchive.release/app/src/main/java/net/opendasharchive/openarchive/util/Utility.kt: (245, 44): 'insertImage(ContentResolver!, Bitmap!, String!, String!): String!' is deprecated. Deprecated in Java
w: /home/vagrant/build/net.opendasharchive.openarchive.release/app/src/main/java/net/opendasharchive/openarchive/util/Utility.kt: (250, 48): 'getExternalStoragePublicDirectory(String!): File!' is deprecated. Deprecated in Java

> Task :app:compileReleaseflavorReleaseJavaWithJavac FAILED
/home/vagrant/build/net.opendasharchive.openarchive.release/app/build/generated/source/buildConfig/releaseflavor/release/net/opendasharchive/openarchive/BuildConfig.java:14: error: illegal start of expression
  public static final String dropbox_key = ;
                                           ^
1 error

FAILURE: Build failed with an exception.

* What went wrong:
Execution failed for task ':app:compileReleaseflavorReleaseJavaWithJavac'.
> Compilation failed; see the compiler error output for details.

* Try:
Run with --stacktrace option to get the stack trace. Run with --info or --debug option to get more log output. Run with --scan to get full insights.

* Get more help at https://help.gradle.org

Deprecated Gradle features were used in this build, making it incompatible with Gradle 8.0.
Use '--warning-mode all' to show the individual deprecation warnings.
See https://docs.gradle.org/7.0.2/userguide/command_line_interface.html#sec:command_line_warnings

BUILD FAILED in 2m 23s
33 actionable tasks: 33 executed
2022-08-03 14:35:04,535 DEBUG: Popen(['git', 'cat-file', '--batch-check'], cwd=/home/vagrant/build/net.opendasharchive.openarchive.release, universal_newlines=False, shell=None)
2022-08-03 14:35:04,544 ERROR: Could not build app net.opendasharchive.openarchive.release: Build failed for net.opendasharchive.openarchive.release:0.2.4-RC-10@04d069fbb133370e1bd152e47f130fd6deab2d59
==== detail begin ====
Found 7.0.2 via distributionUrl
Running /opt/gradle/versions/7.0.2/bin/gradle assembleRelease
To honour the JVM settings for this build a single-use Daemon process will be forked. See https://docs.gradle.org/7.0.2/userguide/gradle_daemon.html#sec:disabling_the_daemon.
Daemon will be stopped at the end of the build 
Checking the license for package Android SDK Build-Tools 31 in /opt/android-sdk/licenses
License for package Android SDK Build-Tools 31 accepted.
Preparing "Install Android SDK Build-Tools 31 (revision: 31.0.0)".
"Install Android SDK Build-Tools 31 (revision: 31.0.0)" ready.
Installing Android SDK Build-Tools 31 in /opt/android-sdk/build-tools/31.0.0
"Install Android SDK Build-Tools 31 (revision: 31.0.0)" complete.
"Install Android SDK Build-Tools 31 (revision: 31.0.0)" finished.
Checking the license for package Android SDK Platform 31 in /opt/android-sdk/licenses
License for package Android SDK Platform 31 accepted.
Preparing "Install Android SDK Platform 31 (revision: 1)".
"Install Android SDK Platform 31 (revision: 1)" ready.
Installing Android SDK Platform 31 in /opt/android-sdk/platforms/android-31
"Install Android SDK Platform 31 (revision: 1)" complete.
"Install Android SDK Platform 31 (revision: 1)" finished.
> Task :app:preBuild UP-TO-DATE
> Task :app:preReleaseflavorReleaseBuild UP-TO-DATE
> Task :app:compileReleaseflavorReleaseAidl NO-SOURCE
> Task :app:compileReleaseflavorReleaseRenderscript NO-SOURCE
> Task :app:dataBindingMergeDependencyArtifactsReleaseflavorRelease
> Task :app:dataBindingMergeGenClassesReleaseflavorRelease
> Task :app:generateReleaseflavorReleaseResValues
> Task :app:generateReleaseflavorReleaseResources
> Task :app:generateReleaseflavorReleaseBuildConfig
> Task :app:checkReleaseflavorReleaseAarMetadata
> Task :app:createReleaseflavorReleaseCompatibleScreenManifests
> Task :app:extractDeepLinksReleaseflavorRelease

> Task :app:processReleaseflavorReleaseMainManifest
/home/vagrant/build/net.opendasharchive.openarchive.release/app/src/main/AndroidManifest.xml:11:5-79 Warning:
	Element uses-permission#android.permission.ACCESS_NETWORK_STATE at AndroidManifest.xml:11:5-79 duplicated with element declared at AndroidManifest.xml:7:5-79
/home/vagrant/build/net.opendasharchive.openarchive.release/app/src/main/AndroidManifest.xml:225:5-79 Warning:
	Element uses-permission#android.permission.ACCESS_NETWORK_STATE at AndroidManifest.xml:225:5-79 duplicated with element declared at AndroidManifest.xml:11:5-79
/home/vagrant/build/net.opendasharchive.openarchive.release/app/src/main/AndroidManifest.xml:7:5-79 Warning:
	uses-permission#android.permission.ACCESS_NETWORK_STATE@android:maxSdkVersion was tagged at AndroidManifest.xml:7 to remove other declarations but no other declaration present
/home/vagrant/build/net.opendasharchive.openarchive.release/app/src/main/AndroidManifest.xml:8:5-80 Warning:
	uses-permission#android.permission.READ_EXTERNAL_STORAGE@android:maxSdkVersion was tagged at AndroidManifest.xml:8 to remove other declarations but no other declaration present
/home/vagrant/build/net.opendasharchive.openarchive.release/app/src/main/AndroidManifest.xml:9:5-81 Warning:
	uses-permission#android.permission.ACCESS_COARSE_LOCATION@android:maxSdkVersion was tagged at AndroidManifest.xml:9 to remove other declarations but no other declaration present
/home/vagrant/build/net.opendasharchive.openarchive.release/app/src/main/AndroidManifest.xml:10:5-79 Warning:
	uses-permission#android.permission.ACCESS_FINE_LOCATION@android:maxSdkVersion was tagged at AndroidManifest.xml:10 to remove other declarations but no other declaration present
/home/vagrant/build/net.opendasharchive.openarchive.release/app/src/main/AndroidManifest.xml:12:5-75 Warning:
	uses-permission#android.permission.READ_PHONE_STATE@android:maxSdkVersion was tagged at AndroidManifest.xml:12 to remove other declarations but no other declaration present
/home/vagrant/build/net.opendasharchive.openarchive.release/app/src/main/AndroidManifest.xml:18:5-220:19 Warning:
	application@android:icon was tagged at AndroidManifest.xml:18 to replace other declarations but no other declaration present
/home/vagrant/build/net.opendasharchive.openarchive.release/app/src/main/AndroidManifest.xml:39:9-45:51 Warning:
	provider#org.acra.attachment.AcraContentProvider@android:authorities was tagged at AndroidManifest.xml:39 to replace other declarations but no other declaration present
/home/vagrant/build/net.opendasharchive.openarchive.release/app/src/main/AndroidManifest.xml:222:5-67 Warning:
	uses-permission#android.permission.INTERNET@android:maxSdkVersion was tagged at AndroidManifest.xml:222 to remove other declarations but no other declaration present
/home/vagrant/build/net.opendasharchive.openarchive.release/app/src/main/AndroidManifest.xml:19:5-21:48 Warning:
	uses-permission#android.permission.ACCESS_BACKGROUND_LOCATION@android:maxSdkVersion was tagged at AndroidManifest.xml:19 to remove other declarations but no other declaration present

> Task :app:mergeReleaseflavorReleaseResources
> Task :app:processReleaseflavorReleaseManifest
> Task :app:dataBindingGenBaseClassesReleaseflavorRelease
> Task :app:javaPreCompileReleaseflavorRelease
> Task :app:buildKotlinToolingMetadata
> Task :app:extractProguardFiles
> Task :app:mergeReleaseflavorReleaseJniLibFolders
> Task :app:mergeReleaseflavorReleaseNativeLibs
> Task :app:checkReleaseflavorReleaseDuplicateClasses

> Task :app:stripReleaseflavorReleaseDebugSymbols
Unable to strip the following libraries, packaging them as they are: libimagepipeline.so.

> Task :app:extractReleaseflavorReleaseNativeSymbolTables
Unable to extract native debug metadata from /home/vagrant/build/net.opendasharchive.openarchive.release/app/build/intermediates/merged_native_libs/releaseflavorRelease/out/lib/x86_64/libimagepipeline.so because unable to locate the objcopy executable for the x86_64 ABI.
Unable to extract native debug metadata from /home/vagrant/build/net.opendasharchive.openarchive.release/app/build/intermediates/merged_native_libs/releaseflavorRelease/out/lib/armeabi-v7a/libimagepipeline.so because unable to locate the objcopy executable for the armeabi-v7a ABI.
Unable to extract native debug metadata from /home/vagrant/build/net.opendasharchive.openarchive.release/app/build/intermediates/merged_native_libs/releaseflavorRelease/out/lib/x86/libimagepipeline.so because unable to locate the objcopy executable for the x86 ABI.
Unable to extract native debug metadata from /home/vagrant/build/net.opendasharchive.openarchive.release/app/build/intermediates/merged_native_libs/releaseflavorRelease/out/lib/arm64-v8a/libimagepipeline.so because unable to locate the objcopy executable for the arm64-v8a ABI.

> Task :app:desugarReleaseflavorReleaseFileDependencies
> Task :app:mergeReleaseflavorReleaseNativeDebugMetadata NO-SOURCE
> Task :app:processReleaseflavorReleaseManifestForPackage
> Task :app:mergeExtDexReleaseflavorRelease
> Task :app:mergeReleaseflavorReleaseShaders
> Task :app:compileReleaseflavorReleaseShaders NO-SOURCE
> Task :app:generateReleaseflavorReleaseAssets UP-TO-DATE
> Task :app:mergeReleaseflavorReleaseAssets
> Task :app:mergeReleaseflavorReleaseArtProfile
> Task :app:processReleaseflavorReleaseJavaRes NO-SOURCE
> Task :app:compressReleaseflavorReleaseAssets
> Task :app:collectReleaseflavorReleaseDependencies
> Task :app:sdkReleaseflavorReleaseDependencyData
> Task :app:writeReleaseflavorReleaseAppMetadata
> Task :app:writeReleaseflavorReleaseSigningConfigVersions
warn: removing resource net.opendasharchive.openarchive.release:plurals/error_over_count without required default value.
warn: removing resource net.opendasharchive.openarchive.release:string/delete_local without required default value.
warn: removing resource net.opendasharchive.openarchive.release:string/delete_remote without required default value.

> Task :app:processReleaseflavorReleaseResources
> Task :app:compileReleaseflavorReleaseKotlin
w: /home/vagrant/build/net.opendasharchive.openarchive.release/app/src/main/java/io/scal/secureshareui/controller/ArchiveSiteController.kt: (7, 19): 'AsyncTask<Params : Any!, Progress : Any!, Result : Any!>' is deprecated. Deprecated in Java
w: /home/vagrant/build/net.opendasharchive.openarchive.release/app/src/main/java/io/scal/secureshareui/controller/ArchiveSiteController.kt: (42, 28): Parameter 'context' is never used
w: /home/vagrant/build/net.opendasharchive.openarchive.release/app/src/main/java/io/scal/secureshareui/controller/ArchiveSiteController.kt: (90, 17): Variable 'sharedPref' is never used
w: /home/vagrant/build/net.opendasharchive.openarchive.release/app/src/main/java/io/scal/secureshareui/controller/ArchiveSiteController.kt: (467, 33): Variable 'mediaUrl' initializer is redundant
w: /home/vagrant/build/net.opendasharchive.openarchive.release/app/src/main/java/io/scal/secureshareui/controller/ArchiveSiteController.kt: (484, 24): 'execute(vararg String?): AsyncTask<String?, String?, String!>!' is deprecated. Deprecated in Java
w: /home/vagrant/build/net.opendasharchive.openarchive.release/app/src/main/java/io/scal/secureshareui/controller/ArchiveSiteController.kt: (507, 9): 'AsyncTask<Params : Any!, Progress : Any!, Result : Any!>' is deprecated. Deprecated in Java
w: /home/vagrant/build/net.opendasharchive.openarchive.release/app/src/main/java/io/scal/secureshareui/controller/ArchiveSiteController.kt: (507, 9): 'constructor AsyncTask<Params : Any!, Progress : Any!, Result : Any!>()' is deprecated. Deprecated in Java
w: /home/vagrant/build/net.opendasharchive.openarchive.release/app/src/main/java/net/opendasharchive/openarchive/CleanInsightsManager.kt: (46, 60): Unnecessary non-null assertion (!!) on a non-null receiver of type String
w: /home/vagrant/build/net.opendasharchive.openarchive.release/app/src/main/java/net/opendasharchive/openarchive/CleanInsightsManager.kt: (48, 17): The corresponding parameter in the supertype 'JavaConsentRequestUi' is named 'campaignId'. This may cause problems when calling this function with named arguments.
w: /home/vagrant/build/net.opendasharchive.openarchive.release/app/src/main/java/net/opendasharchive/openarchive/CleanInsightsManager.kt: (50, 17): The corresponding parameter in the supertype 'JavaConsentRequestUi' is named 'handler'. This may cause problems when calling this function with named arguments.
w: /home/vagrant/build/net.opendasharchive.openarchive.release/app/src/main/java/net/opendasharchive/openarchive/CleanInsightsManager.kt: (73, 17): The corresponding parameter in the supertype 'JavaConsentRequestUi' is named 'handler'. This may cause problems when calling this function with named arguments.
w: /home/vagrant/build/net.opendasharchive.openarchive.release/app/src/main/java/net/opendasharchive/openarchive/MainActivity.kt: (235, 9): 'startActivityForResult(Intent!, Int): Unit' is deprecated. Deprecated in Java
w: /home/vagrant/build/net.opendasharchive.openarchive.release/app/src/main/java/net/opendasharchive/openarchive/MainActivity.kt: (294, 35): 'getColor(Int): Int' is deprecated. Deprecated in Java
w: /home/vagrant/build/net.opendasharchive.openarchive.release/app/src/main/java/net/opendasharchive/openarchive/MainActivity.kt: (392, 31): Type mismatch: inferred type is String? but String was expected
w: /home/vagrant/build/net.opendasharchive.openarchive.release/app/src/main/java/net/opendasharchive/openarchive/MainActivity.kt: (565, 15): 'onActivityResult(Int, Int, Intent?): Unit' is deprecated. Overrides deprecated member in 'androidx.activity.ComponentActivity'. Deprecated in Java
w: /home/vagrant/build/net.opendasharchive.openarchive.release/app/src/main/java/net/opendasharchive/openarchive/db/MediaAdapter.kt: (88, 49): Parameter 'v' is never used, could be renamed to _
w: /home/vagrant/build/net.opendasharchive.openarchive.release/app/src/main/java/net/opendasharchive/openarchive/db/MediaAdapter.kt: (89, 35): 'getActionMasked(MotionEvent!): Int' is deprecated. Deprecated in Java
w: /home/vagrant/build/net.opendasharchive.openarchive.release/app/src/main/java/net/opendasharchive/openarchive/db/MediaAdapter.kt: (91, 35): Unnecessary safe call on a non-null receiver of type MediaListFragment.OnStartDragListener. This expression will have nullable type in future releases
w: /home/vagrant/build/net.opendasharchive.openarchive.release/app/src/main/java/net/opendasharchive/openarchive/db/MediaViewHolder.kt: (186, 34): Type mismatch: inferred type is String? but String was expected
w: /home/vagrant/build/net.opendasharchive.openarchive.release/app/src/main/java/net/opendasharchive/openarchive/db/Space.kt: (57, 17): Condition 'spaceId != null' is always 'true'
w: /home/vagrant/build/net.opendasharchive.openarchive.release/app/src/main/java/net/opendasharchive/openarchive/db/Space.kt: (60, 25): Condition 'space != null' is always 'true'
w: /home/vagrant/build/net.opendasharchive.openarchive.release/app/src/main/java/net/opendasharchive/openarchive/features/media/MediaReviewListFragment.kt: (47, 44): Type mismatch: inferred type is List<Media>? but (MutableCollection<out Media!>..Collection<Media!>) was expected
w: /home/vagrant/build/net.opendasharchive.openarchive.release/app/src/main/java/net/opendasharchive/openarchive/features/media/MediaReviewListFragment.kt: (73, 44): Type mismatch: inferred type is List<Media>? but (MutableCollection<out Media!>..Collection<Media!>) was expected
w: /home/vagrant/build/net.opendasharchive.openarchive.release/app/src/main/java/net/opendasharchive/openarchive/features/media/MediaWorker.kt: (34, 13): Variable 'results' is never used
w: /home/vagrant/build/net.opendasharchive.openarchive.release/app/src/main/java/net/opendasharchive/openarchive/features/media/MediaWorker.kt: (41, 13): Variable 'outputData' is never used
w: /home/vagrant/build/net.opendasharchive.openarchive.release/app/src/main/java/net/opendasharchive/openarchive/features/media/MediaWorker.kt: (44, 17): Name shadowed: results
w: /home/vagrant/build/net.opendasharchive.openarchive.release/app/src/main/java/net/opendasharchive/openarchive/features/media/NavigationDrawerFragment.kt: (70, 15): 'onActivityCreated(Bundle?): Unit' is deprecated. Deprecated in Java
w: /home/vagrant/build/net.opendasharchive.openarchive.release/app/src/main/java/net/opendasharchive/openarchive/features/media/NavigationDrawerFragment.kt: (93, 58): Parameter 'parent' is never used, could be renamed to _
w: /home/vagrant/build/net.opendasharchive.openarchive.release/app/src/main/java/net/opendasharchive/openarchive/features/media/NavigationDrawerFragment.kt: (93, 66): Parameter 'view' is never used, could be renamed to _
w: /home/vagrant/build/net.opendasharchive.openarchive.release/app/src/main/java/net/opendasharchive/openarchive/features/media/NavigationDrawerFragment.kt: (93, 82): Parameter 'id' is never used, could be renamed to _
w: /home/vagrant/build/net.opendasharchive.openarchive.release/app/src/main/java/net/opendasharchive/openarchive/features/media/NavigationDrawerFragment.kt: (136, 24): 'setDrawerListener(DrawerLayout.DrawerListener!): Unit' is deprecated. Deprecated in Java
w: /home/vagrant/build/net.opendasharchive.openarchive.release/app/src/main/java/net/opendasharchive/openarchive/features/media/NavigationDrawerFragment.kt: (174, 23): 'setter for navigationMode: Int' is deprecated. Deprecated in Java
w: /home/vagrant/build/net.opendasharchive.openarchive.release/app/src/main/java/net/opendasharchive/openarchive/features/media/NavigationDrawerFragment.kt: (174, 50): 'NAVIGATION_MODE_STANDARD: Int' is deprecated. Deprecated in Java
w: /home/vagrant/build/net.opendasharchive.openarchive.release/app/src/main/java/net/opendasharchive/openarchive/features/media/NewProjectFragment.kt: (36, 23): 'startActivityForResult(Intent!, Int): Unit' is deprecated. Deprecated in Java
w: /home/vagrant/build/net.opendasharchive.openarchive.release/app/src/main/java/net/opendasharchive/openarchive/features/media/batch/BatchReviewMediaActivity.kt: (261, 21): Condition 'space != null' is always 'true'
w: /home/vagrant/build/net.opendasharchive.openarchive.release/app/src/main/java/net/opendasharchive/openarchive/features/media/batch/BatchReviewMediaActivity.kt: (274, 17): Condition 'space != null' is always 'true'
w: /home/vagrant/build/net.opendasharchive.openarchive.release/app/src/main/java/net/opendasharchive/openarchive/features/media/batch/BatchReviewMediaActivity.kt: (296, 13): Variable 'sharedPref' is never used
w: /home/vagrant/build/net.opendasharchive.openarchive.release/app/src/main/java/net/opendasharchive/openarchive/features/media/grid/MediaGridFragment.kt: (126, 44): Type mismatch: inferred type is List<Media>? but (MutableCollection<out Media!>..Collection<Media!>) was expected
w: /home/vagrant/build/net.opendasharchive.openarchive.release/app/src/main/java/net/opendasharchive/openarchive/features/media/grid/MediaGridFragment.kt: (192, 48): 'toLocaleString(): String!' is deprecated. Deprecated in Java
w: /home/vagrant/build/net.opendasharchive.openarchive.release/app/src/main/java/net/opendasharchive/openarchive/features/media/grid/MediaGridFragment.kt: (208, 48): 'toLocaleString(): String!' is deprecated. Deprecated in Java
w: /home/vagrant/build/net.opendasharchive.openarchive.release/app/src/main/java/net/opendasharchive/openarchive/features/media/grid/MediaGridFragment.kt: (216, 48): 'toLocaleString(): String!' is deprecated. Deprecated in Java
w: /home/vagrant/build/net.opendasharchive.openarchive.release/app/src/main/java/net/opendasharchive/openarchive/features/media/preview/PreviewMediaListViewModelFactory.kt: (14, 55): Unchecked cast: PreviewMediaListViewModel to T
w: /home/vagrant/build/net.opendasharchive.openarchive.release/app/src/main/java/net/opendasharchive/openarchive/features/media/review/ReviewMediaActivity.kt: (116, 72): Parameter 'buttonView' is never used, could be renamed to _
w: /home/vagrant/build/net.opendasharchive.openarchive.release/app/src/main/java/net/opendasharchive/openarchive/features/media/review/ReviewMediaActivity.kt: (116, 84): Parameter 'isChecked' is never used, could be renamed to _
w: /home/vagrant/build/net.opendasharchive.openarchive.release/app/src/main/java/net/opendasharchive/openarchive/features/media/review/ReviewMediaActivity.kt: (117, 77): Parameter 'buttonView' is never used, could be renamed to _
w: /home/vagrant/build/net.opendasharchive.openarchive.release/app/src/main/java/net/opendasharchive/openarchive/features/media/review/ReviewMediaActivity.kt: (117, 89): Parameter 'isChecked' is never used, could be renamed to _
w: /home/vagrant/build/net.opendasharchive.openarchive.release/app/src/main/java/net/opendasharchive/openarchive/features/media/review/ReviewMediaActivity.kt: (118, 71): Parameter 'buttonView' is never used, could be renamed to _
w: /home/vagrant/build/net.opendasharchive.openarchive.release/app/src/main/java/net/opendasharchive/openarchive/features/media/review/ReviewMediaActivity.kt: (118, 83): Parameter 'isChecked' is never used, could be renamed to _
w: /home/vagrant/build/net.opendasharchive.openarchive.release/app/src/main/java/net/opendasharchive/openarchive/features/media/review/ReviewMediaActivity.kt: (238, 13): Condition 'mMedia == null' is always 'false'
w: /home/vagrant/build/net.opendasharchive.openarchive.release/app/src/main/java/net/opendasharchive/openarchive/features/media/review/ReviewMediaActivity.kt: (389, 13): Variable 'sbTorrentUrl' is never used
w: /home/vagrant/build/net.opendasharchive.openarchive.release/app/src/main/java/net/opendasharchive/openarchive/features/media/review/ReviewMediaActivity.kt: (419, 35): Variable 'sharedFileUri' initializer is redundant
w: /home/vagrant/build/net.opendasharchive.openarchive.release/app/src/main/java/net/opendasharchive/openarchive/features/media/review/ReviewMediaActivity.kt: (455, 48): Parameter 'dialog' is never used, could be renamed to _
w: /home/vagrant/build/net.opendasharchive.openarchive.release/app/src/main/java/net/opendasharchive/openarchive/features/media/review/ReviewMediaActivity.kt: (455, 56): Parameter 'which' is never used, could be renamed to _
w: /home/vagrant/build/net.opendasharchive.openarchive.release/app/src/main/java/net/opendasharchive/openarchive/features/media/review/ReviewMediaActivity.kt: (470, 75): Parameter 'dialogInterface' is never used, could be renamed to _
w: /home/vagrant/build/net.opendasharchive.openarchive.release/app/src/main/java/net/opendasharchive/openarchive/features/media/review/ReviewMediaActivity.kt: (470, 92): Parameter 'i' is never used, could be renamed to _
w: /home/vagrant/build/net.opendasharchive.openarchive.release/app/src/main/java/net/opendasharchive/openarchive/features/media/review/ReviewMediaActivity.kt: (473, 51): Parameter 'dialog' is never used, could be renamed to _
w: /home/vagrant/build/net.opendasharchive.openarchive.release/app/src/main/java/net/opendasharchive/openarchive/features/media/review/ReviewMediaActivity.kt: (473, 59): Parameter 'which' is never used, could be renamed to _
w: /home/vagrant/build/net.opendasharchive.openarchive.release/app/src/main/java/net/opendasharchive/openarchive/features/media/review/ReviewMediaViewModelFactory.kt: (14, 54): Unchecked cast: ReviewMediaViewModel to T
w: /home/vagrant/build/net.opendasharchive.openarchive.release/app/src/main/java/net/opendasharchive/openarchive/features/onboarding/EulaActivity.kt: (57, 63): Parameter 'dialog' is never used, could be renamed to _
w: /home/vagrant/build/net.opendasharchive.openarchive.release/app/src/main/java/net/opendasharchive/openarchive/features/onboarding/EulaActivity.kt: (57, 71): Parameter 'which' is never used, could be renamed to _
w: /home/vagrant/build/net.opendasharchive.openarchive.release/app/src/main/java/net/opendasharchive/openarchive/features/onboarding/EulaActivity.kt: (63, 63): Parameter 'dialog' is never used, could be renamed to _
w: /home/vagrant/build/net.opendasharchive.openarchive.release/app/src/main/java/net/opendasharchive/openarchive/features/onboarding/EulaActivity.kt: (63, 71): Parameter 'which' is never used, could be renamed to _
w: /home/vagrant/build/net.opendasharchive.openarchive.release/app/src/main/java/net/opendasharchive/openarchive/features/onboarding/SpaceSetupActivity.kt: (46, 36): Parameter 'v' is never used
w: /home/vagrant/build/net.opendasharchive.openarchive.release/app/src/main/java/net/opendasharchive/openarchive/features/onboarding/SpaceSetupActivity.kt: (52, 36): Parameter 'v' is never used
w: /home/vagrant/build/net.opendasharchive.openarchive.release/app/src/main/java/net/opendasharchive/openarchive/features/onboarding/SpaceSetupActivity.kt: (57, 35): Parameter 'v' is never used
w: /home/vagrant/build/net.opendasharchive.openarchive.release/app/src/main/java/net/opendasharchive/openarchive/features/projects/AddProjectActivity.kt: (35, 29): Parameter 'view' is never used
w: /home/vagrant/build/net.opendasharchive.openarchive.release/app/src/main/java/net/opendasharchive/openarchive/features/projects/AddProjectActivity.kt: (39, 13): 'startActivityForResult(Intent!, Int): Unit' is deprecated. Deprecated in Java
w: /home/vagrant/build/net.opendasharchive.openarchive.release/app/src/main/java/net/opendasharchive/openarchive/features/projects/AddProjectActivity.kt: (46, 26): Parameter 'view' is never used
w: /home/vagrant/build/net.opendasharchive.openarchive.release/app/src/main/java/net/opendasharchive/openarchive/features/projects/AddProjectActivity.kt: (50, 13): 'startActivityForResult(Intent!, Int): Unit' is deprecated. Deprecated in Java
w: /home/vagrant/build/net.opendasharchive.openarchive.release/app/src/main/java/net/opendasharchive/openarchive/features/projects/AddProjectActivity.kt: (68, 15): 'onActivityResult(Int, Int, Intent?): Unit' is deprecated. Overrides deprecated member in 'androidx.activity.ComponentActivity'. Deprecated in Java
w: /home/vagrant/build/net.opendasharchive.openarchive.release/app/src/main/java/net/opendasharchive/openarchive/features/projects/CreateNewProjectActivity.kt: (34, 83): Parameter 'v' is never used, could be renamed to _
w: /home/vagrant/build/net.opendasharchive.openarchive.release/app/src/main/java/net/opendasharchive/openarchive/features/projects/CreateNewProjectActivity.kt: (34, 96): Parameter 'event' is never used, could be renamed to _
w: /home/vagrant/build/net.opendasharchive.openarchive.release/app/src/main/java/net/opendasharchive/openarchive/features/projects/EditProjectActivity.kt: (65, 82): Parameter 'v' is never used, could be renamed to _
w: /home/vagrant/build/net.opendasharchive.openarchive.release/app/src/main/java/net/opendasharchive/openarchive/features/projects/EditProjectActivity.kt: (65, 95): Parameter 'event' is never used, could be renamed to _
w: /home/vagrant/build/net.opendasharchive.openarchive.release/app/src/main/java/net/opendasharchive/openarchive/features/projects/EditProjectActivity.kt: (94, 80): Parameter 'buttonView' is never used, could be renamed to _
w: /home/vagrant/build/net.opendasharchive.openarchive.release/app/src/main/java/net/opendasharchive/openarchive/features/projects/EditProjectActivity.kt: (119, 74): Parameter 'buttonView' is never used, could be renamed to _
w: /home/vagrant/build/net.opendasharchive.openarchive.release/app/src/main/java/net/opendasharchive/openarchive/features/projects/EditProjectActivity.kt: (124, 73): Parameter 'buttonView' is never used, could be renamed to _
w: /home/vagrant/build/net.opendasharchive.openarchive.release/app/src/main/java/net/opendasharchive/openarchive/features/projects/EditProjectActivity.kt: (124, 85): Parameter 'isChecked' is never used, could be renamed to _
w: /home/vagrant/build/net.opendasharchive.openarchive.release/app/src/main/java/net/opendasharchive/openarchive/features/projects/EditProjectActivity.kt: (125, 79): Parameter 'buttonView' is never used, could be renamed to _
w: /home/vagrant/build/net.opendasharchive.openarchive.release/app/src/main/java/net/opendasharchive/openarchive/features/projects/EditProjectActivity.kt: (125, 91): Parameter 'isChecked' is never used, could be renamed to _
w: /home/vagrant/build/net.opendasharchive.openarchive.release/app/src/main/java/net/opendasharchive/openarchive/features/projects/EditProjectActivity.kt: (166, 23): Parameter 'view' is never used
w: /home/vagrant/build/net.opendasharchive.openarchive.release/app/src/main/java/net/opendasharchive/openarchive/features/projects/EditProjectActivity.kt: (168, 47): Parameter 'dialog' is never used, could be renamed to _
w: /home/vagrant/build/net.opendasharchive.openarchive.release/app/src/main/java/net/opendasharchive/openarchive/features/projects/EditProjectActivity.kt: (186, 24): Parameter 'view' is never used
w: /home/vagrant/build/net.opendasharchive.openarchive.release/app/src/main/java/net/opendasharchive/openarchive/features/projects/EditProjectActivity.kt: (212, 15): 'onActivityResult(Int, Int, Intent?): Unit' is deprecated. Overrides deprecated member in 'androidx.activity.ComponentActivity'. Deprecated in Java
w: /home/vagrant/build/net.opendasharchive.openarchive.release/app/src/main/java/net/opendasharchive/openarchive/features/settings/SpaceSettingsActivity.kt: (141, 54): 'toUpperCase(): String' is deprecated. Use uppercase() instead.
w: /home/vagrant/build/net.opendasharchive.openarchive.release/app/src/main/java/net/opendasharchive/openarchive/features/settings/SpaceSettingsActivity.kt: (194, 47): 'toUpperCase(Locale): String' is deprecated. Use uppercase() instead.
w: /home/vagrant/build/net.opendasharchive.openarchive.release/app/src/main/java/net/opendasharchive/openarchive/features/settings/SpaceSettingsActivity.kt: (198, 74): Parameter 'v' is never used, could be renamed to _
w: /home/vagrant/build/net.opendasharchive.openarchive.release/app/src/main/java/net/opendasharchive/openarchive/features/settings/SpaceSettingsActivity.kt: (228, 22): Parameter 'view' is never used
w: /home/vagrant/build/net.opendasharchive.openarchive.release/app/src/main/java/net/opendasharchive/openarchive/features/settings/SpaceSettingsActivity.kt: (233, 24): Parameter 'view' is never used
w: /home/vagrant/build/net.opendasharchive.openarchive.release/app/src/main/java/net/opendasharchive/openarchive/features/settings/SpaceSettingsActivity.kt: (261, 27): Parameter 'view' is never used
w: /home/vagrant/build/net.opendasharchive.openarchive.release/app/src/main/java/net/opendasharchive/openarchive/features/settings/SpaceSettingsViewModel.kt: (47, 17): Variable 'spaces' is never used
w: /home/vagrant/build/net.opendasharchive.openarchive.release/app/src/main/java/net/opendasharchive/openarchive/publish/UploaderListenerV2.kt: (44, 13): Variable 'jobId' is never used
w: /home/vagrant/build/net.opendasharchive.openarchive.release/app/src/main/java/net/opendasharchive/openarchive/publish/UploaderListenerV2.kt: (46, 13): Variable 'messageType' is never used
w: /home/vagrant/build/net.opendasharchive.openarchive.release/app/src/main/java/net/opendasharchive/openarchive/services/archivedotorg/ArchiveOrgLoginActivity.kt: (69, 55): Parameter 'textView' is never used, could be renamed to _
w: /home/vagrant/build/net.opendasharchive.openarchive.release/app/src/main/java/net/opendasharchive/openarchive/services/archivedotorg/ArchiveOrgLoginActivity.kt: (69, 85): Parameter 'keyEvent' is never used, could be renamed to _
w: /home/vagrant/build/net.opendasharchive.openarchive.release/app/src/main/java/net/opendasharchive/openarchive/services/archivedotorg/ArchiveOrgLoginActivity.kt: (88, 23): Parameter 'view' is never used
w: /home/vagrant/build/net.opendasharchive.openarchive.release/app/src/main/java/net/opendasharchive/openarchive/services/archivedotorg/ArchiveOrgLoginActivity.kt: (139, 15): 'onActivityResult(Int, Int, Intent?): Unit' is deprecated. Overrides deprecated member in 'androidx.activity.ComponentActivity'. Deprecated in Java
w: /home/vagrant/build/net.opendasharchive.openarchive.release/app/src/main/java/net/opendasharchive/openarchive/services/archivedotorg/ArchiveOrgLoginActivity.kt: (173, 23): Parameter 'v' is never used
w: /home/vagrant/build/net.opendasharchive.openarchive.release/app/src/main/java/net/opendasharchive/openarchive/services/archivedotorg/ArchiveOrgLoginActivity.kt: (175, 47): Parameter 'dialog' is never used, could be renamed to _
w: /home/vagrant/build/net.opendasharchive.openarchive.release/app/src/main/java/net/opendasharchive/openarchive/services/dropbox/DropboxLoginActivity.kt: (174, 23): Parameter 'view' is never used
w: /home/vagrant/build/net.opendasharchive.openarchive.release/app/src/main/java/net/opendasharchive/openarchive/services/dropbox/DropboxLoginActivity.kt: (176, 51): Parameter 'dialog' is never used, could be renamed to _
w: /home/vagrant/build/net.opendasharchive.openarchive.release/app/src/main/java/net/opendasharchive/openarchive/services/dropbox/DropboxSiteController.kt: (118, 13): Variable 'url' is never used
w: /home/vagrant/build/net.opendasharchive.openarchive.release/app/src/main/java/net/opendasharchive/openarchive/services/dropbox/DropboxSiteController.kt: (134, 34): Unnecessary safe call on a non-null receiver of type DropboxClientFactory. This expression will have nullable type in future releases
w: /home/vagrant/build/net.opendasharchive.openarchive.release/app/src/main/java/net/opendasharchive/openarchive/services/dropbox/DropboxSiteController.kt: (178, 17): Condition 'media.mediaHash != null' is always 'true'
w: /home/vagrant/build/net.opendasharchive.openarchive.release/app/src/main/java/net/opendasharchive/openarchive/services/dropbox/UploadFileTask.kt: (124, 13): Variable 'thrown' is assigned but never accessed
w: /home/vagrant/build/net.opendasharchive.openarchive.release/app/src/main/java/net/opendasharchive/openarchive/services/dropbox/UploadFileTask.kt: (190, 17): The value 'ex' assigned to 'var thrown: DbxException? defined in net.opendasharchive.openarchive.services.dropbox.UploadFileTask.chunkedUploadFile' is never used
w: /home/vagrant/build/net.opendasharchive.openarchive.release/app/src/main/java/net/opendasharchive/openarchive/services/dropbox/UploadFileTask.kt: (196, 17): The value 'ex' assigned to 'var thrown: DbxException? defined in net.opendasharchive.openarchive.services.dropbox.UploadFileTask.chunkedUploadFile' is never used
w: /home/vagrant/build/net.opendasharchive.openarchive.release/app/src/main/java/net/opendasharchive/openarchive/services/dropbox/UploadFileTask.kt: (201, 21): The value 'ex' assigned to 'var thrown: DbxException? defined in net.opendasharchive.openarchive.services.dropbox.UploadFileTask.chunkedUploadFile' is never used
w: /home/vagrant/build/net.opendasharchive.openarchive.release/app/src/main/java/net/opendasharchive/openarchive/services/dropbox/UploadFileTask.kt: (215, 21): The value 'ex' assigned to 'var thrown: DbxException? defined in net.opendasharchive.openarchive.services.dropbox.UploadFileTask.chunkedUploadFile' is never used
w: /home/vagrant/build/net.opendasharchive.openarchive.release/app/src/main/java/net/opendasharchive/openarchive/services/dropbox/UriHelpers.kt: (28, 5): 'open' has no effect in an object
w: /home/vagrant/build/net.opendasharchive.openarchive.release/app/src/main/java/net/opendasharchive/openarchive/services/dropbox/UriHelpers.kt: (38, 43): 'getExternalStorageDirectory(): File!' is deprecated. Deprecated in Java
w: /home/vagrant/build/net.opendasharchive.openarchive.release/app/src/main/java/net/opendasharchive/openarchive/services/webdav/WebDAVLoginActivity.kt: (96, 54): Parameter 'v' is never used, could be renamed to _
w: /home/vagrant/build/net.opendasharchive.openarchive.release/app/src/main/java/net/opendasharchive/openarchive/services/webdav/WebDAVLoginActivity.kt: (96, 67): Parameter 'event' is never used, could be renamed to _
w: /home/vagrant/build/net.opendasharchive.openarchive.release/app/src/main/java/net/opendasharchive/openarchive/services/webdav/WebDAVLoginActivity.kt: (99, 17): The expression is unused
w: /home/vagrant/build/net.opendasharchive.openarchive.release/app/src/main/java/net/opendasharchive/openarchive/services/webdav/WebDAVLoginActivity.kt: (170, 29): 'toLowerCase(): String' is deprecated. Use lowercase() instead.
w: /home/vagrant/build/net.opendasharchive.openarchive.release/app/src/main/java/net/opendasharchive/openarchive/services/webdav/WebDAVLoginActivity.kt: (193, 14): 'constructor Handler()' is deprecated. Deprecated in Java
w: /home/vagrant/build/net.opendasharchive.openarchive.release/app/src/main/java/net/opendasharchive/openarchive/services/webdav/WebDAVLoginActivity.kt: (333, 23): Parameter 'view' is never used
w: /home/vagrant/build/net.opendasharchive.openarchive.release/app/src/main/java/net/opendasharchive/openarchive/services/webdav/WebDAVLoginActivity.kt: (334, 69): Parameter 'dialog' is never used, could be renamed to _
w: /home/vagrant/build/net.opendasharchive.openarchive.release/app/src/main/java/net/opendasharchive/openarchive/services/webdav/WebDAVSiteController.kt: (59, 75): Parameter 'jobId' is never used
w: /home/vagrant/build/net.opendasharchive.openarchive.release/app/src/main/java/net/opendasharchive/openarchive/util/FileUtils.kt: (126, 25): Type mismatch: inferred type is String? but String was expected
w: /home/vagrant/build/net.opendasharchive.openarchive.release/app/src/main/java/net/opendasharchive/openarchive/util/FileUtils.kt: (280, 94): Unnecessary non-null assertion (!!) on a non-null receiver of type Context
w: /home/vagrant/build/net.opendasharchive.openarchive.release/app/src/main/java/net/opendasharchive/openarchive/util/FileUtils.kt: (389, 47): 'Thumbnails' is deprecated. Deprecated in Java
w: /home/vagrant/build/net.opendasharchive.openarchive.release/app/src/main/java/net/opendasharchive/openarchive/util/FileUtils.kt: (389, 58): 'getThumbnail(ContentResolver!, Long, Int, BitmapFactory.Options!): Bitmap!' is deprecated. Deprecated in Java
w: /home/vagrant/build/net.opendasharchive.openarchive.release/app/src/main/java/net/opendasharchive/openarchive/util/FileUtils.kt: (392, 50): 'Thumbnails' is deprecated. Deprecated in Java
w: /home/vagrant/build/net.opendasharchive.openarchive.release/app/src/main/java/net/opendasharchive/openarchive/util/FileUtils.kt: (392, 61): 'MINI_KIND: Int' is deprecated. Deprecated in Java
w: /home/vagrant/build/net.opendasharchive.openarchive.release/app/src/main/java/net/opendasharchive/openarchive/util/FileUtils.kt: (395, 48): 'Thumbnails' is deprecated. Deprecated in Java
w: /home/vagrant/build/net.opendasharchive.openarchive.release/app/src/main/java/net/opendasharchive/openarchive/util/FileUtils.kt: (395, 59): 'getThumbnail(ContentResolver!, Long, Int, BitmapFactory.Options!): Bitmap!' is deprecated. Deprecated in Java
w: /home/vagrant/build/net.opendasharchive.openarchive.release/app/src/main/java/net/opendasharchive/openarchive/util/FileUtils.kt: (398, 51): 'Thumbnails' is deprecated. Deprecated in Java
w: /home/vagrant/build/net.opendasharchive.openarchive.release/app/src/main/java/net/opendasharchive/openarchive/util/FileUtils.kt: (398, 62): 'MINI_KIND: Int' is deprecated. Deprecated in Java
w: /home/vagrant/build/net.opendasharchive.openarchive.release/app/src/main/java/net/opendasharchive/openarchive/util/FileUtils.kt: (417, 17): 'toLowerCase(): String' is deprecated. Use lowercase() instead.
w: /home/vagrant/build/net.opendasharchive.openarchive.release/app/src/main/java/net/opendasharchive/openarchive/util/FileUtils.kt: (418, 25): 'toLowerCase(): String' is deprecated. Use lowercase() instead.
w: /home/vagrant/build/net.opendasharchive.openarchive.release/app/src/main/java/net/opendasharchive/openarchive/util/FileUtils.kt: (462, 58): 'DATA: String' is deprecated. Deprecated in Java
w: /home/vagrant/build/net.opendasharchive.openarchive.release/app/src/main/java/net/opendasharchive/openarchive/util/FileUtils.kt: (466, 21): Variable 'curColumn' is never used
w: /home/vagrant/build/net.opendasharchive.openarchive.release/app/src/main/java/net/opendasharchive/openarchive/util/SmartFragmentStatePagerAdapter.kt: (7, 30): 'FragmentStatePagerAdapter' is deprecated. Deprecated in Java
w: /home/vagrant/build/net.opendasharchive.openarchive.release/app/src/main/java/net/opendasharchive/openarchive/util/SmartFragmentStatePagerAdapter.kt: (14, 79): 'FragmentStatePagerAdapter' is deprecated. Deprecated in Java
w: /home/vagrant/build/net.opendasharchive.openarchive.release/app/src/main/java/net/opendasharchive/openarchive/util/Utility.kt: (13, 23): 'CookieSyncManager' is deprecated. Deprecated in Java
w: /home/vagrant/build/net.opendasharchive.openarchive.release/app/src/main/java/net/opendasharchive/openarchive/util/Utility.kt: (28, 13): Name shadowed: mediaPath
w: /home/vagrant/build/net.opendasharchive.openarchive.release/app/src/main/java/net/opendasharchive/openarchive/util/Utility.kt: (28, 35): 'toLowerCase(): String' is deprecated. Use lowercase() instead.
w: /home/vagrant/build/net.opendasharchive.openarchive.release/app/src/main/java/net/opendasharchive/openarchive/util/Utility.kt: (35, 34): 'toLowerCase(): String' is deprecated. Use lowercase() instead.
w: /home/vagrant/build/net.opendasharchive.openarchive.release/app/src/main/java/net/opendasharchive/openarchive/util/Utility.kt: (54, 9): 'CookieSyncManager' is deprecated. Deprecated in Java
w: /home/vagrant/build/net.opendasharchive.openarchive.release/app/src/main/java/net/opendasharchive/openarchive/util/Utility.kt: (54, 27): 'createInstance(Context!): CookieSyncManager!' is deprecated. Deprecated in Java
w: /home/vagrant/build/net.opendasharchive.openarchive.release/app/src/main/java/net/opendasharchive/openarchive/util/Utility.kt: (56, 23): 'removeAllCookie(): Unit' is deprecated. Deprecated in Java
w: /home/vagrant/build/net.opendasharchive.openarchive.release/app/src/main/java/net/opendasharchive/openarchive/util/Utility.kt: (122, 34): Type mismatch: inferred type is ByteArray? but ByteArray was expected
w: /home/vagrant/build/net.opendasharchive.openarchive.release/app/src/main/java/net/opendasharchive/openarchive/util/Utility.kt: (200, 13): Variable 'mime' is never used
w: /home/vagrant/build/net.opendasharchive.openarchive.release/app/src/main/java/net/opendasharchive/openarchive/util/Utility.kt: (245, 44): 'insertImage(ContentResolver!, Bitmap!, String!, String!): String!' is deprecated. Deprecated in Java
w: /home/vagrant/build/net.opendasharchive.openarchive.release/app/src/main/java/net/opendasharchive/openarchive/util/Utility.kt: (250, 48): 'getExternalStoragePublicDirectory(String!): File!' is deprecated. Deprecated in Java

> Task :app:compileReleaseflavorReleaseJavaWithJavac FAILED
/home/vagrant/build/net.opendasharchive.openarchive.release/app/build/generated/source/buildConfig/releaseflavor/release/net/opendasharchive/openarchive/BuildConfig.java:14: error: illegal start of expression
  public static final String dropbox_key = ;
                                           ^
1 error

FAILURE: Build failed with an exception.

* What went wrong:
Execution failed for task ':app:compileReleaseflavorReleaseJavaWithJavac'.
> Compilation failed; see the compiler error output for details.

* Try:
Run with --stacktrace option to get the stack trace. Run with --info or --debug option to get more log output. Run with --scan to get full insights.

* Get more help at https://help.gradle.org

Deprecated Gradle features were used in this build, making it incompatible with Gradle 8.0.
Use '--warning-mode all' to show the individual deprecation warnings.
See https://docs.gradle.org/7.0.2/userguide/command_line_interface.html#sec:command_line_warnings

BUILD FAILED in 2m 23s
33 actionable tasks: 33 executed
==== detail end ====
2022-08-03 14:35:04,546 DEBUG: Error encoutered, stopping by user request.
==== detail end ====