log for net.xisberto.timerpx:4

Traceback (most recent call last):
  File "/home/fbuild/fdroidserver/fdroidserver/build.py", line 1128, in main
    options.onserver, options.refresh):
  File "/home/fbuild/fdroidserver/fdroidserver/build.py", line 887, in trybuild
    build_server(app, build, vcs, build_dir, output_dir, log_dir, force)
  File "/home/fbuild/fdroidserver/fdroidserver/build.py", line 270, in build_server
    str(output, 'utf-8'))
fdroidserver.exception.BuildException: Build.py failed on server for net.xisberto.timerpx:1.2
==== detail begin ====
== Installed Android Tools ==

2022-06-21 15:57:56,146 DEBUG: Reading 'config.yml'
2022-06-21 15:57:56,154 INFO: Using /opt/android-sdk/build-tools/29.0.3/apksigner 
2022-06-21 15:57:56,157 INFO: Creating log directory
2022-06-21 15:57:56,157 INFO: Creating temporary directory
2022-06-21 15:57:56,158 INFO: Creating output directory
2022-06-21 15:57:56,160 DEBUG: Getting git vcs interface for https://gitlab.com/humbertofraga/timerx.git
2022-06-21 15:57:56,161 DEBUG: > git --version
git version 2.11.0
2022-06-21 15:57:56,372 INFO: Using git version 2.11.0
2022-06-21 15:57:56,372 DEBUG: Checking 1.2
2022-06-21 15:57:56,372 INFO: Building version 1.2 (4) of net.xisberto.timerpx
2022-06-21 15:57:56,373 DEBUG: > sudo passwd --lock root
passwd: password expiry information changed.
2022-06-21 15:57:56,581 DEBUG: > sudo SUDO_FORCE_REMOVE=yes dpkg --purge sudo
(Reading database ... 65038 files and directories currently installed.)
Removing sudo (1.8.19p1-2.1+deb9u3) ...
Purging configuration files for sudo (1.8.19p1-2.1+deb9u3) ...
Processing triggers for systemd (232-25+deb9u13) ...
2022-06-21 15:57:59,973 INFO: Getting source for revision 8238cde46915f24636c2dddf9dda9fd06d0ede28
2022-06-21 15:57:59,973 DEBUG: Directory: build/net.xisberto.timerpx
2022-06-21 15:57:59,973 DEBUG: > git rev-parse --show-toplevel
2022-06-21 15:58:00,177 DEBUG: Directory: build/net.xisberto.timerpx
2022-06-21 15:58:00,177 DEBUG: > git submodule foreach --recursive git reset --hard
2022-06-21 15:58:00,282 DEBUG: Directory: build/net.xisberto.timerpx
2022-06-21 15:58:00,282 DEBUG: > git reset --hard
2022-06-21 15:58:00,488 DEBUG: Directory: build/net.xisberto.timerpx
2022-06-21 15:58:00,488 DEBUG: > git submodule foreach --recursive git clean -dffx
2022-06-21 15:58:00,593 DEBUG: Directory: build/net.xisberto.timerpx
2022-06-21 15:58:00,594 DEBUG: > git clean -dffx
2022-06-21 15:58:00,699 DEBUG: Directory: build/net.xisberto.timerpx
2022-06-21 15:58:00,699 DEBUG: > git -c core.askpass=/bin/true -c core.sshCommand=/bin/false -c url.https://.insteadOf=ssh:// -c url.https://u:p@bitbucket.org/.insteadOf=git@bitbucket.org: -c url.https://u:p@bitbucket.org.insteadOf=git://bitbucket.org -c url.https://u:p@bitbucket.org.insteadOf=https://bitbucket.org -c url.https://u:p@github.com/.insteadOf=git@github.com: -c url.https://u:p@github.com.insteadOf=git://github.com -c url.https://u:p@github.com.insteadOf=https://github.com -c url.https://u:p@gitlab.com/.insteadOf=git@gitlab.com: -c url.https://u:p@gitlab.com.insteadOf=git://gitlab.com -c url.https://u:p@gitlab.com.insteadOf=https://gitlab.com fetch origin
2022-06-21 15:58:03,121 DEBUG: Directory: build/net.xisberto.timerpx
2022-06-21 15:58:03,121 DEBUG: > git -c core.askpass=/bin/true -c core.sshCommand=/bin/false -c url.https://.insteadOf=ssh:// -c url.https://u:p@bitbucket.org/.insteadOf=git@bitbucket.org: -c url.https://u:p@bitbucket.org.insteadOf=git://bitbucket.org -c url.https://u:p@bitbucket.org.insteadOf=https://bitbucket.org -c url.https://u:p@github.com/.insteadOf=git@github.com: -c url.https://u:p@github.com.insteadOf=git://github.com -c url.https://u:p@github.com.insteadOf=https://github.com -c url.https://u:p@gitlab.com/.insteadOf=git@gitlab.com: -c url.https://u:p@gitlab.com.insteadOf=git://gitlab.com -c url.https://u:p@gitlab.com.insteadOf=https://gitlab.com remote prune origin
2022-06-21 15:58:05,231 DEBUG: Directory: build/net.xisberto.timerpx
2022-06-21 15:58:05,232 DEBUG: > git -c core.askpass=/bin/true -c core.sshCommand=/bin/false -c url.https://.insteadOf=ssh:// -c url.https://u:p@bitbucket.org/.insteadOf=git@bitbucket.org: -c url.https://u:p@bitbucket.org.insteadOf=git://bitbucket.org -c url.https://u:p@bitbucket.org.insteadOf=https://bitbucket.org -c url.https://u:p@github.com/.insteadOf=git@github.com: -c url.https://u:p@github.com.insteadOf=git://github.com -c url.https://u:p@github.com.insteadOf=https://github.com -c url.https://u:p@gitlab.com/.insteadOf=git@gitlab.com: -c url.https://u:p@gitlab.com.insteadOf=git://gitlab.com -c url.https://u:p@gitlab.com.insteadOf=https://gitlab.com fetch --prune --tags --force origin
2022-06-21 15:58:05,841 DEBUG: Directory: build/net.xisberto.timerpx
2022-06-21 15:58:05,841 DEBUG: > git remote set-head origin --auto
2022-06-21 15:58:06,654 DEBUG: Directory: build/net.xisberto.timerpx
2022-06-21 15:58:06,657 DEBUG: > git checkout -f 8238cde46915f24636c2dddf9dda9fd06d0ede28
2022-06-21 15:58:06,862 DEBUG: Directory: build/net.xisberto.timerpx
2022-06-21 15:58:06,862 DEBUG: > git clean -dffx
2022-06-21 15:58:06,968 INFO: Creating local.properties file at build/net.xisberto.timerpx/local.properties
2022-06-21 15:58:06,969 INFO: Creating local.properties file at build/net.xisberto.timerpx/app/local.properties
2022-06-21 15:58:06,969 DEBUG: Removing debuggable flags from build/net.xisberto.timerpx/app
2022-06-21 15:58:06,979 INFO: Cleaning Gradle project...
2022-06-21 15:58:06,980 DEBUG: Directory: build/net.xisberto.timerpx/app
2022-06-21 15:58:06,980 DEBUG: > /home/vagrant/fdroidserver/gradlew-fdroid clean
Found 7.2 via distributionUrl
Downloading missing gradle version 7.2
cachedir /home/vagrant/.cache/fdroidserver
/home/vagrant/.cache/fdroidserver/gradle-7.2-bin.zip: OK
Running /opt/gradle/versions/7.2/bin/gradle clean

Welcome to Gradle 7.2!

Here are the highlights of this release:
 - Toolchain support for Scala
 - More cache hits when Java source files have platform-specific line endings
 - More resilient remote HTTP build cache behavior

For more details see https://docs.gradle.org/7.2/release-notes.html

To honour the JVM settings for this build a single-use Daemon process will be forked. See https://docs.gradle.org/7.2/userguide/gradle_daemon.html#sec:disabling_the_daemon.
Daemon will be stopped at the end of the build 

FAILURE: Build failed with an exception.

* Where:
Build file '/home/vagrant/build/net.xisberto.timerpx/app/build.gradle' line: 1

* What went wrong:
A problem occurred evaluating project ':app'.
> Failed to apply plugin 'com.android.internal.application'.
   > Android Gradle plugin requires Java 11 to run. You are currently using Java 1.8.
     You can try some of the following options:
       - changing the IDE settings.
       - changing the JAVA_HOME environment variable.
       - changing `org.gradle.java.home` in `gradle.properties`.

* Try:
Run with --stacktrace option to get the stack trace. Run with --info or --debug option to get more log output. Run with --scan to get full insights.

* Get more help at https://help.gradle.org

BUILD FAILED in 31s
2022-06-21 15:58:45,229 ERROR: Could not build app net.xisberto.timerpx: Error cleaning net.xisberto.timerpx:1.2
==== detail begin ====
Found 7.2 via distributionUrl
Downloading missing gradle version 7.2
cachedir /home/vagrant/.cache/fdroidserver
/home/vagrant/.cache/fdroidserver/gradle-7.2-bin.zip: OK
Running /opt/gradle/versions/7.2/bin/gradle clean

Welcome to Gradle 7.2!

Here are the highlights of this release:
 - Toolchain support for Scala
 - More cache hits when Java source files have platform-specific line endings
 - More resilient remote HTTP build cache behavior

For more details see https://docs.gradle.org/7.2/release-notes.html

To honour the JVM settings for this build a single-use Daemon process will be forked. See https://docs.gradle.org/7.2/userguide/gradle_daemon.html#sec:disabling_the_daemon.
Daemon will be stopped at the end of the build 

FAILURE: Build failed with an exception.

* Where:
Build file '/home/vagrant/build/net.xisberto.timerpx/app/build.gradle' line: 1

* What went wrong:
A problem occurred evaluating project ':app'.
> Failed to apply plugin 'com.android.internal.application'.
   > Android Gradle plugin requires Java 11 to run. You are currently using Java 1.8.
     You can try some of the following options:
       - changing the IDE settings.
       - changing the JAVA_HOME environment variable.
       - changing `org.gradle.java.home` in `gradle.properties`.

* Try:
Run with --stacktrace option to get the stack trace. Run with --info or --debug option to get more log output. Run with --scan to get full insights.

* Get more help at https://help.gradle.org

BUILD FAILED in 31s
==== detail end ====
2022-06-21 15:58:45,229 DEBUG: Error encoutered, stopping by user request.
==== detail end ====