log for org.ca.squawker:300018523
== Installed Android Tools ==2026-10-17 11:01:32,323 INFO: Creating log directory2026-10-17 11:01:32,323 INFO: Creating temporary directory2026-10-17 11:01:32,323 INFO: Creating output directory2026-10-17 11:01:32,335 DEBUG: Getting git vcs interface for https://github.com/j-fbriere/squawker.git2026-10-17 11:01:32,335 DEBUG: Checking org.ca.squawker:3000185232026-10-17 11:01:32,335 INFO: Building org.ca.squawker:3000185232026-10-17 11:01:32,336 DEBUG: Popen(['git', 'log', '-n', '1', '--pretty=%ct'], cwd=/home/vagrant/build/org.ca.squawker, stdin=None, shell=False, universal_newlines=False)2026-10-17 11:01:32,337 DEBUG: > sudo passwd --lock rootpasswd: password changed.2026-10-17 11:01:32,639 DEBUG: > sudo SUDO_FORCE_REMOVE=yes dpkg --purge sudo(Reading database ... 48149 files and directories currently installed.)Removing sudo (1.9.16p2-3+deb13u2) ...Purging configuration files for sudo (1.9.16p2-3+deb13u2) ...dpkg: warning: while removing sudo, directory '/etc/sudoers.d' not empty so not removedProcessing triggers for libc-bin (2.41-12+deb13u4) ...2026-10-17 11:01:35,398 INFO: Getting source for revision d3cc4c86cfcbe80d469eabccc2abb9c298725d3d2026-10-17 11:01:35,398 DEBUG: Directory: build/org.ca.squawker2026-10-17 11:01:35,398 DEBUG: > git rev-parse --show-toplevel2026-10-17 11:01:35,599 DEBUG: Directory: build/org.ca.squawker2026-10-17 11:01:35,599 DEBUG: > git submodule foreach --recursive git reset --hard2026-10-17 11:01:35,700 DEBUG: Directory: build/org.ca.squawker2026-10-17 11:01:35,700 DEBUG: > git reset --hard2026-10-17 11:01:35,902 DEBUG: Directory: build/org.ca.squawker2026-10-17 11:01:35,902 DEBUG: > git submodule foreach --recursive git clean -dffx2026-10-17 11:01:36,003 DEBUG: Directory: build/org.ca.squawker2026-10-17 11:01:36,003 DEBUG: > git clean -dffx2026-10-17 11:01:36,404 DEBUG: Directory: build/org.ca.squawker2026-10-17 11:01:36,404 DEBUG: > git -c core.askpass=/bin/true -c core.sshCommand=/bin/false -c url.https://.insteadOf=ssh:// -c url.https://u:p@bitbucket.org/.insteadOf=git@bitbucket.org: -c url.https://u:p@bitbucket.org.insteadOf=git://bitbucket.org -c url.https://u:p@bitbucket.org.insteadOf=https://bitbucket.org -c url.https://u:p@github.com/.insteadOf=git@github.com: -c url.https://u:p@github.com.insteadOf=git://github.com -c url.https://u:p@github.com.insteadOf=https://github.com -c url.https://u:p@gitlab.com/.insteadOf=git@gitlab.com: -c url.https://u:p@gitlab.com.insteadOf=git://gitlab.com -c url.https://u:p@gitlab.com.insteadOf=https://gitlab.com -c url.https://u:p@codeberg.org/.insteadOf=git@codeberg.org: -c url.https://u:p@codeberg.org.insteadOf=git://codeberg.org -c url.https://u:p@codeberg.org.insteadOf=https://codeberg.org fetch --prune --prune-tags --force origin2026-10-17 11:01:36,806 DEBUG: Directory: build/org.ca.squawker2026-10-17 11:01:36,806 DEBUG: > git -c core.askpass=/bin/true -c core.sshCommand=/bin/false -c url.https://.insteadOf=ssh:// -c url.https://u:p@bitbucket.org/.insteadOf=git@bitbucket.org: -c url.https://u:p@bitbucket.org.insteadOf=git://bitbucket.org -c url.https://u:p@bitbucket.org.insteadOf=https://bitbucket.org -c url.https://u:p@github.com/.insteadOf=git@github.com: -c url.https://u:p@github.com.insteadOf=git://github.com -c url.https://u:p@github.com.insteadOf=https://github.com -c url.https://u:p@gitlab.com/.insteadOf=git@gitlab.com: -c url.https://u:p@gitlab.com.insteadOf=git://gitlab.com -c url.https://u:p@gitlab.com.insteadOf=https://gitlab.com -c url.https://u:p@codeberg.org/.insteadOf=git@codeberg.org: -c url.https://u:p@codeberg.org.insteadOf=git://codeberg.org -c url.https://u:p@codeberg.org.insteadOf=https://codeberg.org fetch --prune --tags --force origin2026-10-17 11:01:37,107 DEBUG: Directory: build/org.ca.squawker2026-10-17 11:01:37,107 DEBUG: > git remote set-head origin --auto2026-10-17 11:01:37,509 DEBUG: Directory: build/org.ca.squawker2026-10-17 11:01:37,510 DEBUG: > git checkout -f d3cc4c86cfcbe80d469eabccc2abb9c298725d3d2026-10-17 11:01:37,711 DEBUG: Directory: build/org.ca.squawker2026-10-17 11:01:37,711 DEBUG: > git clean -dffx2026-10-17 11:01:37,812 INFO: commit: d3cc4c86cfcbe80d469eabccc2abb9c298725d3d (SHA1: d3cc4c86cfcbe80d469eabccc2abb9c298725d3d)2026-10-17 11:01:37,812 DEBUG: Directory: build/org.ca.squawker2026-10-17 11:01:37,812 DEBUG: > git rev-parse --show-toplevel2026-10-17 11:01:38,014 DEBUG: Directory: build/org.ca.squawker2026-10-17 11:01:38,014 DEBUG: > git submodule deinit --all --force2026-10-17 11:01:38,115 INFO: Collecting source libraries2026-10-17 11:01:38,144 INFO: Creating local.properties file at build/org.ca.squawker/local.properties2026-10-17 11:01:38,144 INFO: Removing specified files2026-10-17 11:01:38,144 INFO: Removing test2026-10-17 11:01:38,144 INFO: Removing ios2026-10-17 11:01:38,146 INFO: Cleaned build.gradle.kts of keysigning configs at build/org.ca.squawker/android/app/build.gradle.kts2026-10-17 11:01:38,147 INFO: Running 'prebuild' commands in build/org.ca.squawker2026-10-17 11:01:38,147 DEBUG: Directory: build/org.ca.squawker2026-10-17 11:01:38,147 DEBUG: > bash -e -u -o pipefail -x -c -- version=$(sed -n -E "s/.*flutter-version:\ '(.*)'/\1/p" .github/workflows/release.yml); pushd /home/vagrant/build/srclib/flutter; git checkout -f $version; popd; export PUB_CACHE=$(pwd)/.pub-cache; /home/vagrant/build/srclib/flutter/bin/flutter config --no-analytics; /home/vagrant/build/srclib/flutter/bin/flutter packages pub get --enforce-lockfile; sed -i -e '/googleapis/d' .pub-cache/hosted/pub.dev/webview_cookie_manager_plus-*/android/build.gradle+ '[' -z '' ']'+ return+ case $- in+ return++ sed -n -E 's/.*flutter-version:\ '\''(.*)'\''/\1/p' .github/workflows/release.yml+ version=3.47.5+ pushd /home/vagrant/build/srclib/flutter~/build/srclib/flutter ~/build/org.ca.squawker+ git checkout -f 3.47.5Note: switching to '3.47.5'.You are in 'detached HEAD' state. You can look around, make experimentalchanges and commit them, and you can discard any commits you make in thisstate without impacting any branches by switching back to a branch.If you want to create a new branch to retain commits you create, you maydo so (now or later) by using -c with the switch command. Example:git switch -c <new-branch-name>Or undo this operation with:git switch -Turn off this advice by setting config variable advice.detachedHead to falseHEAD is now at 6a19cca5647 Update changelog for 3.47.5 (#192925)+ popd~/build/org.ca.squawker++ pwd+ export PUB_CACHE=/home/vagrant/build/org.ca.squawker/.pub-cache+ PUB_CACHE=/home/vagrant/build/org.ca.squawker/.pub-cache+ /home/vagrant/build/srclib/flutter/bin/flutter config --no-analyticsDownloading Linux x64 Dart SDK from Flutter engine af7e796e161ae0bb1ff0758c71a7105418bd9ded...% Total % Received % Xferd Average Speed Time Time Time CurrentDload Upload Total Spent Left Speed0 0 0 0 0 0 0 0 --:--:-- --:--:-- --:--:-- 0
0 0 0 0 0 0 0 0 --:--:-- --:--:-- --:--:-- 0
41 227M 41 94.1M 0 0 67.0M 0 0:00:03 0:00:01 0:00:02 67.0M
100 227M 100 227M 0 0 106M 0 0:00:02 0:00:02 --:--:-- 106MBuilding flutter tool...Resolving dependencies...Downloading packages...Got dependencies.Analytics reporting disabled.You may need to restart any open editors for them to read new settings.+ /home/vagrant/build/srclib/flutter/bin/flutter packages pub get --enforce-lockfile[1/10] Material Fonts 146ms[2/10] Gradle Wrapper 9ms[3/10] Flutter SDK├─ [1/5] sky_engine 41ms├─ [2/5] flutter_gpu 5ms├─ [3/5] flutter_patched_sdk 95ms├─ [4/5] flutter_patched_sdk_product 84ms└─ [5/5] linux-x64 585ms[10/10] linux-x64/font-subset 97msResolving dependencies...Downloading packages...asp 1.3.0 (2.0.3 available)better_player_plus 1.4.1 (2.0.0 available)circular_buffer 0.12.0 (0.13.0 available)cli_util 0.4.2 (0.6.0 available)cross_file 0.3.5+5 (0.4.0 available)csv 6.0.0 (8.0.0 available)cupertino_icons 1.0.9 (2.0.0 available)dart_console 4.1.4 (5.1.0 available)dart_pubspec_licenses 3.0.12 (3.2.0 available)dart_style 3.1.13 (3.1.14 available)dbus 0.7.15 (0.8.0 available)dcli 7.1.1 (10.3.0 available)dcli_common 7.2.0 (10.3.0 available)dcli_core 7.2.0 (10.3.0 available)dcli_terminal 7.2.0 (10.3.0 available)equatable 2.1.0 (3.0.0 available)flex_color_scheme 8.4.0 (9.0.0 available)flex_seed_scheme 4.0.1 (5.0.1 available)flutter_launcher_icons 0.13.1 (0.14.4 available)flutter_lints 3.0.2 (6.0.0 available)flutter_local_notifications 19.5.0 (22.3.2 available)flutter_local_notifications_linux 6.0.0 (8.0.2 available)flutter_local_notifications_platform_interface 9.1.0 (12.2.0 available)flutter_local_notifications_windows 1.0.3 (3.1.1 available)font_awesome_flutter 10.12.0 (11.0.0 available)freezed_annotation 2.4.4 (3.1.0 available)idb_shim 2.10.0+1 (2.10.1+1 available)! intl 0.18.1 (overridden) (0.20.3 available)intl_utils 2.8.17 (discontinued)lints 3.0.0 (6.1.0 available)material_color_utilities 0.13.0 (0.13.1 available)native_synchronization_temp 0.7.1 (0.8.0 available)permission_handler 12.0.3 (13.0.2 available)permission_handler_android 13.0.1 (14.1.0 available)pref 2.8.0 (3.0.0 available)pubspec_manager 2.0.1 (4.1.0 available)shared_preferences_android 2.4.28 (2.5.0 available)shared_preferences_foundation 2.5.7 (2.6.0 available)sum_types 0.3.5 (0.4.0 available)test_api 0.7.12 (0.7.15 available)timezone 0.10.1 (0.11.2 available)vm_service 15.3.0 (15.4.0 available)wakelock_plus 1.8.0 (1.8.1 available)! win32 6.4.0 (overridden)xml 6.6.1 (7.1.0 available)Got dependencies!1 package is discontinued.43 packages have newer versions incompatible with dependency constraints.Try `flutter pub outdated` for more information.+ sed -i -e /googleapis/d .pub-cache/hosted/pub.dev/webview_cookie_manager_plus-2.0.17/android/build.gradle2026-10-17 11:02:11,438 INFO: Scanning source for common problems...2026-10-17 11:02:11,440 DEBUG: scanner is configured to use signature data from: 'suss'2026-10-17 11:02:11,440 DEBUG: downloading 'https://fdroid.gitlab.io/fdroid-suss/suss.json'2026-10-17 11:02:11,940 DEBUG: write 'suss.json' to cache2026-10-17 11:02:11,941 DEBUG: next suss.json cache update due in 23:59:59.9989742026-10-17 11:02:11,961 INFO: Removing binary at .pub-cache/hosted/pub.dev/analyzer-10.1.0/example/ddd06.exe2026-10-17 11:02:11,984 INFO: Removing unknown maven repo 'artifactRepoUrl)' at .pub-cache/hosted/pub.dev/url_launcher_android-6.3.33/example/android/build.gradle.kts2026-10-17 11:02:11,999 INFO: Removing binary at .pub-cache/hosted/pub.dev/flutter_local_notifications-19.5.0/example/windows/runner/RCb040602026-10-17 11:02:11,999 INFO: Removing binary at .pub-cache/hosted/pub.dev/flutter_local_notifications-19.5.0/example/windows/runner/RCa040602026-10-17 11:02:12,005 INFO: Removing dependency file without lock at .pub-cache/hosted/pub.dev/sqlite3-3.7.1/example/custom_wasm_build/Cargo.toml2026-10-17 11:02:12,021 INFO: Removing unknown maven repo 'artifactRepoUrl)' at .pub-cache/hosted/pub.dev/flutter_plugin_android_lifecycle-2.0.35/example/android/build.gradle.kts2026-10-17 11:02:12,032 INFO: Removing unknown maven repo 'artifactRepoUrl)' at .pub-cache/hosted/pub.dev/url_launcher-6.3.3/example/android/build.gradle.kts2026-10-17 11:02:12,061 INFO: Removing gradle-wrapper.jar at .pub-cache/hosted/pub.dev/jni-1.1.0/java/gradle/wrapper/gradle-wrapper.jar2026-10-17 11:02:12,092 INFO: Removing WebAssembly binary file at .pub-cache/hosted/pub.dev/provider-6.1.5+1/extension/devtools/build/canvaskit/skwasm.wasm2026-10-17 11:02:12,093 INFO: Removing WebAssembly binary file at .pub-cache/hosted/pub.dev/provider-6.1.5+1/extension/devtools/build/canvaskit/canvaskit.wasm2026-10-17 11:02:12,093 INFO: Removing WebAssembly binary file at .pub-cache/hosted/pub.dev/provider-6.1.5+1/extension/devtools/build/canvaskit/chromium/canvaskit.wasm2026-10-17 11:02:12,094 INFO: Removing binary at .pub-cache/hosted/pub.dev/provider-6.1.5+1/extension/devtools/build/assets/AssetManifest.bin2026-10-17 11:02:12,096 WARNING: Found executable binary, possibly code at .pub-cache/hosted/pub.dev/provider-6.1.5+1/extension/devtools/build/assets/packages/devtools_app_shared/fonts/Roboto/Roboto-Thin.ttf2026-10-17 11:02:12,096 WARNING: Found executable binary, possibly code at .pub-cache/hosted/pub.dev/provider-6.1.5+1/extension/devtools/build/assets/packages/devtools_app_shared/fonts/Roboto/Roboto-Bold.ttf2026-10-17 11:02:12,097 WARNING: Found executable binary, possibly code at .pub-cache/hosted/pub.dev/provider-6.1.5+1/extension/devtools/build/assets/packages/devtools_app_shared/fonts/Roboto/Roboto-Light.ttf2026-10-17 11:02:12,097 WARNING: Found executable binary, possibly code at .pub-cache/hosted/pub.dev/provider-6.1.5+1/extension/devtools/build/assets/packages/devtools_app_shared/fonts/Roboto/Roboto-Medium.ttf2026-10-17 11:02:12,097 WARNING: Found executable binary, possibly code at .pub-cache/hosted/pub.dev/provider-6.1.5+1/extension/devtools/build/assets/packages/devtools_app_shared/fonts/Roboto/Roboto-Regular.ttf2026-10-17 11:02:12,097 WARNING: Found executable binary, possibly code at .pub-cache/hosted/pub.dev/provider-6.1.5+1/extension/devtools/build/assets/packages/devtools_app_shared/fonts/Roboto/Roboto-Black.ttf2026-10-17 11:02:12,104 INFO: Removing unknown maven repo 'artifactRepoUrl)' at .pub-cache/hosted/pub.dev/path_provider_android-2.3.1/example/android/build.gradle.kts2026-10-17 11:02:12,116 INFO: Removing binary at .pub-cache/hosted/pub.dev/timezone-0.10.1/test/data/US/Eastern2026-10-17 11:02:12,127 INFO: Removing unknown maven repo 'artifactRepoUrl)' at .pub-cache/hosted/pub.dev/webview_flutter_android-4.14.1/example/android/build.gradle.kts2026-10-17 11:02:12,170 INFO: Removing unknown maven repo 'artifactRepoUrl)' at .pub-cache/hosted/pub.dev/shared_preferences-2.5.6/example/android/build.gradle.kts2026-10-17 11:02:12,171 INFO: Removing WebAssembly binary file at .pub-cache/hosted/pub.dev/shared_preferences-2.5.6/extension/devtools/build/canvaskit/skwasm.wasm2026-10-17 11:02:12,171 INFO: Removing WebAssembly binary file at .pub-cache/hosted/pub.dev/shared_preferences-2.5.6/extension/devtools/build/canvaskit/canvaskit.wasm2026-10-17 11:02:12,172 INFO: Removing WebAssembly binary file at .pub-cache/hosted/pub.dev/shared_preferences-2.5.6/extension/devtools/build/canvaskit/wimp.wasm2026-10-17 11:02:12,172 INFO: Removing WebAssembly binary file at .pub-cache/hosted/pub.dev/shared_preferences-2.5.6/extension/devtools/build/canvaskit/skwasm_heavy.wasm2026-10-17 11:02:12,173 INFO: Removing WebAssembly binary file at .pub-cache/hosted/pub.dev/shared_preferences-2.5.6/extension/devtools/build/canvaskit/webparagraph/canvaskit.wasm2026-10-17 11:02:12,173 INFO: Removing WebAssembly binary file at .pub-cache/hosted/pub.dev/shared_preferences-2.5.6/extension/devtools/build/canvaskit/chromium/canvaskit.wasm2026-10-17 11:02:12,174 INFO: Removing binary at .pub-cache/hosted/pub.dev/shared_preferences-2.5.6/extension/devtools/build/assets/AssetManifest.bin2026-10-17 11:02:12,174 WARNING: Found executable binary, possibly code at .pub-cache/hosted/pub.dev/shared_preferences-2.5.6/extension/devtools/build/assets/packages/devtools_app_shared/fonts/Roboto/Roboto-Thin.ttf2026-10-17 11:02:12,174 WARNING: Found executable binary, possibly code at .pub-cache/hosted/pub.dev/shared_preferences-2.5.6/extension/devtools/build/assets/packages/devtools_app_shared/fonts/Roboto/Roboto-Bold.ttf2026-10-17 11:02:12,174 WARNING: Found executable binary, possibly code at .pub-cache/hosted/pub.dev/shared_preferences-2.5.6/extension/devtools/build/assets/packages/devtools_app_shared/fonts/Roboto/Roboto-Light.ttf2026-10-17 11:02:12,175 WARNING: Found executable binary, possibly code at .pub-cache/hosted/pub.dev/shared_preferences-2.5.6/extension/devtools/build/assets/packages/devtools_app_shared/fonts/Roboto/Roboto-Medium.ttf2026-10-17 11:02:12,175 WARNING: Found executable binary, possibly code at .pub-cache/hosted/pub.dev/shared_preferences-2.5.6/extension/devtools/build/assets/packages/devtools_app_shared/fonts/Roboto/Roboto-Regular.ttf2026-10-17 11:02:12,175 WARNING: Found executable binary, possibly code at .pub-cache/hosted/pub.dev/shared_preferences-2.5.6/extension/devtools/build/assets/packages/devtools_app_shared/fonts/Roboto/Roboto-Black.ttf2026-10-17 11:02:12,193 INFO: Removing ZIP file archive at .pub-cache/hosted/pub.dev/archive-3.6.1/test/tests/res/test.zip2026-10-17 11:02:12,194 INFO: Removing gzip file archive at .pub-cache/hosted/pub.dev/archive-3.6.1/test/tests/res/a.txt.gz2026-10-17 11:02:12,194 INFO: Removing gzip file archive at .pub-cache/hosted/pub.dev/archive-3.6.1/test/tests/res/test2.tar.gz2026-10-17 11:02:12,194 INFO: Removing gzip file archive at .pub-cache/hosted/pub.dev/archive-3.6.1/test/tests/res/cat.jpg.gz2026-10-17 11:02:12,194 INFO: Removing ZIP file archive at .pub-cache/hosted/pub.dev/archive-3.6.1/test/tests/res/test_100k_files.zip2026-10-17 11:02:12,194 INFO: Removing ZIP file archive at .pub-cache/hosted/pub.dev/archive-3.6.1/test/tests/res/test2.zip2026-10-17 11:02:12,195 INFO: Removing ZIP file archive at .pub-cache/hosted/pub.dev/archive-3.6.1/test/tests/res/zip/symlink.zip2026-10-17 11:02:12,195 INFO: Removing ZIP file archive at .pub-cache/hosted/pub.dev/archive-3.6.1/test/tests/res/zip/password_zipcrypto.zip2026-10-17 11:02:12,195 INFO: Removing ZIP file archive at .pub-cache/hosted/pub.dev/archive-3.6.1/test/tests/res/zip/crc32-not-streamed.zip2026-10-17 11:02:12,195 INFO: Removing ZIP file archive at .pub-cache/hosted/pub.dev/archive-3.6.1/test/tests/res/zip/dd.zip2026-10-17 11:02:12,195 INFO: Removing ZIP file archive at .pub-cache/hosted/pub.dev/archive-3.6.1/test/tests/res/zip/winxp.zip2026-10-17 11:02:12,195 INFO: Removing ZIP file archive at .pub-cache/hosted/pub.dev/archive-3.6.1/test/tests/res/zip/android-javadoc.zip2026-10-17 11:02:12,195 INFO: Removing ZIP file archive at .pub-cache/hosted/pub.dev/archive-3.6.1/test/tests/res/zip/test.zip2026-10-17 11:02:12,195 INFO: Removing ZIP file archive at .pub-cache/hosted/pub.dev/archive-3.6.1/test/tests/res/zip/test-trailing-junk.zip2026-10-17 11:02:12,196 INFO: Removing ZIP file archive at .pub-cache/hosted/pub.dev/archive-3.6.1/test/tests/res/zip/aes256.zip2026-10-17 11:02:12,196 INFO: Removing ZIP file archive at .pub-cache/hosted/pub.dev/archive-3.6.1/test/tests/res/zip/utf.zip2026-10-17 11:02:12,196 INFO: Removing ZIP file archive at .pub-cache/hosted/pub.dev/archive-3.6.1/test/tests/res/zip/zip64.zip2026-10-17 11:02:12,196 INFO: Removing ZIP file archive at .pub-cache/hosted/pub.dev/archive-3.6.1/test/tests/res/zip/unix.zip2026-10-17 11:02:12,196 INFO: Removing ZIP file archive at .pub-cache/hosted/pub.dev/archive-3.6.1/test/tests/res/zip/zipCrypto.zip2026-10-17 11:02:12,196 INFO: Removing ZIP file archive at .pub-cache/hosted/pub.dev/archive-3.6.1/test/tests/res/zip/go-with-datadesc-sig.zip2026-10-17 11:02:12,196 INFO: Removing ZIP file archive at .pub-cache/hosted/pub.dev/archive-3.6.1/test/tests/res/zip/go-no-datadesc-sig.zip2026-10-17 11:02:12,196 INFO: Removing ZIP file archive at .pub-cache/hosted/pub.dev/archive-3.6.1/test/tests/res/zip/zip64_archive.zip2026-10-17 11:02:12,196 INFO: Removing ZIP file archive at .pub-cache/hosted/pub.dev/archive-3.6.1/test/tests/res/zip/readme.zip2026-10-17 11:02:12,196 INFO: Removing ZIP file archive at .pub-cache/hosted/pub.dev/archive-3.6.1/test/tests/res/zip/zip_bzip2.zip2026-10-17 11:02:12,197 INFO: Removing binary at .pub-cache/hosted/pub.dev/archive-3.6.1/test/tests/res/inflate/data.bin2026-10-17 11:02:12,197 INFO: Removing ZIP file archive at .pub-cache/hosted/pub.dev/archive-3.6.1/web/res/readme.zip2026-10-17 11:02:12,214 INFO: Removing unknown maven repo 'artifactRepoUrl)' at .pub-cache/hosted/pub.dev/webview_flutter-4.14.1/example/android/build.gradle.kts2026-10-17 11:02:12,224 INFO: Removing unknown maven repo 'artifactRepoUrl)' at .pub-cache/hosted/pub.dev/shared_preferences_android-2.4.28/example/android/build.gradle.kts2026-10-17 11:02:12,228 INFO: Removing unknown maven repo 'artifactRepoUrl)' at .pub-cache/hosted/pub.dev/path_provider-2.1.6/example/android/build.gradle.kts2026-10-17 11:02:12,259 INFO: Removing gradle-wrapper.jar at .pub-cache/git/flutter_colorpicker-e9b124896076991fa077f62bdbab3df1a26149d7/example/android/gradle/wrapper/gradle-wrapper.jar2026-10-17 11:02:12,259 INFO: Creating source tarball...2026-10-17 11:02:27,947 INFO: Running 'build' commands in build/org.ca.squawker2026-10-17 11:02:27,948 DEBUG: Directory: build/org.ca.squawker2026-10-17 11:02:27,948 DEBUG: > bash -e -u -o pipefail -x -c export PUB_CACHE=$(pwd)/.pub-cache; /home/vagrant/build/srclib/flutter/bin/flutter packages pub run flutter_oss_licenses:generate.dart; /home/vagrant/build/srclib/flutter/bin/flutter packages pub run intl_utils:generate; export cmdVerCode=$((300018523 - 2003)); echo "*** VERSION=3.8.20 VERCODE=300018523 cmdVerCode=$cmdVerCode"; /home/vagrant/build/srclib/flutter/bin/flutter build apk --dart-define=app.flavor=fdroid --release --no-tree-shake-icons --split-per-abi --target-platform=android-arm64 --build-name=3.8.20 --build-number=$cmdVerCode || /home/vagrant/build/srclib/flutter/bin/flutter build apk --dart-define=app.flavor=fdroid --release --no-tree-shake-icons --split-per-abi --target-platform=android-arm64 --build-name=3.8.20 --build-number=$cmdVerCode+ '[' -z '' ']'+ return+ case $- in+ return++ pwd+ export PUB_CACHE=/home/vagrant/build/org.ca.squawker/.pub-cache+ PUB_CACHE=/home/vagrant/build/org.ca.squawker/.pub-cache+ /home/vagrant/build/srclib/flutter/bin/flutter packages pub run flutter_oss_licenses:generate.dartPathNotFoundException: Cannot open file, path = '/home/vagrant/build/srclib/flutter/version' (OS Error: No such file or directory, errno = 2): #0 _checkForErrorResponse (dart:io/common.dart:58:9)#1 _File.open.<anonymous closure> (dart:io/file_impl.dart:438:7)<asynchronous suspension>#2 _File.readAsBytes.<anonymous closure> (dart:io/file_impl.dart:645:24)<asynchronous suspension>#3 _File.readAsString (dart:io/file_impl.dart:712:18)<asynchronous suspension>#4 Package.fromDirectory (package:dart_pubspec_licenses/src/package.dart:210:11)<asynchronous suspension>#5 Package.fromPubspecLockPackageEntry (package:dart_pubspec_licenses/src/package.dart:156:12)<asynchronous suspension>#6 LimitConcurrency.run.<anonymous closure> (package:dart_pubspec_licenses/src/limit_concurrency.dart:16:34)<asynchronous suspension>#7 _AsyncCompleter.complete (dart:async/future_impl.dart:96:3)<asynchronous suspension>#8 Future.wait.<anonymous closure> (dart:async/future.dart:567:21)<asynchronous suspension>#9 listDependencies (package:dart_pubspec_licenses/src/license_info_utils.dart:109:26)<asynchronous suspension>#10 generate (package:dart_pubspec_licenses/src/generate.dart:45:18)<asynchronous suspension>+ /home/vagrant/build/srclib/flutter/bin/flutter packages pub run intl_utils:generateINFO: No @@locale or _locale field found in intl_ar, assuming 'ar' based on the file name.INFO: No @@locale or _locale field found in intl_be, assuming 'be' based on the file name.INFO: No @@locale or _locale field found in intl_be_Latn, assuming 'be_Latn' based on the file name.INFO: No @@locale or _locale field found in intl_ca, assuming 'ca' based on the file name.INFO: No @@locale or _locale field found in intl_cs, assuming 'cs' based on the file name.INFO: No @@locale or _locale field found in intl_de, assuming 'de' based on the file name.INFO: No @@locale or _locale field found in intl_en, assuming 'en' based on the file name.INFO: No @@locale or _locale field found in intl_eo, assuming 'eo' based on the file name.INFO: No @@locale or _locale field found in intl_es, assuming 'es' based on the file name.INFO: No @@locale or _locale field found in intl_et, assuming 'et' based on the file name.INFO: No @@locale or _locale field found in intl_eu, assuming 'eu' based on the file name.INFO: No @@locale or _locale field found in intl_fr, assuming 'fr' based on the file name.INFO: No @@locale or _locale field found in intl_he, assuming 'he' based on the file name.INFO: No @@locale or _locale field found in intl_hi, assuming 'hi' based on the file name.INFO: No @@locale or _locale field found in intl_hu, assuming 'hu' based on the file name.INFO: No @@locale or _locale field found in intl_ia, assuming 'ia' based on the file name.INFO: No @@locale or _locale field found in intl_id, assuming 'id' based on the file name.INFO: No @@locale or _locale field found in intl_it, assuming 'it' based on the file name.INFO: No @@locale or _locale field found in intl_ja, assuming 'ja' based on the file name.INFO: No @@locale or _locale field found in intl_ko, assuming 'ko' based on the file name.INFO: No @@locale or _locale field found in intl_lv, assuming 'lv' based on the file name.INFO: No @@locale or _locale field found in intl_ml, assuming 'ml' based on the file name.INFO: No @@locale or _locale field found in intl_nb_NO, assuming 'nb_NO' based on the file name.INFO: No @@locale or _locale field found in intl_nl, assuming 'nl' based on the file name.INFO: No @@locale or _locale field found in intl_or, assuming 'or' based on the file name.INFO: No @@locale or _locale field found in intl_pl, assuming 'pl' based on the file name.INFO: No @@locale or _locale field found in intl_pt, assuming 'pt' based on the file name.INFO: No @@locale or _locale field found in intl_pt_BR, assuming 'pt_BR' based on the file name.INFO: No @@locale or _locale field found in intl_ro, assuming 'ro' based on the file name.INFO: No @@locale or _locale field found in intl_ru, assuming 'ru' based on the file name.INFO: No @@locale or _locale field found in intl_ta, assuming 'ta' based on the file name.INFO: No @@locale or _locale field found in intl_tr, assuming 'tr' based on the file name.INFO: No @@locale or _locale field found in intl_uk, assuming 'uk' based on the file name.INFO: No @@locale or _locale field found in intl_vi, assuming 'vi' based on the file name.INFO: No @@locale or _locale field found in intl_zh_Hans, assuming 'zh_Hans' based on the file name.INFO: No @@locale or _locale field found in intl_zh_Hant, assuming 'zh_Hant' based on the file name.+ export cmdVerCode=300016520+ cmdVerCode=300016520+ echo '*** VERSION=3.8.20 VERCODE=300018523 cmdVerCode=300016520'*** VERSION=3.8.20 VERCODE=300018523 cmdVerCode=300016520+ /home/vagrant/build/srclib/flutter/bin/flutter build apk --dart-define=app.flavor=fdroid --release --no-tree-shake-icons --split-per-abi --target-platform=android-arm64 --build-name=3.8.20 --build-number=300016520[1/1] Android SDK├─ [1/6] android-arm-profile/linux-x64 155ms├─ [2/6] android-arm-release/linux-x64 58ms├─ [3/6] android-arm64-profile/linux-x64 75ms├─ [4/6] android-arm64-release/linux-x64 49ms├─ [5/6] android-x64-profile/linux-x64 55ms└─ [6/6] android-x64-release/linux-x64 49msResolving dependencies...Downloading packages...asp 1.3.0 (2.0.3 available)better_player_plus 1.4.1 (2.0.0 available)circular_buffer 0.12.0 (0.13.0 available)cli_util 0.4.2 (0.6.0 available)cross_file 0.3.5+5 (0.4.0 available)csv 6.0.0 (8.0.0 available)cupertino_icons 1.0.9 (2.0.0 available)dart_console 4.1.4 (5.1.0 available)dart_pubspec_licenses 3.0.12 (3.2.0 available)dart_style 3.1.13 (3.1.14 available)dbus 0.7.15 (0.8.0 available)dcli 7.1.1 (10.3.0 available)dcli_common 7.2.0 (10.3.0 available)dcli_core 7.2.0 (10.3.0 available)dcli_terminal 7.2.0 (10.3.0 available)equatable 2.1.0 (3.0.0 available)flex_color_scheme 8.4.0 (9.0.0 available)flex_seed_scheme 4.0.1 (5.0.1 available)flutter_launcher_icons 0.13.1 (0.14.4 available)flutter_lints 3.0.2 (6.0.0 available)flutter_local_notifications 19.5.0 (22.3.2 available)flutter_local_notifications_linux 6.0.0 (8.0.2 available)flutter_local_notifications_platform_interface 9.1.0 (12.2.0 available)flutter_local_notifications_windows 1.0.3 (3.1.1 available)font_awesome_flutter 10.12.0 (11.0.0 available)freezed_annotation 2.4.4 (3.1.0 available)idb_shim 2.10.0+1 (2.10.1+1 available)! intl 0.18.1 (overridden) (0.20.3 available)intl_utils 2.8.17 (discontinued)lints 3.0.0 (6.1.0 available)material_color_utilities 0.13.0 (0.13.1 available)native_synchronization_temp 0.7.1 (0.8.0 available)permission_handler 12.0.3 (13.0.2 available)permission_handler_android 13.0.1 (14.1.0 available)pref 2.8.0 (3.0.0 available)pubspec_manager 2.0.1 (4.1.0 available)shared_preferences_android 2.4.28 (2.5.0 available)shared_preferences_foundation 2.5.7 (2.6.0 available)sum_types 0.3.5 (0.4.0 available)test_api 0.7.12 (0.7.15 available)timezone 0.10.1 (0.11.2 available)vm_service 15.3.0 (15.4.0 available)wakelock_plus 1.8.0 (1.8.1 available)! win32 6.4.0 (overridden)xml 6.6.1 (7.1.0 available)Got dependencies!1 package is discontinued.43 packages have newer versions incompatible with dependency constraints.Try `flutter pub outdated` for more information.Running Gradle task 'assembleRelease'...Warning: Flutter support for your project's Gradle version (8.14.4) will soon be dropped. Please upgrade your Gradle version to a version of at least 9.1.0 soon.Alternatively, use the flag "--android-skip-build-dependency-validation" to bypass this check.Potential fix: Your project's gradle version is typically defined in the gradle wrapper file. By default, this can be found at /home/vagrant/build/org.ca.squawker/android/gradle/wrapper/gradle-wrapper.properties.For more information, see https://docs.gradle.org/current/userguide/gradle_wrapper.html.Warning: Flutter support for your project's Android Gradle Plugin version (Android Gradle Plugin version 8.12.0) will soon be dropped. Please upgrade your Android Gradle Plugin version to a version of at least Android Gradle Plugin version 9.0.1 soon.Alternatively, use the flag "--android-skip-build-dependency-validation" to bypass this check.Potential fix: Your project's AGP version is typically defined in the plugins block of the `settings.gradle` file (/home/vagrant/build/org.ca.squawker/android/settings.gradle), by a plugin with the id of com.android.application.If you don't see a plugins block, your project was likely created with an older template version. In this case it is most likely defined in the top-level build.gradle file (/home/vagrant/build/org.ca.squawker/android/build.gradle) by the following line in the dependencies block of the buildscript: "classpath 'com.android.tools.build:gradle:<version>'".Warning: Flutter support for your project's Kotlin version (2.3.0) will soon be dropped. Please upgrade your Kotlin version to a version of at least 2.3.20 soon.Alternatively, use the flag "--android-skip-build-dependency-validation" to bypass this check.Potential fix: Your project's KGP version is typically defined in the plugins block of the `settings.gradle` file (/home/vagrant/build/org.ca.squawker/android/settings.gradle), by a plugin with the id of org.jetbrains.kotlin.android.If you don't see a plugins block, your project was likely created with an older template version, in which case it is most likely defined in the top-level build.gradle file (/home/vagrant/build/org.ca.squawker/android/build.gradle) by the ext.kotlin_version property.Warning: Found corrupted package.xml at /opt/android-sdk/platforms/android-10/package.xmlWarning: Found corrupted package.xml at /opt/android-sdk/platforms/android-11/package.xmlWarning: Found corrupted package.xml at /opt/android-sdk/platforms/android-12/package.xmlWarning: Found corrupted package.xml at /opt/android-sdk/platforms/android-13/package.xmlWarning: Found corrupted package.xml at /opt/android-sdk/platforms/android-10/package.xmlWarning: Found corrupted package.xml at /opt/android-sdk/platforms/android-11/package.xmlWarning: Found corrupted package.xml at /opt/android-sdk/platforms/android-12/package.xmlWarning: Found corrupted package.xml at /opt/android-sdk/platforms/android-13/package.xmlChecking the license for package NDK (Side by side) 28.2.13676358 in /opt/android-sdk/licensesLicense for package NDK (Side by side) 28.2.13676358 accepted.Preparing "Install NDK (Side by side) 28.2.13676358 v.28.2.13676358"."Install NDK (Side by side) 28.2.13676358 v.28.2.13676358" ready.Installing NDK (Side by side) 28.2.13676358 in /opt/android-sdk/ndk/28.2.13676358"Install NDK (Side by side) 28.2.13676358 v.28.2.13676358" complete."Install NDK (Side by side) 28.2.13676358 v.28.2.13676358" finished.Warning: Found corrupted package.xml at /opt/android-sdk/platforms/android-10/package.xmlWarning: Found corrupted package.xml at /opt/android-sdk/platforms/android-11/package.xmlWarning: Found corrupted package.xml at /opt/android-sdk/platforms/android-12/package.xmlWarning: Found corrupted package.xml at /opt/android-sdk/platforms/android-13/package.xmlChecking the license for package Android SDK Build-Tools 35 in /opt/android-sdk/licensesLicense for package Android SDK Build-Tools 35 accepted.Preparing "Install Android SDK Build-Tools 35 v.35.0.0"."Install Android SDK Build-Tools 35 v.35.0.0" ready.Installing Android SDK Build-Tools 35 in /opt/android-sdk/build-tools/35.0.0"Install Android SDK Build-Tools 35 v.35.0.0" complete."Install Android SDK Build-Tools 35 v.35.0.0" finished.Checking the license for package Android SDK Platform 37.0 in /opt/android-sdk/licensesLicense for package Android SDK Platform 37.0 accepted.Preparing "Install Android SDK Platform 37.0 (revision 2)"."Install Android SDK Platform 37.0 (revision 2)" ready.Installing Android SDK Platform 37.0 in /opt/android-sdk/platforms/android-37.0"Install Android SDK Platform 37.0 (revision 2)" complete."Install Android SDK Platform 37.0 (revision 2)" finished.FAILURE: Build failed with an exception.* What went wrong:Could not determine the dependencies of task ':app:l8DexDesugarLibRelease'.> Failed to find target with hash string 'android-37' in: /opt/android-sdk* Try:> Run with --stacktrace option to get the stack trace.> Run with --info or --debug option to get more log output.> Run with --scan to get full insights.> Get more help at https://help.gradle.org.BUILD FAILED in 2m 34sRunning Gradle task 'assembleRelease'... 155.3sGradle task assembleRelease failed with exit code 1+ /home/vagrant/build/srclib/flutter/bin/flutter build apk --dart-define=app.flavor=fdroid --release --no-tree-shake-icons --split-per-abi --target-platform=android-arm64 --build-name=3.8.20 --build-number=300016520Running Gradle task 'assembleRelease'...Warning: Flutter support for your project's Gradle version (8.14.4) will soon be dropped. Please upgrade your Gradle version to a version of at least 9.1.0 soon.Alternatively, use the flag "--android-skip-build-dependency-validation" to bypass this check.Potential fix: Your project's gradle version is typically defined in the gradle wrapper file. By default, this can be found at /home/vagrant/build/org.ca.squawker/android/gradle/wrapper/gradle-wrapper.properties.For more information, see https://docs.gradle.org/current/userguide/gradle_wrapper.html.Warning: Flutter support for your project's Android Gradle Plugin version (Android Gradle Plugin version 8.12.0) will soon be dropped. Please upgrade your Android Gradle Plugin version to a version of at least Android Gradle Plugin version 9.0.1 soon.Alternatively, use the flag "--android-skip-build-dependency-validation" to bypass this check.Potential fix: Your project's AGP version is typically defined in the plugins block of the `settings.gradle` file (/home/vagrant/build/org.ca.squawker/android/settings.gradle), by a plugin with the id of com.android.application.If you don't see a plugins block, your project was likely created with an older template version. In this case it is most likely defined in the top-level build.gradle file (/home/vagrant/build/org.ca.squawker/android/build.gradle) by the following line in the dependencies block of the buildscript: "classpath 'com.android.tools.build:gradle:<version>'".Warning: Flutter support for your project's Kotlin version (2.3.0) will soon be dropped. Please upgrade your Kotlin version to a version of at least 2.3.20 soon.Alternatively, use the flag "--android-skip-build-dependency-validation" to bypass this check.Potential fix: Your project's KGP version is typically defined in the plugins block of the `settings.gradle` file (/home/vagrant/build/org.ca.squawker/android/settings.gradle), by a plugin with the id of org.jetbrains.kotlin.android.If you don't see a plugins block, your project was likely created with an older template version, in which case it is most likely defined in the top-level build.gradle file (/home/vagrant/build/org.ca.squawker/android/build.gradle) by the ext.kotlin_version property.Checking the license for package Android SDK Platform 36 in /opt/android-sdk/licensesLicense for package Android SDK Platform 36 accepted.Preparing "Install Android SDK Platform 36 (revision 2)"."Install Android SDK Platform 36 (revision 2)" ready.Installing Android SDK Platform 36 in /opt/android-sdk/platforms/android-36"Install Android SDK Platform 36 (revision 2)" complete."Install Android SDK Platform 36 (revision 2)" finished.[========= ] 25%Checking the license for package Android SDK Platform 35 in /opt/android-sdk/licensesLicense for package Android SDK Platform 35 accepted.Preparing "Install Android SDK Platform 35 (revision 2)"."Install Android SDK Platform 35 (revision 2)" ready.Installing Android SDK Platform 35 in /opt/android-sdk/platforms/android-35"Install Android SDK Platform 35 (revision 2)" complete."Install Android SDK Platform 35 (revision 2)" finished.[========= ] 25%Checking the license for package Android SDK Platform 34 in /opt/android-sdk/licensesLicense for package Android SDK Platform 34 accepted.Preparing "Install Android SDK Platform 34 (revision 3)"."Install Android SDK Platform 34 (revision 3)" ready.Installing Android SDK Platform 34 in /opt/android-sdk/platforms/android-34"Install Android SDK Platform 34 (revision 3)" complete."Install Android SDK Platform 34 (revision 3)" finished.Warning: The generated ELF library contains unobfuscated DWARF debugging information.To avoid this, use --strip to remove it.[========= ] 25%Warning: Found corrupted package.xml at /opt/android-sdk/platforms/android-10/package.xmlWarning: Found corrupted package.xml at /opt/android-sdk/platforms/android-11/package.xmlWarning: Found corrupted package.xml at /opt/android-sdk/platforms/android-12/package.xmlWarning: Found corrupted package.xml at /opt/android-sdk/platforms/android-13/package.xmlChecking the license for package CMake 3.22.1 in /opt/android-sdk/licensesLicense for package CMake 3.22.1 accepted.Preparing "Install CMake 3.22.1 v.3.22.1"."Install CMake 3.22.1 v.3.22.1" ready.Installing CMake 3.22.1 in /opt/android-sdk/cmake/3.22.1"Install CMake 3.22.1 v.3.22.1" complete."Install CMake 3.22.1 v.3.22.1" finished.Warning: Found corrupted package.xml at /opt/android-sdk/platforms/android-10/package.xmlWarning: Found corrupted package.xml at /opt/android-sdk/platforms/android-11/package.xmlWarning: Found corrupted package.xml at /opt/android-sdk/platforms/android-12/package.xmlWarning: Found corrupted package.xml at /opt/android-sdk/platforms/android-13/package.xmlwarning: [options] source value 8 is obsolete and will be removed in a future releasewarning: [options] target value 8 is obsolete and will be removed in a future releasewarning: [options] To suppress warnings about obsolete options, use -Xlint:-options.3 warningsNote: /home/vagrant/build/org.ca.squawker/.pub-cache/hosted/pub.dev/webview_cookie_manager_plus-2.0.17/android/src/main/java/io/flutter/plugins/webview_cookie_manager/WebviewCookieManagerPlugin.java uses or overrides a deprecated API.Note: Recompile with -Xlint:deprecation for details.warning: [options] source value 8 is obsolete and will be removed in a future releasewarning: [options] target value 8 is obsolete and will be removed in a future releasewarning: [options] To suppress warnings about obsolete options, use -Xlint:-options.Note: /home/vagrant/build/org.ca.squawker/android/app/src/main/java/org/ca/squawker/SquawkerApplication.java uses or overrides a deprecated API.Note: Recompile with -Xlint:deprecation for details.3 warningsRunning Gradle task 'assembleRelease'... 112.4s✓ Built build/app/outputs/flutter-apk/app-arm64-v8a-release.apk (48.5MB)2026-10-17 11:07:01,491 DEBUG: Checking build/org.ca.squawker/build/app/outputs/flutter-apk/app-arm64-v8a-release.apk2026-10-17 11:07:01,494 INFO: Successfully built org.ca.squawker:300018523 from d3cc4c86cfcbe80d469eabccc2abb9c298725d3d2026-10-17 11:07:01,505 INFO: success: org.ca.squawker2026-10-17 11:07:01,505 INFO: Finished2026-10-17 11:07:01,505 INFO: 1 build succeeded