log for org.hlwd.bible_multi_the_life:20220102

Traceback (most recent call last):
  File "/home/fbuild/fdroidserver/fdroidserver/build.py", line 1127, in main
    options.onserver, options.refresh):
  File "/home/fbuild/fdroidserver/fdroidserver/build.py", line 885, in trybuild
    build_server(app, build, vcs, build_dir, output_dir, log_dir, force)
  File "/home/fbuild/fdroidserver/fdroidserver/build.py", line 268, in build_server
    str(output, 'utf-8'))
fdroidserver.exception.BuildException: Build.py failed on server for org.hlwd.bible_multi_the_life:1.17.0
==== detail begin ====
== Installed Android Tools ==

2022-01-12 22:14:16,460 DEBUG: Reading 'config.yml'
2022-01-12 22:14:16,469 INFO: Using /opt/android-sdk/build-tools/29.0.3/apksigner 
2022-01-12 22:14:16,473 INFO: Creating log directory
2022-01-12 22:14:16,473 INFO: Creating temporary directory
2022-01-12 22:14:16,473 INFO: Creating output directory
2022-01-12 22:14:16,480 DEBUG: Getting git vcs interface for https://gitlab.com/hotlittlewhitedog/BibleTheLife.git
2022-01-12 22:14:16,480 DEBUG: > git --version
git version 2.11.0
2022-01-12 22:14:16,690 INFO: Using git version 2.11.0
2022-01-12 22:14:16,691 DEBUG: Checking 1.17.0
2022-01-12 22:14:16,691 INFO: Building version 1.17.0 (20220102) of org.hlwd.bible_multi_the_life
2022-01-12 22:14:16,692 DEBUG: > sudo passwd --lock root
passwd: password expiry information changed.
2022-01-12 22:14:16,902 DEBUG: > sudo SUDO_FORCE_REMOVE=yes dpkg --purge sudo
(Reading database ... 64893 files and directories currently installed.)
Removing sudo (1.8.19p1-2.1+deb9u3) ...
Purging configuration files for sudo (1.8.19p1-2.1+deb9u3) ...
Processing triggers for systemd (232-25+deb9u13) ...
2022-01-12 22:14:20,167 INFO: Getting source for revision c70dbb4d7c07309ae29ccdb4adf85c7d224bd575
2022-01-12 22:14:20,168 DEBUG: Directory: build/org.hlwd.bible_multi_the_life
2022-01-12 22:14:20,168 DEBUG: > git rev-parse --show-toplevel
2022-01-12 22:14:20,402 DEBUG: Directory: build/org.hlwd.bible_multi_the_life
2022-01-12 22:14:20,402 DEBUG: > git submodule foreach --recursive git reset --hard
2022-01-12 22:14:20,508 DEBUG: Directory: build/org.hlwd.bible_multi_the_life
2022-01-12 22:14:20,508 DEBUG: > git reset --hard
2022-01-12 22:14:21,162 DEBUG: Directory: build/org.hlwd.bible_multi_the_life
2022-01-12 22:14:21,164 DEBUG: > git submodule foreach --recursive git clean -dffx
2022-01-12 22:14:21,279 DEBUG: Directory: build/org.hlwd.bible_multi_the_life
2022-01-12 22:14:21,279 DEBUG: > git clean -dffx
2022-01-12 22:14:21,384 DEBUG: Directory: build/org.hlwd.bible_multi_the_life
2022-01-12 22:14:21,385 DEBUG: > git -c core.askpass=/bin/true -c core.sshCommand=/bin/false -c url.https://.insteadOf=ssh:// -c url.https://u:p@bitbucket.org/.insteadOf=git@bitbucket.org: -c url.https://u:p@bitbucket.org.insteadOf=git://bitbucket.org -c url.https://u:p@bitbucket.org.insteadOf=https://bitbucket.org -c url.https://u:p@github.com/.insteadOf=git@github.com: -c url.https://u:p@github.com.insteadOf=git://github.com -c url.https://u:p@github.com.insteadOf=https://github.com -c url.https://u:p@gitlab.com/.insteadOf=git@gitlab.com: -c url.https://u:p@gitlab.com.insteadOf=git://gitlab.com -c url.https://u:p@gitlab.com.insteadOf=https://gitlab.com fetch origin
2022-01-12 22:14:22,092 DEBUG: Directory: build/org.hlwd.bible_multi_the_life
2022-01-12 22:14:22,092 DEBUG: > git -c core.askpass=/bin/true -c core.sshCommand=/bin/false -c url.https://.insteadOf=ssh:// -c url.https://u:p@bitbucket.org/.insteadOf=git@bitbucket.org: -c url.https://u:p@bitbucket.org.insteadOf=git://bitbucket.org -c url.https://u:p@bitbucket.org.insteadOf=https://bitbucket.org -c url.https://u:p@github.com/.insteadOf=git@github.com: -c url.https://u:p@github.com.insteadOf=git://github.com -c url.https://u:p@github.com.insteadOf=https://github.com -c url.https://u:p@gitlab.com/.insteadOf=git@gitlab.com: -c url.https://u:p@gitlab.com.insteadOf=git://gitlab.com -c url.https://u:p@gitlab.com.insteadOf=https://gitlab.com remote prune origin
2022-01-12 22:14:22,421 DEBUG: Directory: build/org.hlwd.bible_multi_the_life
2022-01-12 22:14:22,421 DEBUG: > git -c core.askpass=/bin/true -c core.sshCommand=/bin/false -c url.https://.insteadOf=ssh:// -c url.https://u:p@bitbucket.org/.insteadOf=git@bitbucket.org: -c url.https://u:p@bitbucket.org.insteadOf=git://bitbucket.org -c url.https://u:p@bitbucket.org.insteadOf=https://bitbucket.org -c url.https://u:p@github.com/.insteadOf=git@github.com: -c url.https://u:p@github.com.insteadOf=git://github.com -c url.https://u:p@github.com.insteadOf=https://github.com -c url.https://u:p@gitlab.com/.insteadOf=git@gitlab.com: -c url.https://u:p@gitlab.com.insteadOf=git://gitlab.com -c url.https://u:p@gitlab.com.insteadOf=https://gitlab.com fetch --prune --tags --force origin
2022-01-12 22:14:22,828 DEBUG: Directory: build/org.hlwd.bible_multi_the_life
2022-01-12 22:14:22,829 DEBUG: > git remote set-head origin --auto
2022-01-12 22:14:23,365 DEBUG: Directory: build/org.hlwd.bible_multi_the_life
2022-01-12 22:14:23,365 DEBUG: > git checkout -f c70dbb4d7c07309ae29ccdb4adf85c7d224bd575
2022-01-12 22:14:23,986 DEBUG: Directory: build/org.hlwd.bible_multi_the_life
2022-01-12 22:14:23,986 DEBUG: > git clean -dffx
2022-01-12 22:14:24,092 INFO: Collecting source libraries
2022-01-12 22:14:24,179 DEBUG: Removing debuggable flags from build/srclib/flutter
2022-01-12 22:14:24,236 INFO: Creating local.properties file at build/org.hlwd.bible_multi_the_life/local.properties
2022-01-12 22:14:24,236 DEBUG: Removing debuggable flags from build/org.hlwd.bible_multi_the_life
2022-01-12 22:14:24,246 INFO: Removing specified files
2022-01-12 22:14:24,246 INFO: Removing test
2022-01-12 22:14:24,246 INFO: Removing ios
2022-01-12 22:14:24,249 INFO: Removing macos
2022-01-12 22:14:24,251 INFO: Cleaned build.gradle of keysigning configs at build/org.hlwd.bible_multi_the_life/android/app/build.gradle
2022-01-12 22:14:24,267 INFO: Scanning source for common problems...
2022-01-12 22:14:24,273 INFO: Removing Android APK file at apk/thelife.apk
2022-01-12 22:14:24,291 INFO: Creating source tarball...
2022-01-12 22:14:33,885 INFO: Running 'build' commands in build/org.hlwd.bible_multi_the_life
2022-01-12 22:14:33,885 DEBUG: Directory: build/org.hlwd.bible_multi_the_life
2022-01-12 22:14:33,885 DEBUG: > bash -x -c /home/vagrant/build/srclib/flutter/bin/flutter config --no-analytics && /home/vagrant/build/srclib/flutter/bin/flutter build apk
+ /home/vagrant/build/srclib/flutter/bin/flutter config --no-analytics
Downloading Dart SDK from Flutter engine 890a5fca2e34db413be624fc83aeea8e61d42ce6...
  % Total    % Received % Xferd  Average Speed   Time    Time     Time  Current
                                 Dload  Upload   Total   Spent    Left  Speed

  0     0    0     0    0     0      0      0 --:--:-- --:--:-- --:--:--     0
  8  207M    8 17.1M    0     0  23.5M      0  0:00:08 --:--:--  0:00:08 23.5M
 60  207M   60  126M    0     0  73.2M      0  0:00:02  0:00:01  0:00:01 73.2M
100  207M  100  207M    0     0  80.7M      0  0:00:02  0:00:02 --:--:-- 80.7M
Building flutter tool...

  ╔════════════════════════════════════════════════════════════════════════════╗
  ║                 Welcome to Flutter! - https://flutter.dev                  ║
  ║                                                                            ║
  ║ The Flutter tool uses Google Analytics to anonymously report feature usage ║
  ║ statistics and basic crash reports. This data is used to help improve      ║
  ║ Flutter tools over time.                                                   ║
  ║                                                                            ║
  ║ Flutter tool analytics are not sent on the very first run. To disable      ║
  ║ reporting, type 'flutter config --no-analytics'. To display the current    ║
  ║ setting, type 'flutter config'. If you opt out of analytics, an opt-out    ║
  ║ event will be sent, and then no further information will be sent by the    ║
  ║ Flutter tool.                                                              ║
  ║                                                                            ║
  ║ By downloading the Flutter SDK, you agree to the Google Terms of Service.  ║
  ║ Note: The Google Privacy Policy describes how data is handled in this      ║
  ║ service.                                                                   ║
  ║                                                                            ║
  ║ Moreover, Flutter includes the Dart SDK, which may send usage metrics and  ║
  ║ crash reports to Google.                                                   ║
  ║                                                                            ║
  ║ Read about data we send with crash reports:                                ║
  ║ https://flutter.dev/docs/reference/crash-reporting                         ║
  ║                                                                            ║
  ║ See Google's privacy policy:                                               ║
  ║ https://policies.google.com/privacy                                        ║
  ╚════════════════════════════════════════════════════════════════════════════╝

Analytics reporting disabled.

You may need to restart any open editors for them to read new settings.
+ /home/vagrant/build/srclib/flutter/bin/flutter build apk
Downloading Material fonts...                                      385ms
Downloading Gradle Wrapper...                                       19ms
Downloading package sky_engine...                                  187ms
Downloading flutter_patched_sdk tools...                           391ms
Downloading flutter_patched_sdk_product tools...                   426ms
Downloading linux-x64 tools...                                   2,463ms
Downloading linux-x64/font-subset tools...                         113ms
Downloading android-arm-profile/linux-x64 tools...                 333ms
Downloading android-arm-release/linux-x64 tools...                 300ms
Downloading android-arm64-profile/linux-x64 tools...               310ms
Downloading android-arm64-release/linux-x64 tools...               280ms
Downloading android-x64-profile/linux-x64 tools...                 256ms
Downloading android-x64-release/linux-x64 tools...                 241ms
Running "flutter pub get" in org.hlwd.bible_multi_the_life...         8.0s

Building without sound null safety
For more information see https://dart.dev/null-safety/unsound-null-safety

Running Gradle task 'assembleRelease'...                        
Checking the license for package Android SDK Platform 30 in /opt/android-sdk/licenses
License for package Android SDK Platform 30 accepted.
Preparing "Install Android SDK Platform 30 (revision: 3)".
"Install Android SDK Platform 30 (revision: 3)" ready.
Installing Android SDK Platform 30 in /opt/android-sdk/platforms/android-30
"Install Android SDK Platform 30 (revision: 3)" complete.
"Install Android SDK Platform 30 (revision: 3)" finished.
Checking the license for package Android SDK Platform 31 in /opt/android-sdk/licenses
License for package Android SDK Platform 31 accepted.
Preparing "Install Android SDK Platform 31 (revision: 1)".
"Install Android SDK Platform 31 (revision: 1)" ready.
Installing Android SDK Platform 31 in /opt/android-sdk/platforms/android-31
"Install Android SDK Platform 31 (revision: 1)" complete.
"Install Android SDK Platform 31 (revision: 1)" finished.

FAILURE: Build failed with an exception.

* What went wrong:
Could not determine the dependencies of task ':app:lintVitalRelease'.
> Could not resolve all artifacts for configuration ':app:debugAndroidTestRuntimeClasspath'.
   > Could not resolve androidx.test:monitor:[1.4.0].
     Required by:
         project :app > androidx.test:runner:1.4.0
         project :app > androidx.test:runner:1.4.0 > androidx.test.services:storage:1.4.0
      > Failed to list versions for androidx.test:monitor.
         > Unable to load Maven meta-data from https://jcenter.bintray.com/androidx/test/monitor/maven-metadata.xml.
            > Could not get resource 'https://jcenter.bintray.com/androidx/test/monitor/maven-metadata.xml'.
               > Could not GET 'https://jcenter.bintray.com/androidx/test/monitor/maven-metadata.xml'. Received status code 502 from server: Bad Gateway

* Try:
Run with --stacktrace option to get the stack trace. Run with --info or --debug option to get more log output. Run with --scan to get full insights.

* Get more help at https://help.gradle.org

BUILD FAILED in 1m 21s
Running Gradle task 'assembleRelease'...                           86.7s
[!] Gradle threw an error while downloading artifacts from the network. Retrying to download...
Running Gradle task 'assembleRelease'...                        

FAILURE: Build failed with an exception.

* What went wrong:
Could not determine the dependencies of task ':app:lintVitalRelease'.
> Could not resolve all artifacts for configuration ':app:debugAndroidTestRuntimeClasspath'.
   > Could not resolve androidx.test:monitor:[1.4.0].
     Required by:
         project :app > androidx.test:runner:1.4.0
         project :app > androidx.test:runner:1.4.0 > androidx.test.services:storage:1.4.0
      > Failed to list versions for androidx.test:monitor.
         > Unable to load Maven meta-data from https://jcenter.bintray.com/androidx/test/monitor/maven-metadata.xml.
            > Could not get resource 'https://jcenter.bintray.com/androidx/test/monitor/maven-metadata.xml'.
               > Could not GET 'https://jcenter.bintray.com/androidx/test/monitor/maven-metadata.xml'. Received status code 502 from server: Bad Gateway

* Try:
Run with --stacktrace option to get the stack trace. Run with --info or --debug option to get more log output. Run with --scan to get full insights.

* Get more help at https://help.gradle.org

BUILD FAILED in 52s
Running Gradle task 'assembleRelease'...                           52.9s
[!] Gradle threw an error while downloading artifacts from the network. Retrying to download...
Gradle task assembleRelease failed with exit code 1
2022-01-12 22:17:50,545 ERROR: Could not build app org.hlwd.bible_multi_the_life: Error running build command for org.hlwd.bible_multi_the_life:1.17.0
==== detail begin ====
+ /home/vagrant/build/srclib/flutter/bin/flutter config --no-analytics
Downloading Dart SDK from Flutter engine 890a5fca2e34db413be624fc83aeea8e61d42ce6...
  % Total    % Received % Xferd  Average Speed   Time    Time     Time  Current
                                 Dload  Upload   Total   Spent    Left  Speed

  0     0    0     0    0     0      0      0 --:--:-- --:--:-- --:--:--     0
  8  207M    8 17.1M    0     0  23.5M      0  0:00:08 --:--:--  0:00:08 23.5M
 60  207M   60  126M    0     0  73.2M      0  0:00:02  0:00:01  0:00:01 73.2M
100  207M  100  207M    0     0  80.7M      0  0:00:02  0:00:02 --:--:-- 80.7M
Building flutter tool...

  ╔════════════════════════════════════════════════════════════════════════════╗
  ║                 Welcome to Flutter! - https://flutter.dev                  ║
  ║                                                                            ║
  ║ The Flutter tool uses Google Analytics to anonymously report feature usage ║
  ║ statistics and basic crash reports. This data is used to help improve      ║
  ║ Flutter tools over time.                                                   ║
  ║                                                                            ║
  ║ Flutter tool analytics are not sent on the very first run. To disable      ║
  ║ reporting, type 'flutter config --no-analytics'. To display the current    ║
  ║ setting, type 'flutter config'. If you opt out of analytics, an opt-out    ║
  ║ event will be sent, and then no further information will be sent by the    ║
  ║ Flutter tool.                                                              ║
  ║                                                                            ║
  ║ By downloading the Flutter SDK, you agree to the Google Terms of Service.  ║
  ║ Note: The Google Privacy Policy describes how data is handled in this      ║
  ║ service.                                                                   ║
  ║                                                                            ║
  ║ Moreover, Flutter includes the Dart SDK, which may send usage metrics and  ║
  ║ crash reports to Google.                                                   ║
  ║                                                                            ║
  ║ Read about data we send with crash reports:                                ║
  ║ https://flutter.dev/docs/reference/crash-reporting                         ║
  ║                                                                            ║
  ║ See Google's privacy policy:                                               ║
  ║ https://policies.google.com/privacy                                        ║
  ╚════════════════════════════════════════════════════════════════════════════╝

Analytics reporting disabled.

You may need to restart any open editors for them to read new settings.
+ /home/vagrant/build/srclib/flutter/bin/flutter build apk
Downloading Material fonts...                                      385ms
Downloading Gradle Wrapper...                                       19ms
Downloading package sky_engine...                                  187ms
Downloading flutter_patched_sdk tools...                           391ms
Downloading flutter_patched_sdk_product tools...                   426ms
Downloading linux-x64 tools...                                   2,463ms
Downloading linux-x64/font-subset tools...                         113ms
Downloading android-arm-profile/linux-x64 tools...                 333ms
Downloading android-arm-release/linux-x64 tools...                 300ms
Downloading android-arm64-profile/linux-x64 tools...               310ms
Downloading android-arm64-release/linux-x64 tools...               280ms
Downloading android-x64-profile/linux-x64 tools...                 256ms
Downloading android-x64-release/linux-x64 tools...                 241ms
Running "flutter pub get" in org.hlwd.bible_multi_the_life...         8.0s

Building without sound null safety
For more information see https://dart.dev/null-safety/unsound-null-safety

Running Gradle task 'assembleRelease'...                        
Checking the license for package Android SDK Platform 30 in /opt/android-sdk/licenses
License for package Android SDK Platform 30 accepted.
Preparing "Install Android SDK Platform 30 (revision: 3)".
"Install Android SDK Platform 30 (revision: 3)" ready.
Installing Android SDK Platform 30 in /opt/android-sdk/platforms/android-30
"Install Android SDK Platform 30 (revision: 3)" complete.
"Install Android SDK Platform 30 (revision: 3)" finished.
Checking the license for package Android SDK Platform 31 in /opt/android-sdk/licenses
License for package Android SDK Platform 31 accepted.
Preparing "Install Android SDK Platform 31 (revision: 1)".
"Install Android SDK Platform 31 (revision: 1)" ready.
Installing Android SDK Platform 31 in /opt/android-sdk/platforms/android-31
"Install Android SDK Platform 31 (revision: 1)" complete.
"Install Android SDK Platform 31 (revision: 1)" finished.

FAILURE: Build failed with an exception.

* What went wrong:
Could not determine the dependencies of task ':app:lintVitalRelease'.
> Could not resolve all artifacts for configuration ':app:debugAndroidTestRuntimeClasspath'.
   > Could not resolve androidx.test:monitor:[1.4.0].
     Required by:
         project :app > androidx.test:runner:1.4.0
         project :app > androidx.test:runner:1.4.0 > androidx.test.services:storage:1.4.0
      > Failed to list versions for androidx.test:monitor.
         > Unable to load Maven meta-data from https://jcenter.bintray.com/androidx/test/monitor/maven-metadata.xml.
            > Could not get resource 'https://jcenter.bintray.com/androidx/test/monitor/maven-metadata.xml'.
               > Could not GET 'https://jcenter.bintray.com/androidx/test/monitor/maven-metadata.xml'. Received status code 502 from server: Bad Gateway

* Try:
Run with --stacktrace option to get the stack trace. Run with --info or --debug option to get more log output. Run with --scan to get full insights.

* Get more help at https://help.gradle.org

BUILD FAILED in 1m 21s
Running Gradle task 'assembleRelease'...                           86.7s
[!] Gradle threw an error while downloading artifacts from the network. Retrying to download...
Running Gradle task 'assembleRelease'...                        

FAILURE: Build failed with an exception.

* What went wrong:
Could not determine the dependencies of task ':app:lintVitalRelease'.
> Could not resolve all artifacts for configuration ':app:debugAndroidTestRuntimeClasspath'.
   > Could not resolve androidx.test:monitor:[1.4.0].
     Required by:
         project :app > androidx.test:runner:1.4.0
         project :app > androidx.test:runner:1.4.0 > androidx.test.services:storage:1.4.0
      > Failed to list versions for androidx.test:monitor.
         > Unable to load Maven meta-data from https://jcenter.bintray.com/androidx/test/monitor/maven-metadata.xml.
            > Could not get resource 'https://jcenter.bintray.com/androidx/test/monitor/maven-metadata.xml'.
               > Could not GET 'https://jcenter.bintray.com/androidx/test/monitor/maven-metadata.xml'. Received status code 502 from server: Bad Gateway

* Try:
Run with --stacktrace option to get the stack trace. Run with --info or --debug option to get more log output. Run with --scan to get full insights.

* Get more help at https://help.gradle.org

BUILD FAILED in 52s
Running Gradle task 'assembleRelease'...                           52.9s
[!] Gradle threw an error while downloading artifacts from the network. Retrying to download...
Gradle task assembleRelease failed with exit code 1
==== detail end ====
2022-01-12 22:17:50,545 DEBUG: Error encoutered, stopping by user request.
==== detail end ====