log for org.hlwd.bible_multi_the_life:20220526

Traceback (most recent call last):
  File "/home/fbuild/fdroidserver/fdroidserver/build.py", line 1128, in main
    options.onserver, options.refresh):
  File "/home/fbuild/fdroidserver/fdroidserver/build.py", line 887, in trybuild
    build_server(app, build, vcs, build_dir, output_dir, log_dir, force)
  File "/home/fbuild/fdroidserver/fdroidserver/build.py", line 270, in build_server
    str(output, 'utf-8'))
fdroidserver.exception.BuildException: Build.py failed on server for org.hlwd.bible_multi_the_life:1.19.0
==== detail begin ====
== Installed Android Tools ==

2022-06-24 12:59:46,234 DEBUG: Reading 'config.yml'
2022-06-24 12:59:46,244 INFO: Using /opt/android-sdk/build-tools/29.0.3/apksigner 
2022-06-24 12:59:46,247 INFO: Creating log directory
2022-06-24 12:59:46,247 INFO: Creating temporary directory
2022-06-24 12:59:46,247 INFO: Creating output directory
2022-06-24 12:59:46,253 DEBUG: Getting git vcs interface for https://gitlab.com/hotlittlewhitedog/BibleTheLife.git
2022-06-24 12:59:46,253 DEBUG: > git --version
git version 2.11.0
2022-06-24 12:59:46,507 INFO: Using git version 2.11.0
2022-06-24 12:59:46,507 DEBUG: Checking 1.19.0
2022-06-24 12:59:46,508 INFO: Building version 1.19.0 (20220526) of org.hlwd.bible_multi_the_life
2022-06-24 12:59:46,508 WARNING: Android NDK version 'r21' could not be found!
2022-06-24 12:59:46,509 WARNING: Configured versions:
2022-06-24 12:59:46,509 WARNING:   r23b: /opt/android-sdk/ndk/23.1.7779620
2022-06-24 12:59:46,510 INFO: Downloading https://dl.google.com/android/repository/android-ndk-r21-linux-x86_64.zip
2022-06-24 12:59:46,522 DEBUG: Starting new HTTPS connection (1): dl.google.com
2022-06-24 12:59:46,605 DEBUG: https://dl.google.com:443 "GET /android/repository/android-ndk-r21-linux-x86_64.zip HTTP/1.1" 200 1043332542
2022-06-24 13:00:18,573 INFO: Unzipping to /opt/android-sdk/ndk
2022-06-24 13:00:44,343 INFO: Set NDK r21 (21.0.6113669) up
2022-06-24 13:00:44,348 INFO: Running 'sudo' commands in /home/vagrant
2022-06-24 13:00:44,348 DEBUG: > sudo DEBIAN_FRONTEND=noninteractive bash -x -c apt-get update || apt-get update && apt-get install -y openjdk-11-jdk-headless && update-alternatives --auto java
+ apt-get update
Hit:1 http://security.debian.org/debian-security stretch/updates InRelease
Ign:2 http://deb.debian.org/debian stretch InRelease
Hit:3 http://deb.debian.org/debian stretch-updates InRelease
Hit:4 http://deb.debian.org/debian stretch-backports-sloppy InRelease
Hit:5 http://deb.debian.org/debian stretch-backports InRelease
Hit:6 http://deb.debian.org/debian testing InRelease
Hit:7 http://deb.debian.org/debian stretch Release
Reading package lists...
+ apt-get install -y openjdk-11-jdk-headless
Reading package lists...
Building dependency tree...
Reading state information...
The following additional packages will be installed:
  libasound2 libasound2-data openjdk-11-jre-headless
Suggested packages:
  libasound2-plugins alsa-utils openjdk-11-demo openjdk-11-source libnss-mdns
  fonts-dejavu-extra fonts-ipafont-gothic fonts-ipafont-mincho
  fonts-wqy-microhei | fonts-wqy-zenhei fonts-indic
The following NEW packages will be installed:
  libasound2 libasound2-data openjdk-11-jdk-headless openjdk-11-jre-headless
0 upgraded, 4 newly installed, 0 to remove and 2 not upgraded.
Need to get 230 MB of archives.
After this operation, 374 MB of additional disk space will be used.
Get:1 http://deb.debian.org/debian stretch/main amd64 libasound2-data all 1.1.3-5 [173 kB]
Get:2 http://deb.debian.org/debian stretch/main amd64 libasound2 amd64 1.1.3-5 [497 kB]
Get:3 http://deb.debian.org/debian stretch-backports/main amd64 openjdk-11-jre-headless amd64 11.0.6+10-1~bpo9+1 [37.4 MB]
Get:4 http://deb.debian.org/debian stretch-backports/main amd64 openjdk-11-jdk-headless amd64 11.0.6+10-1~bpo9+1 [192 MB]
Fetched 230 MB in 3s (73.8 MB/s)
Selecting previously unselected package libasound2-data.
(Reading database ... 65038 files and directories currently installed.)
Preparing to unpack .../libasound2-data_1.1.3-5_all.deb ...
Unpacking libasound2-data (1.1.3-5) ...
Selecting previously unselected package libasound2:amd64.
Preparing to unpack .../libasound2_1.1.3-5_amd64.deb ...
Unpacking libasound2:amd64 (1.1.3-5) ...
Selecting previously unselected package openjdk-11-jre-headless:amd64.
Preparing to unpack .../openjdk-11-jre-headless_11.0.6+10-1~bpo9+1_amd64.deb ...
Unpacking openjdk-11-jre-headless:amd64 (11.0.6+10-1~bpo9+1) ...
Selecting previously unselected package openjdk-11-jdk-headless:amd64.
Preparing to unpack .../openjdk-11-jdk-headless_11.0.6+10-1~bpo9+1_amd64.deb ...
Unpacking openjdk-11-jdk-headless:amd64 (11.0.6+10-1~bpo9+1) ...
Setting up libasound2-data (1.1.3-5) ...
Setting up libasound2:amd64 (1.1.3-5) ...
Processing triggers for libc-bin (2.24-11+deb9u4) ...
Setting up openjdk-11-jre-headless:amd64 (11.0.6+10-1~bpo9+1) ...
Setting up openjdk-11-jdk-headless:amd64 (11.0.6+10-1~bpo9+1) ...
update-alternatives: using /usr/lib/jvm/java-11-openjdk-amd64/bin/jdeprscan to provide /usr/bin/jdeprscan (jdeprscan) in auto mode
update-alternatives: using /usr/lib/jvm/java-11-openjdk-amd64/bin/jimage to provide /usr/bin/jimage (jimage) in auto mode
update-alternatives: using /usr/lib/jvm/java-11-openjdk-amd64/bin/jlink to provide /usr/bin/jlink (jlink) in auto mode
update-alternatives: using /usr/lib/jvm/java-11-openjdk-amd64/bin/jmod to provide /usr/bin/jmod (jmod) in auto mode
update-alternatives: using /usr/lib/jvm/java-11-openjdk-amd64/bin/jshell to provide /usr/bin/jshell (jshell) in auto mode
update-alternatives: using /usr/lib/jvm/java-11-openjdk-amd64/bin/jaotc to provide /usr/bin/jaotc (jaotc) in auto mode
update-alternatives: using /usr/lib/jvm/java-11-openjdk-amd64/bin/jhsdb to provide /usr/bin/jhsdb (jhsdb) in auto mode
+ update-alternatives --auto java
update-alternatives: using /usr/lib/jvm/java-11-openjdk-amd64/bin/java to provide /usr/bin/java (java) in auto mode
2022-06-24 13:01:39,890 DEBUG: > sudo passwd --lock root
passwd: password expiry information changed.
2022-06-24 13:01:40,115 DEBUG: > sudo SUDO_FORCE_REMOVE=yes dpkg --purge sudo
(Reading database ... 65695 files and directories currently installed.)
Removing sudo (1.8.19p1-2.1+deb9u3) ...
Purging configuration files for sudo (1.8.19p1-2.1+deb9u3) ...
Processing triggers for systemd (232-25+deb9u13) ...
2022-06-24 13:01:45,231 INFO: Getting source for revision f5d34f062e023a4526dc7bf8640e901f46f74ca1
2022-06-24 13:01:45,232 DEBUG: Directory: build/org.hlwd.bible_multi_the_life
2022-06-24 13:01:45,232 DEBUG: > git rev-parse --show-toplevel
2022-06-24 13:01:48,038 DEBUG: Directory: build/org.hlwd.bible_multi_the_life
2022-06-24 13:01:48,039 DEBUG: > git submodule foreach --recursive git reset --hard
2022-06-24 13:01:52,893 DEBUG: Directory: build/org.hlwd.bible_multi_the_life
2022-06-24 13:01:52,894 DEBUG: > git reset --hard
2022-06-24 13:01:53,543 DEBUG: Directory: build/org.hlwd.bible_multi_the_life
2022-06-24 13:01:53,544 DEBUG: > git submodule foreach --recursive git clean -dffx
2022-06-24 13:01:53,653 DEBUG: Directory: build/org.hlwd.bible_multi_the_life
2022-06-24 13:01:53,654 DEBUG: > git clean -dffx
2022-06-24 13:01:53,852 DEBUG: Directory: build/org.hlwd.bible_multi_the_life
2022-06-24 13:01:53,853 DEBUG: > git -c core.askpass=/bin/true -c core.sshCommand=/bin/false -c url.https://.insteadOf=ssh:// -c url.https://u:p@bitbucket.org/.insteadOf=git@bitbucket.org: -c url.https://u:p@bitbucket.org.insteadOf=git://bitbucket.org -c url.https://u:p@bitbucket.org.insteadOf=https://bitbucket.org -c url.https://u:p@github.com/.insteadOf=git@github.com: -c url.https://u:p@github.com.insteadOf=git://github.com -c url.https://u:p@github.com.insteadOf=https://github.com -c url.https://u:p@gitlab.com/.insteadOf=git@gitlab.com: -c url.https://u:p@gitlab.com.insteadOf=git://gitlab.com -c url.https://u:p@gitlab.com.insteadOf=https://gitlab.com fetch origin
2022-06-24 13:01:59,124 DEBUG: Directory: build/org.hlwd.bible_multi_the_life
2022-06-24 13:01:59,125 DEBUG: > git -c core.askpass=/bin/true -c core.sshCommand=/bin/false -c url.https://.insteadOf=ssh:// -c url.https://u:p@bitbucket.org/.insteadOf=git@bitbucket.org: -c url.https://u:p@bitbucket.org.insteadOf=git://bitbucket.org -c url.https://u:p@bitbucket.org.insteadOf=https://bitbucket.org -c url.https://u:p@github.com/.insteadOf=git@github.com: -c url.https://u:p@github.com.insteadOf=git://github.com -c url.https://u:p@github.com.insteadOf=https://github.com -c url.https://u:p@gitlab.com/.insteadOf=git@gitlab.com: -c url.https://u:p@gitlab.com.insteadOf=git://gitlab.com -c url.https://u:p@gitlab.com.insteadOf=https://gitlab.com remote prune origin
2022-06-24 13:01:59,532 DEBUG: Directory: build/org.hlwd.bible_multi_the_life
2022-06-24 13:01:59,533 DEBUG: > git -c core.askpass=/bin/true -c core.sshCommand=/bin/false -c url.https://.insteadOf=ssh:// -c url.https://u:p@bitbucket.org/.insteadOf=git@bitbucket.org: -c url.https://u:p@bitbucket.org.insteadOf=git://bitbucket.org -c url.https://u:p@bitbucket.org.insteadOf=https://bitbucket.org -c url.https://u:p@github.com/.insteadOf=git@github.com: -c url.https://u:p@github.com.insteadOf=git://github.com -c url.https://u:p@github.com.insteadOf=https://github.com -c url.https://u:p@gitlab.com/.insteadOf=git@gitlab.com: -c url.https://u:p@gitlab.com.insteadOf=git://gitlab.com -c url.https://u:p@gitlab.com.insteadOf=https://gitlab.com fetch --prune --tags --force origin
2022-06-24 13:01:59,950 DEBUG: Directory: build/org.hlwd.bible_multi_the_life
2022-06-24 13:01:59,950 DEBUG: > git remote set-head origin --auto
2022-06-24 13:02:00,438 DEBUG: Directory: build/org.hlwd.bible_multi_the_life
2022-06-24 13:02:00,439 DEBUG: > git checkout -f f5d34f062e023a4526dc7bf8640e901f46f74ca1
2022-06-24 13:02:00,874 DEBUG: Directory: build/org.hlwd.bible_multi_the_life
2022-06-24 13:02:00,875 DEBUG: > git clean -dffx
2022-06-24 13:02:00,981 INFO: Collecting source libraries
2022-06-24 13:02:01,073 DEBUG: Removing debuggable flags from build/srclib/flutter
2022-06-24 13:02:01,133 INFO: Creating local.properties file at build/org.hlwd.bible_multi_the_life/local.properties
2022-06-24 13:02:01,133 DEBUG: Removing debuggable flags from build/org.hlwd.bible_multi_the_life
2022-06-24 13:02:01,143 INFO: Removing specified files
2022-06-24 13:02:01,143 INFO: Removing apk
2022-06-24 13:02:01,149 INFO: Removing snap
2022-06-24 13:02:01,149 INFO: Removing macos
2022-06-24 13:02:01,151 INFO: Removing ios
2022-06-24 13:02:01,153 INFO: Removing linux
2022-06-24 13:02:01,155 INFO: Cleaned build.gradle of keysigning configs at build/org.hlwd.bible_multi_the_life/android/app/build.gradle
2022-06-24 13:02:01,171 INFO: Scanning source for common problems...
2022-06-24 13:02:01,191 INFO: Creating source tarball...
2022-06-24 13:02:10,873 INFO: Running 'build' commands in build/org.hlwd.bible_multi_the_life
2022-06-24 13:02:10,874 DEBUG: Directory: build/org.hlwd.bible_multi_the_life
2022-06-24 13:02:10,874 DEBUG: > bash -x -c /home/vagrant/build/srclib/flutter/bin/flutter config --no-analytics && /home/vagrant/build/srclib/flutter/bin/flutter build apk
+ /home/vagrant/build/srclib/flutter/bin/flutter config --no-analytics
Downloading Linux x64 Dart SDK from Flutter engine f15f824b57476e369b5e656f53d4c431c5b04b9a...
  % Total    % Received % Xferd  Average Speed   Time    Time     Time  Current
                                 Dload  Upload   Total   Spent    Left  Speed

  0     0    0     0    0     0      0      0 --:--:-- --:--:-- --:--:--     0
  1  208M    1 4112k    0     0  4311k      0  0:00:49 --:--:--  0:00:49 4310k
 42  208M   42 88.0M    0     0  51.0M      0  0:00:04  0:00:01  0:00:03 51.0M
 94  208M   94  196M    0     0  71.9M      0  0:00:02  0:00:02 --:--:-- 71.9M
100  208M  100  208M    0     0  73.3M      0  0:00:02  0:00:02 --:--:-- 73.3M
Building flutter tool...

  ╔════════════════════════════════════════════════════════════════════════════╗
  ║                 Welcome to Flutter! - https://flutter.dev                  ║
  ║                                                                            ║
  ║ The Flutter tool uses Google Analytics to anonymously report feature usage ║
  ║ statistics and basic crash reports. This data is used to help improve      ║
  ║ Flutter tools over time.                                                   ║
  ║                                                                            ║
  ║ Flutter tool analytics are not sent on the very first run. To disable      ║
  ║ reporting, type 'flutter config --no-analytics'. To display the current    ║
  ║ setting, type 'flutter config'. If you opt out of analytics, an opt-out    ║
  ║ event will be sent, and then no further information will be sent by the    ║
  ║ Flutter tool.                                                              ║
  ║                                                                            ║
  ║ By downloading the Flutter SDK, you agree to the Google Terms of Service.  ║
  ║ Note: The Google Privacy Policy describes how data is handled in this      ║
  ║ service.                                                                   ║
  ║                                                                            ║
  ║ Moreover, Flutter includes the Dart SDK, which may send usage metrics and  ║
  ║ crash reports to Google.                                                   ║
  ║                                                                            ║
  ║ Read about data we send with crash reports:                                ║
  ║ https://flutter.dev/docs/reference/crash-reporting                         ║
  ║                                                                            ║
  ║ See Google's privacy policy:                                               ║
  ║ https://policies.google.com/privacy                                        ║
  ╚════════════════════════════════════════════════════════════════════════════╝

Analytics reporting disabled.

You may need to restart any open editors for them to read new settings.
+ /home/vagrant/build/srclib/flutter/bin/flutter build apk
Downloading Material fonts...                                      447ms
Downloading Gradle Wrapper...                                       19ms
Downloading package sky_engine...                                  242ms
Downloading flutter_patched_sdk tools...                           528ms
Downloading flutter_patched_sdk_product tools...                   402ms
Downloading linux-x64 tools...                                   2,025ms
Downloading linux-x64/font-subset tools...                         224ms
Downloading android-arm-profile/linux-x64 tools...                 210ms
Downloading android-arm-release/linux-x64 tools...                 201ms
Downloading android-arm64-profile/linux-x64 tools...               217ms
Downloading android-arm64-release/linux-x64 tools...               210ms
Downloading android-x64-profile/linux-x64 tools...                 216ms
Downloading android-x64-release/linux-x64 tools...                 173ms
Running "flutter pub get" in org.hlwd.bible_multi_the_life...         7.4s

Building without sound null safety
For more information see https://dart.dev/null-safety/unsound-null-safety

Running Gradle task 'assembleRelease'...                        
Checking the license for package Android SDK Platform 31 in /opt/android-sdk/licenses
License for package Android SDK Platform 31 accepted.
Preparing "Install Android SDK Platform 31 (revision: 1)".
"Install Android SDK Platform 31 (revision: 1)" ready.
Installing Android SDK Platform 31 in /opt/android-sdk/platforms/android-31
"Install Android SDK Platform 31 (revision: 1)" complete.
"Install Android SDK Platform 31 (revision: 1)" finished.

FAILURE: Build failed with an exception.

* What went wrong:
Execution failed for task ':app:stripReleaseDebugSymbols'.
> No toolchains found in the NDK toolchains folder for ABI with prefix: arm-linux-androideabi

* Try:
Run with --stacktrace option to get the stack trace. Run with --info or --debug option to get more log output. Run with --scan to get full insights.

* Get more help at https://help.gradle.org

BUILD FAILED in 2m 23s
Running Gradle task 'assembleRelease'...                          143.9s
Gradle task assembleRelease failed with exit code 1
2022-06-24 13:05:19,349 ERROR: Could not build app org.hlwd.bible_multi_the_life: Error running build command for org.hlwd.bible_multi_the_life:1.19.0
==== detail begin ====
+ /home/vagrant/build/srclib/flutter/bin/flutter config --no-analytics
Downloading Linux x64 Dart SDK from Flutter engine f15f824b57476e369b5e656f53d4c431c5b04b9a...
  % Total    % Received % Xferd  Average Speed   Time    Time     Time  Current
                                 Dload  Upload   Total   Spent    Left  Speed

  0     0    0     0    0     0      0      0 --:--:-- --:--:-- --:--:--     0
  1  208M    1 4112k    0     0  4311k      0  0:00:49 --:--:--  0:00:49 4310k
 42  208M   42 88.0M    0     0  51.0M      0  0:00:04  0:00:01  0:00:03 51.0M
 94  208M   94  196M    0     0  71.9M      0  0:00:02  0:00:02 --:--:-- 71.9M
100  208M  100  208M    0     0  73.3M      0  0:00:02  0:00:02 --:--:-- 73.3M
Building flutter tool...

  ╔════════════════════════════════════════════════════════════════════════════╗
  ║                 Welcome to Flutter! - https://flutter.dev                  ║
  ║                                                                            ║
  ║ The Flutter tool uses Google Analytics to anonymously report feature usage ║
  ║ statistics and basic crash reports. This data is used to help improve      ║
  ║ Flutter tools over time.                                                   ║
  ║                                                                            ║
  ║ Flutter tool analytics are not sent on the very first run. To disable      ║
  ║ reporting, type 'flutter config --no-analytics'. To display the current    ║
  ║ setting, type 'flutter config'. If you opt out of analytics, an opt-out    ║
  ║ event will be sent, and then no further information will be sent by the    ║
  ║ Flutter tool.                                                              ║
  ║                                                                            ║
  ║ By downloading the Flutter SDK, you agree to the Google Terms of Service.  ║
  ║ Note: The Google Privacy Policy describes how data is handled in this      ║
  ║ service.                                                                   ║
  ║                                                                            ║
  ║ Moreover, Flutter includes the Dart SDK, which may send usage metrics and  ║
  ║ crash reports to Google.                                                   ║
  ║                                                                            ║
  ║ Read about data we send with crash reports:                                ║
  ║ https://flutter.dev/docs/reference/crash-reporting                         ║
  ║                                                                            ║
  ║ See Google's privacy policy:                                               ║
  ║ https://policies.google.com/privacy                                        ║
  ╚════════════════════════════════════════════════════════════════════════════╝

Analytics reporting disabled.

You may need to restart any open editors for them to read new settings.
+ /home/vagrant/build/srclib/flutter/bin/flutter build apk
Downloading Material fonts...                                      447ms
Downloading Gradle Wrapper...                                       19ms
Downloading package sky_engine...                                  242ms
Downloading flutter_patched_sdk tools...                           528ms
Downloading flutter_patched_sdk_product tools...                   402ms
Downloading linux-x64 tools...                                   2,025ms
Downloading linux-x64/font-subset tools...                         224ms
Downloading android-arm-profile/linux-x64 tools...                 210ms
Downloading android-arm-release/linux-x64 tools...                 201ms
Downloading android-arm64-profile/linux-x64 tools...               217ms
Downloading android-arm64-release/linux-x64 tools...               210ms
Downloading android-x64-profile/linux-x64 tools...                 216ms
Downloading android-x64-release/linux-x64 tools...                 173ms
Running "flutter pub get" in org.hlwd.bible_multi_the_life...         7.4s

Building without sound null safety
For more information see https://dart.dev/null-safety/unsound-null-safety

Running Gradle task 'assembleRelease'...                        
Checking the license for package Android SDK Platform 31 in /opt/android-sdk/licenses
License for package Android SDK Platform 31 accepted.
Preparing "Install Android SDK Platform 31 (revision: 1)".
"Install Android SDK Platform 31 (revision: 1)" ready.
Installing Android SDK Platform 31 in /opt/android-sdk/platforms/android-31
"Install Android SDK Platform 31 (revision: 1)" complete.
"Install Android SDK Platform 31 (revision: 1)" finished.

FAILURE: Build failed with an exception.

* What went wrong:
Execution failed for task ':app:stripReleaseDebugSymbols'.
> No toolchains found in the NDK toolchains folder for ABI with prefix: arm-linux-androideabi

* Try:
Run with --stacktrace option to get the stack trace. Run with --info or --debug option to get more log output. Run with --scan to get full insights.

* Get more help at https://help.gradle.org

BUILD FAILED in 2m 23s
Running Gradle task 'assembleRelease'...                          143.9s
Gradle task assembleRelease failed with exit code 1
==== detail end ====
2022-06-24 13:05:19,349 DEBUG: Error encoutered, stopping by user request.
==== detail end ====